lucene-dev mailing list archives

Site index · List index
Message view « Date » · « Thread »
Top « Date » · « Thread »
From Policeman Jenkins Server <jenk...@thetaphi.de>
Subject [JENKINS] Lucene-Solr-trunk-MacOSX (64bit/jdk1.8.0) - Build # 1648 - Failure!
Date Sun, 15 Jun 2014 06:07:40 GMT
Build: http://jenkins.thetaphi.de/job/Lucene-Solr-trunk-MacOSX/1648/
Java: 64bit/jdk1.8.0 -XX:-UseCompressedOops -XX:+UseG1GC

2 tests failed.
REGRESSION:  org.apache.solr.MinimalSchemaTest.testAllConfiguredHandlers

Error Message:
Could not initialize class java.lang.UNIXProcess

Stack Trace:
java.lang.NoClassDefFoundError: Could not initialize class java.lang.UNIXProcess
	at __randomizedtesting.SeedInfo.seed([7968162ACC5089E2:9476AD10475D8866]:0)
	at java.lang.ProcessImpl.start(ProcessImpl.java:130)
	at java.lang.ProcessBuilder.start(ProcessBuilder.java:1023)
	at java.lang.Runtime.exec(Runtime.java:620)
	at java.lang.Runtime.exec(Runtime.java:450)
	at java.lang.Runtime.exec(Runtime.java:347)
	at org.apache.solr.handler.admin.SystemInfoHandler.execute(SystemInfoHandler.java:220)
	at org.apache.solr.handler.admin.SystemInfoHandler.getSystemInfo(SystemInfoHandler.java:176)
	at org.apache.solr.handler.admin.SystemInfoHandler.handleRequestBody(SystemInfoHandler.java:97)
	at org.apache.solr.handler.RequestHandlerBase.handleRequest(RequestHandlerBase.java:135)
	at org.apache.solr.core.SolrCore.execute(SolrCore.java:1980)
	at org.apache.solr.util.TestHarness.query(TestHarness.java:295)
	at org.apache.solr.util.TestHarness.query(TestHarness.java:278)
	at org.apache.solr.SolrTestCaseJ4.assertQ(SolrTestCaseJ4.java:693)
	at org.apache.solr.MinimalSchemaTest.testAllConfiguredHandlers(MinimalSchemaTest.java:115)
	at sun.reflect.NativeMethodAccessorImpl.invoke0(Native Method)
	at sun.reflect.NativeMethodAccessorImpl.invoke(NativeMethodAccessorImpl.java:62)
	at sun.reflect.DelegatingMethodAccessorImpl.invoke(DelegatingMethodAccessorImpl.java:43)
	at java.lang.reflect.Method.invoke(Method.java:483)
	at com.carrotsearch.randomizedtesting.RandomizedRunner.invoke(RandomizedRunner.java:1618)
	at com.carrotsearch.randomizedtesting.RandomizedRunner$6.evaluate(RandomizedRunner.java:827)
	at com.carrotsearch.randomizedtesting.RandomizedRunner$7.evaluate(RandomizedRunner.java:863)
	at com.carrotsearch.randomizedtesting.RandomizedRunner$8.evaluate(RandomizedRunner.java:877)
	at com.carrotsearch.randomizedtesting.rules.SystemPropertiesRestoreRule$1.evaluate(SystemPropertiesRestoreRule.java:53)
	at org.apache.lucene.util.TestRuleSetupTeardownChained$1.evaluate(TestRuleSetupTeardownChained.java:50)
	at org.apache.lucene.util.AbstractBeforeAfterRule$1.evaluate(AbstractBeforeAfterRule.java:46)
	at com.carrotsearch.randomizedtesting.rules.SystemPropertiesInvariantRule$1.evaluate(SystemPropertiesInvariantRule.java:55)
	at org.apache.lucene.util.TestRuleThreadAndTestName$1.evaluate(TestRuleThreadAndTestName.java:49)
	at org.apache.lucene.util.TestRuleIgnoreAfterMaxFailures$1.evaluate(TestRuleIgnoreAfterMaxFailures.java:65)
	at org.apache.lucene.util.TestRuleMarkFailure$1.evaluate(TestRuleMarkFailure.java:48)
	at com.carrotsearch.randomizedtesting.rules.StatementAdapter.evaluate(StatementAdapter.java:36)
	at com.carrotsearch.randomizedtesting.ThreadLeakControl$StatementRunner.run(ThreadLeakControl.java:360)
	at com.carrotsearch.randomizedtesting.ThreadLeakControl.forkTimeoutingTask(ThreadLeakControl.java:793)
	at com.carrotsearch.randomizedtesting.ThreadLeakControl$3.evaluate(ThreadLeakControl.java:453)
	at com.carrotsearch.randomizedtesting.RandomizedRunner.runSingleTest(RandomizedRunner.java:836)
	at com.carrotsearch.randomizedtesting.RandomizedRunner$3.evaluate(RandomizedRunner.java:738)
	at com.carrotsearch.randomizedtesting.RandomizedRunner$4.evaluate(RandomizedRunner.java:772)
	at com.carrotsearch.randomizedtesting.RandomizedRunner$5.evaluate(RandomizedRunner.java:783)
	at com.carrotsearch.randomizedtesting.rules.StatementAdapter.evaluate(StatementAdapter.java:36)
	at com.carrotsearch.randomizedtesting.rules.SystemPropertiesRestoreRule$1.evaluate(SystemPropertiesRestoreRule.java:53)
	at org.apache.lucene.util.AbstractBeforeAfterRule$1.evaluate(AbstractBeforeAfterRule.java:46)
	at org.apache.lucene.util.TestRuleStoreClassName$1.evaluate(TestRuleStoreClassName.java:42)
	at com.carrotsearch.randomizedtesting.rules.SystemPropertiesInvariantRule$1.evaluate(SystemPropertiesInvariantRule.java:55)
	at com.carrotsearch.randomizedtesting.rules.NoShadowingOrOverridesOnMethodsRule$1.evaluate(NoShadowingOrOverridesOnMethodsRule.java:39)
	at com.carrotsearch.randomizedtesting.rules.NoShadowingOrOverridesOnMethodsRule$1.evaluate(NoShadowingOrOverridesOnMethodsRule.java:39)
	at com.carrotsearch.randomizedtesting.rules.StatementAdapter.evaluate(StatementAdapter.java:36)
	at com.carrotsearch.randomizedtesting.rules.StatementAdapter.evaluate(StatementAdapter.java:36)
	at com.carrotsearch.randomizedtesting.rules.StatementAdapter.evaluate(StatementAdapter.java:36)
	at org.apache.lucene.util.TestRuleAssertionsRequired$1.evaluate(TestRuleAssertionsRequired.java:43)
	at org.apache.lucene.util.TestRuleMarkFailure$1.evaluate(TestRuleMarkFailure.java:48)
	at org.apache.lucene.util.TestRuleIgnoreAfterMaxFailures$1.evaluate(TestRuleIgnoreAfterMaxFailures.java:65)
	at org.apache.lucene.util.TestRuleIgnoreTestSuites$1.evaluate(TestRuleIgnoreTestSuites.java:55)
	at com.carrotsearch.randomizedtesting.rules.StatementAdapter.evaluate(StatementAdapter.java:36)
	at com.carrotsearch.randomizedtesting.ThreadLeakControl$StatementRunner.run(ThreadLeakControl.java:360)
	at java.lang.Thread.run(Thread.java:745)


REGRESSION:  org.apache.solr.handler.admin.InfoHandlerTest.testOverriddenHandlers

Error Message:
posix_spawn is not a supported process launch mechanism on this platform.

Stack Trace:
java.lang.Error: posix_spawn is not a supported process launch mechanism on this platform.
	at __randomizedtesting.SeedInfo.seed([7968162ACC5089E2:9F331A0D35194656]:0)
	at java.lang.UNIXProcess$1.run(UNIXProcess.java:105)
	at java.lang.UNIXProcess$1.run(UNIXProcess.java:94)
	at java.security.AccessController.doPrivileged(Native Method)
	at java.lang.UNIXProcess.<clinit>(UNIXProcess.java:92)
	at java.lang.ProcessImpl.start(ProcessImpl.java:130)
	at java.lang.ProcessBuilder.start(ProcessBuilder.java:1023)
	at java.lang.Runtime.exec(Runtime.java:620)
	at java.lang.Runtime.exec(Runtime.java:450)
	at java.lang.Runtime.exec(Runtime.java:347)
	at org.apache.solr.handler.admin.SystemInfoHandler.execute(SystemInfoHandler.java:220)
	at org.apache.solr.handler.admin.SystemInfoHandler.getSystemInfo(SystemInfoHandler.java:176)
	at org.apache.solr.handler.admin.SystemInfoHandler.handleRequestBody(SystemInfoHandler.java:97)
	at org.apache.solr.handler.admin.InfoHandlerTest$CountSystemInfoHandler.handleRequestBody(InfoHandlerTest.java:157)
	at org.apache.solr.handler.RequestHandlerBase.handleRequest(RequestHandlerBase.java:135)
	at org.apache.solr.handler.admin.InfoHandler.handleRequestBody(InfoHandler.java:88)
	at org.apache.solr.handler.admin.InfoHandlerTest.handleRequest(InfoHandlerTest.java:168)
	at org.apache.solr.handler.admin.InfoHandlerTest.testOverriddenHandlers(InfoHandlerTest.java:98)
	at sun.reflect.NativeMethodAccessorImpl.invoke0(Native Method)
	at sun.reflect.NativeMethodAccessorImpl.invoke(NativeMethodAccessorImpl.java:62)
	at sun.reflect.DelegatingMethodAccessorImpl.invoke(DelegatingMethodAccessorImpl.java:43)
	at java.lang.reflect.Method.invoke(Method.java:483)
	at com.carrotsearch.randomizedtesting.RandomizedRunner.invoke(RandomizedRunner.java:1618)
	at com.carrotsearch.randomizedtesting.RandomizedRunner$6.evaluate(RandomizedRunner.java:827)
	at com.carrotsearch.randomizedtesting.RandomizedRunner$7.evaluate(RandomizedRunner.java:863)
	at com.carrotsearch.randomizedtesting.RandomizedRunner$8.evaluate(RandomizedRunner.java:877)
	at com.carrotsearch.randomizedtesting.rules.SystemPropertiesRestoreRule$1.evaluate(SystemPropertiesRestoreRule.java:53)
	at org.apache.lucene.util.TestRuleSetupTeardownChained$1.evaluate(TestRuleSetupTeardownChained.java:50)
	at org.apache.lucene.util.AbstractBeforeAfterRule$1.evaluate(AbstractBeforeAfterRule.java:46)
	at com.carrotsearch.randomizedtesting.rules.SystemPropertiesInvariantRule$1.evaluate(SystemPropertiesInvariantRule.java:55)
	at org.apache.lucene.util.TestRuleThreadAndTestName$1.evaluate(TestRuleThreadAndTestName.java:49)
	at org.apache.lucene.util.TestRuleIgnoreAfterMaxFailures$1.evaluate(TestRuleIgnoreAfterMaxFailures.java:65)
	at org.apache.lucene.util.TestRuleMarkFailure$1.evaluate(TestRuleMarkFailure.java:48)
	at com.carrotsearch.randomizedtesting.rules.StatementAdapter.evaluate(StatementAdapter.java:36)
	at com.carrotsearch.randomizedtesting.ThreadLeakControl$StatementRunner.run(ThreadLeakControl.java:360)
	at com.carrotsearch.randomizedtesting.ThreadLeakControl.forkTimeoutingTask(ThreadLeakControl.java:793)
	at com.carrotsearch.randomizedtesting.ThreadLeakControl$3.evaluate(ThreadLeakControl.java:453)
	at com.carrotsearch.randomizedtesting.RandomizedRunner.runSingleTest(RandomizedRunner.java:836)
	at com.carrotsearch.randomizedtesting.RandomizedRunner$3.evaluate(RandomizedRunner.java:738)
	at com.carrotsearch.randomizedtesting.RandomizedRunner$4.evaluate(RandomizedRunner.java:772)
	at com.carrotsearch.randomizedtesting.RandomizedRunner$5.evaluate(RandomizedRunner.java:783)
	at com.carrotsearch.randomizedtesting.rules.StatementAdapter.evaluate(StatementAdapter.java:36)
	at com.carrotsearch.randomizedtesting.rules.SystemPropertiesRestoreRule$1.evaluate(SystemPropertiesRestoreRule.java:53)
	at org.apache.lucene.util.AbstractBeforeAfterRule$1.evaluate(AbstractBeforeAfterRule.java:46)
	at org.apache.lucene.util.TestRuleStoreClassName$1.evaluate(TestRuleStoreClassName.java:42)
	at com.carrotsearch.randomizedtesting.rules.SystemPropertiesInvariantRule$1.evaluate(SystemPropertiesInvariantRule.java:55)
	at com.carrotsearch.randomizedtesting.rules.NoShadowingOrOverridesOnMethodsRule$1.evaluate(NoShadowingOrOverridesOnMethodsRule.java:39)
	at com.carrotsearch.randomizedtesting.rules.NoShadowingOrOverridesOnMethodsRule$1.evaluate(NoShadowingOrOverridesOnMethodsRule.java:39)
	at com.carrotsearch.randomizedtesting.rules.StatementAdapter.evaluate(StatementAdapter.java:36)
	at com.carrotsearch.randomizedtesting.rules.StatementAdapter.evaluate(StatementAdapter.java:36)
	at com.carrotsearch.randomizedtesting.rules.StatementAdapter.evaluate(StatementAdapter.java:36)
	at org.apache.lucene.util.TestRuleAssertionsRequired$1.evaluate(TestRuleAssertionsRequired.java:43)
	at org.apache.lucene.util.TestRuleMarkFailure$1.evaluate(TestRuleMarkFailure.java:48)
	at org.apache.lucene.util.TestRuleIgnoreAfterMaxFailures$1.evaluate(TestRuleIgnoreAfterMaxFailures.java:65)
	at org.apache.lucene.util.TestRuleIgnoreTestSuites$1.evaluate(TestRuleIgnoreTestSuites.java:55)
	at com.carrotsearch.randomizedtesting.rules.StatementAdapter.evaluate(StatementAdapter.java:36)
	at com.carrotsearch.randomizedtesting.ThreadLeakControl$StatementRunner.run(ThreadLeakControl.java:360)
	at java.lang.Thread.run(Thread.java:745)




Build Log:
[...truncated 11151 lines...]
   [junit4] Suite: org.apache.solr.handler.admin.InfoHandlerTest
   [junit4]   2> Creating dataDir: /Users/jenkins/workspace/Lucene-Solr-trunk-MacOSX/solr/build/solr-core/test/J0/./temp/solr.handler.admin.InfoHandlerTest-7968162ACC5089E2-001/init-core-data-001
   [junit4]   2> 1581341 T5177 oas.SolrTestCaseJ4.buildSSLConfig Randomized ssl (false) and clientAuth (false)
   [junit4]   2> 1581343 T5177 oas.SolrTestCaseJ4.initCore ####initCore
   [junit4]   2> 1581343 T5177 oasc.SolrResourceLoader.<init> new SolrResourceLoader for directory: '/Users/jenkins/workspace/Lucene-Solr-trunk-MacOSX/solr/core/src/test-files/solr/collection1/'
   [junit4]   2> 1581344 T5177 oasc.SolrResourceLoader.replaceClassLoader Adding 'file:/Users/jenkins/workspace/Lucene-Solr-trunk-MacOSX/solr/core/src/test-files/solr/collection1/lib/.svn/' to classloader
   [junit4]   2> 1581345 T5177 oasc.SolrResourceLoader.replaceClassLoader Adding 'file:/Users/jenkins/workspace/Lucene-Solr-trunk-MacOSX/solr/core/src/test-files/solr/collection1/lib/classes/' to classloader
   [junit4]   2> 1581345 T5177 oasc.SolrResourceLoader.replaceClassLoader Adding 'file:/Users/jenkins/workspace/Lucene-Solr-trunk-MacOSX/solr/core/src/test-files/solr/collection1/lib/README' to classloader
   [junit4]   2> 1581447 T5177 oasc.SolrConfig.<init> Using Lucene MatchVersion: LUCENE_5_0
   [junit4]   2> 1581485 T5177 oasc.SolrConfig.<init> Loaded SolrConfig: solrconfig.xml
   [junit4]   2> 1581486 T5177 oass.IndexSchema.readSchema Reading Solr Schema from schema.xml
   [junit4]   2> 1581493 T5177 oass.IndexSchema.readSchema [null] Schema name=test
   [junit4]   2> 1581635 T5177 oass.OpenExchangeRatesOrgProvider.init Initialized with rates=open-exchange-rates.json, refreshInterval=1440.
   [junit4]   2> 1581645 T5177 oass.IndexSchema.readSchema default search field in schema is text
   [junit4]   2> 1581646 T5177 oass.IndexSchema.readSchema unique key field: id
   [junit4]   2> 1581655 T5177 oass.FileExchangeRateProvider.reload Reloading exchange rates from file currency.xml
   [junit4]   2> 1581658 T5177 oass.FileExchangeRateProvider.reload Reloading exchange rates from file currency.xml
   [junit4]   2> 1581661 T5177 oass.OpenExchangeRatesOrgProvider.reload Reloading exchange rates from open-exchange-rates.json
   [junit4]   2> 1581663 T5177 oass.OpenExchangeRatesOrgProvider$OpenExchangeRates.<init> WARN Unknown key IMPORTANT NOTE
   [junit4]   2> 1581663 T5177 oass.OpenExchangeRatesOrgProvider$OpenExchangeRates.<init> WARN Expected key, got STRING
   [junit4]   2> 1581664 T5177 oass.OpenExchangeRatesOrgProvider.reload Reloading exchange rates from open-exchange-rates.json
   [junit4]   2> 1581664 T5177 oass.OpenExchangeRatesOrgProvider$OpenExchangeRates.<init> WARN Unknown key IMPORTANT NOTE
   [junit4]   2> 1581664 T5177 oass.OpenExchangeRatesOrgProvider$OpenExchangeRates.<init> WARN Expected key, got STRING
   [junit4]   2> 1581665 T5177 oasc.SolrResourceLoader.locateSolrHome JNDI not configured for solr (NoInitialContextEx)
   [junit4]   2> 1581665 T5177 oasc.SolrResourceLoader.locateSolrHome using system property solr.solr.home: /Users/jenkins/workspace/Lucene-Solr-trunk-MacOSX/solr/core/src/test-files/solr
   [junit4]   2> 1581665 T5177 oasc.SolrResourceLoader.<init> new SolrResourceLoader for directory: '/Users/jenkins/workspace/Lucene-Solr-trunk-MacOSX/solr/core/src/test-files/solr/'
   [junit4]   2> 1581700 T5177 oasc.CoreContainer.<init> New CoreContainer 44126816
   [junit4]   2> 1581700 T5177 oasc.CoreContainer.load Loading cores into CoreContainer [instanceDir=/Users/jenkins/workspace/Lucene-Solr-trunk-MacOSX/solr/core/src/test-files/solr/]
   [junit4]   2> 1581702 T5177 oashc.HttpShardHandlerFactory.getParameter Setting socketTimeout to: 0
   [junit4]   2> 1581703 T5177 oashc.HttpShardHandlerFactory.getParameter Setting urlScheme to: null
   [junit4]   2> 1581703 T5177 oashc.HttpShardHandlerFactory.getParameter Setting connTimeout to: 0
   [junit4]   2> 1581703 T5177 oashc.HttpShardHandlerFactory.getParameter Setting maxConnectionsPerHost to: 20
   [junit4]   2> 1581703 T5177 oashc.HttpShardHandlerFactory.getParameter Setting corePoolSize to: 0
   [junit4]   2> 1581704 T5177 oashc.HttpShardHandlerFactory.getParameter Setting maximumPoolSize to: 2147483647
   [junit4]   2> 1581704 T5177 oashc.HttpShardHandlerFactory.getParameter Setting maxThreadIdleTime to: 5
   [junit4]   2> 1581704 T5177 oashc.HttpShardHandlerFactory.getParameter Setting sizeOfQueue to: -1
   [junit4]   2> 1581704 T5177 oashc.HttpShardHandlerFactory.getParameter Setting fairnessPolicy to: false
   [junit4]   2> 1581705 T5177 oasl.LogWatcher.createWatcher SLF4J impl is org.slf4j.impl.Log4jLoggerFactory
   [junit4]   2> 1581705 T5177 oasl.LogWatcher.newRegisteredLogWatcher Registering Log Listener [Log4j (org.slf4j.impl.Log4jLoggerFactory)]
   [junit4]   2> 1581706 T5177 oasc.CoreContainer.load Host Name: 
   [junit4]   2> 1581710 T5178 oasc.SolrResourceLoader.<init> new SolrResourceLoader for directory: '/Users/jenkins/workspace/Lucene-Solr-trunk-MacOSX/solr/core/src/test-files/solr/collection1/'
   [junit4]   2> 1581712 T5178 oasc.SolrResourceLoader.replaceClassLoader Adding 'file:/Users/jenkins/workspace/Lucene-Solr-trunk-MacOSX/solr/core/src/test-files/solr/collection1/lib/.svn/' to classloader
   [junit4]   2> 1581712 T5178 oasc.SolrResourceLoader.replaceClassLoader Adding 'file:/Users/jenkins/workspace/Lucene-Solr-trunk-MacOSX/solr/core/src/test-files/solr/collection1/lib/classes/' to classloader
   [junit4]   2> 1581712 T5178 oasc.SolrResourceLoader.replaceClassLoader Adding 'file:/Users/jenkins/workspace/Lucene-Solr-trunk-MacOSX/solr/core/src/test-files/solr/collection1/lib/README' to classloader
   [junit4]   2> 1581754 T5178 oasc.SolrConfig.<init> Using Lucene MatchVersion: LUCENE_5_0
   [junit4]   2> 1581782 T5178 oasc.SolrConfig.<init> Loaded SolrConfig: solrconfig.xml
   [junit4]   2> 1581783 T5178 oass.IndexSchema.readSchema Reading Solr Schema from schema.xml
   [junit4]   2> 1581791 T5178 oass.IndexSchema.readSchema [collection1] Schema name=test
   [junit4]   2> 1581923 T5178 oass.OpenExchangeRatesOrgProvider.init Initialized with rates=open-exchange-rates.json, refreshInterval=1440.
   [junit4]   2> 1581927 T5178 oass.IndexSchema.readSchema default search field in schema is text
   [junit4]   2> 1581929 T5178 oass.IndexSchema.readSchema unique key field: id
   [junit4]   2> 1581935 T5178 oass.FileExchangeRateProvider.reload Reloading exchange rates from file currency.xml
   [junit4]   2> 1581938 T5178 oass.FileExchangeRateProvider.reload Reloading exchange rates from file currency.xml
   [junit4]   2> 1581941 T5178 oass.OpenExchangeRatesOrgProvider.reload Reloading exchange rates from open-exchange-rates.json
   [junit4]   2> 1581943 T5178 oass.OpenExchangeRatesOrgProvider$OpenExchangeRates.<init> WARN Unknown key IMPORTANT NOTE
   [junit4]   2> 1581943 T5178 oass.OpenExchangeRatesOrgProvider$OpenExchangeRates.<init> WARN Expected key, got STRING
   [junit4]   2> 1581943 T5178 oass.OpenExchangeRatesOrgProvider.reload Reloading exchange rates from open-exchange-rates.json
   [junit4]   2> 1581944 T5178 oass.OpenExchangeRatesOrgProvider$OpenExchangeRates.<init> WARN Unknown key IMPORTANT NOTE
   [junit4]   2> 1581944 T5178 oass.OpenExchangeRatesOrgProvider$OpenExchangeRates.<init> WARN Expected key, got STRING
   [junit4]   2> 1581944 T5178 oasc.CoreContainer.create Creating SolrCore 'collection1' using configuration from instancedir /Users/jenkins/workspace/Lucene-Solr-trunk-MacOSX/solr/core/src/test-files/solr/collection1/
   [junit4]   2> 1581945 T5178 oasc.SolrCore.initDirectoryFactory org.apache.solr.core.MockDirectoryFactory
   [junit4]   2> 1581945 T5178 oasc.SolrCore.<init> [collection1] Opening new SolrCore at /Users/jenkins/workspace/Lucene-Solr-trunk-MacOSX/solr/core/src/test-files/solr/collection1/, dataDir=/Users/jenkins/workspace/Lucene-Solr-trunk-MacOSX/solr/build/solr-core/test/J0/./temp/solr.handler.admin.InfoHandlerTest-7968162ACC5089E2-001/init-core-data-001/
   [junit4]   2> 1581946 T5178 oasc.JmxMonitoredMap.<init> JMX monitoring is enabled. Adding Solr mbeans to JMX Server: com.sun.jmx.mbeanserver.JmxMBeanServer@159e00a1
   [junit4]   2> 1581946 T5178 oasc.CachingDirectoryFactory.get return new directory for /Users/jenkins/workspace/Lucene-Solr-trunk-MacOSX/solr/build/solr-core/test/J0/./temp/solr.handler.admin.InfoHandlerTest-7968162ACC5089E2-001/init-core-data-001
   [junit4]   2> 1581946 T5178 oasc.SolrCore.getNewIndexDir New index directory detected: old=null new=/Users/jenkins/workspace/Lucene-Solr-trunk-MacOSX/solr/build/solr-core/test/J0/./temp/solr.handler.admin.InfoHandlerTest-7968162ACC5089E2-001/init-core-data-001/index/
   [junit4]   2> 1581947 T5178 oasc.SolrCore.initIndex WARN [collection1] Solr index directory '/Users/jenkins/workspace/Lucene-Solr-trunk-MacOSX/solr/build/solr-core/test/J0/./temp/solr.handler.admin.InfoHandlerTest-7968162ACC5089E2-001/init-core-data-001/index' doesn't exist. Creating new index...
   [junit4]   2> 1581949 T5178 oasc.CachingDirectoryFactory.get return new directory for /Users/jenkins/workspace/Lucene-Solr-trunk-MacOSX/solr/build/solr-core/test/J0/./temp/solr.handler.admin.InfoHandlerTest-7968162ACC5089E2-001/init-core-data-001/index
   [junit4]   2> 1581949 T5178 oasu.RandomMergePolicy.<init> RandomMergePolicy wrapping class org.apache.lucene.index.LogByteSizeMergePolicy: [LogByteSizeMergePolicy: minMergeSize=1677721, mergeFactor=49, maxMergeSize=2147483648, maxMergeSizeForForcedMerge=9223372036854775807, calibrateSizeByDeletes=true, maxMergeDocs=2147483647, maxCFSSegmentSizeMB=8.796093022207999E12, noCFSRatio=0.1364227660998621]
   [junit4]   2> 1581951 T5178 oasc.SolrDeletionPolicy.onCommit SolrDeletionPolicy.onCommit: commits: num=1
   [junit4]   2> 		commit{dir=RateLimitedDirectoryWrapper(MockDirectoryWrapper(MMapDirectory@/Users/jenkins/workspace/Lucene-Solr-trunk-MacOSX/solr/build/solr-core/test/J0/temp/solr.handler.admin.InfoHandlerTest-7968162ACC5089E2-001/index-MMapDirectory-001 lockFactory=org.apache.lucene.store.SingleInstanceLockFactory@64bad49a)),segFN=segments_1,generation=1}
   [junit4]   2> 1581952 T5178 oasc.SolrDeletionPolicy.updateCommits newest commit generation = 1
   [junit4]   2> 1581953 T5178 oasc.SolrCore.initWriters created xml: solr.XMLResponseWriter
   [junit4]   2> 1581962 T5178 oasup.UpdateRequestProcessorChain.init creating updateRequestProcessorChain "dedupe"
   [junit4]   2> 1581963 T5178 oasup.UpdateRequestProcessorChain.init inserting DistributedUpdateProcessorFactory into updateRequestProcessorChain "dedupe"
   [junit4]   2> 1581963 T5178 oasup.UpdateRequestProcessorChain.init creating updateRequestProcessorChain "dedupe-allfields"
   [junit4]   2> 1581964 T5178 oasup.UpdateRequestProcessorChain.init inserting DistributedUpdateProcessorFactory into updateRequestProcessorChain "dedupe-allfields"
   [junit4]   2> 1581964 T5178 oasup.UpdateRequestProcessorChain.init creating updateRequestProcessorChain "stored_sig"
   [junit4]   2> 1581965 T5178 oasup.UpdateRequestProcessorChain.init inserting DistributedUpdateProcessorFactory into updateRequestProcessorChain "stored_sig"
   [junit4]   2> 1581965 T5178 oasup.UpdateRequestProcessorChain.init creating updateRequestProcessorChain "uniq-fields"
   [junit4]   2> 1581966 T5178 oasup.UpdateRequestProcessorChain.init inserting DistributedUpdateProcessorFactory into updateRequestProcessorChain "uniq-fields"
   [junit4]   2> 1581966 T5178 oasup.UpdateRequestProcessorChain.init creating updateRequestProcessorChain "distrib-dup-test-chain-explicit"
   [junit4]   2> 1581966 T5178 oasup.UpdateRequestProcessorChain.init creating updateRequestProcessorChain "distrib-dup-test-chain-implicit"
   [junit4]   2> 1581967 T5178 oasup.UpdateRequestProcessorChain.init inserting DistributedUpdateProcessorFactory into updateRequestProcessorChain "distrib-dup-test-chain-implicit"
   [junit4]   2> 1581967 T5178 oasc.SolrCore.loadUpdateProcessorChains no updateRequestProcessorChain defined as default, creating implicit default
   [junit4]   2> 1581967 T5178 oasc.RequestHandlers.initHandlersFromConfig adding lazy requestHandler: solr.ReplicationHandler
   [junit4]   2> 1581967 T5178 oasc.RequestHandlers.initHandlersFromConfig created /replication: solr.ReplicationHandler
   [junit4]   2> 1581968 T5178 oasc.RequestHandlers.initHandlersFromConfig created standard: solr.StandardRequestHandler
   [junit4]   2> 1581968 T5178 oasc.RequestHandlers.initHandlersFromConfig created /get: solr.RealTimeGetHandler
   [junit4]   2> 1581969 T5178 oasc.RequestHandlers.initHandlersFromConfig created dismax: solr.SearchHandler
   [junit4]   2> 1581969 T5178 oasc.RequestHandlers.initHandlersFromConfig created mock: org.apache.solr.core.MockQuerySenderListenerReqHandler
   [junit4]   2> 1581969 T5178 oasc.RequestHandlers.initHandlersFromConfig created /admin/: org.apache.solr.handler.admin.AdminHandlers
   [junit4]   2> 1581970 T5178 oasc.RequestHandlers.initHandlersFromConfig created /admin/file: solr.admin.ShowFileRequestHandler
   [junit4]   2> 1581970 T5178 oasc.RequestHandlers.initHandlersFromConfig created /admin/fileedit: solr.admin.EditFileRequestHandler
   [junit4]   2> 1581971 T5178 oasc.RequestHandlers.initHandlersFromConfig created defaults: solr.StandardRequestHandler
   [junit4]   2> 1581971 T5178 oasc.RequestHandlers.initHandlersFromConfig adding lazy requestHandler: solr.StandardRequestHandler
   [junit4]   2> 1581971 T5178 oasc.RequestHandlers.initHandlersFromConfig created lazy: solr.StandardRequestHandler
   [junit4]   2> 1581971 T5178 oasc.RequestHandlers.initHandlersFromConfig created /update: solr.UpdateRequestHandler
   [junit4]   2> 1581972 T5178 oasc.RequestHandlers.initHandlersFromConfig created /terms: org.apache.solr.handler.component.SearchHandler
   [junit4]   2> 1581973 T5178 oasc.RequestHandlers.initHandlersFromConfig created spellCheckCompRH: org.apache.solr.handler.component.SearchHandler
   [junit4]   2> 1581973 T5178 oasc.RequestHandlers.initHandlersFromConfig created spellCheckCompRH_Direct: org.apache.solr.handler.component.SearchHandler
   [junit4]   2> 1581974 T5178 oasc.RequestHandlers.initHandlersFromConfig created spellCheckWithWordbreak: org.apache.solr.handler.component.SearchHandler
   [junit4]   2> 1581975 T5178 oasc.RequestHandlers.initHandlersFromConfig created spellCheckWithWordbreak_Direct: org.apache.solr.handler.component.SearchHandler
   [junit4]   2> 1581975 T5178 oasc.RequestHandlers.initHandlersFromConfig created spellCheckCompRH1: org.apache.solr.handler.component.SearchHandler
   [junit4]   2> 1581975 T5178 oasc.RequestHandlers.initHandlersFromConfig created mltrh: org.apache.solr.handler.component.SearchHandler
   [junit4]   2> 1581976 T5178 oasc.RequestHandlers.initHandlersFromConfig created tvrh: org.apache.solr.handler.component.SearchHandler
   [junit4]   2> 1581976 T5178 oasc.RequestHandlers.initHandlersFromConfig created /mlt: solr.MoreLikeThisHandler
   [junit4]   2> 1581977 T5178 oasc.RequestHandlers.initHandlersFromConfig created /debug/dump: solr.DumpRequestHandler
   [junit4]   2> 1581985 T5178 oashl.XMLLoader.init xsltCacheLifetimeSeconds=60
   [junit4]   2> 1581986 T5178 oasc.SolrCore.initDeprecatedSupport WARN solrconfig.xml uses deprecated <admin/gettableFiles>, Please update your config to use the ShowFileRequestHandler.
   [junit4]   2> 1581989 T5178 oasu.CommitTracker.<init> Hard AutoCommit: disabled
   [junit4]   2> 1581989 T5178 oasu.CommitTracker.<init> Soft AutoCommit: disabled
   [junit4]   2> 1581990 T5178 oasu.RandomMergePolicy.<init> RandomMergePolicy wrapping class org.apache.lucene.index.LogDocMergePolicy: [LogDocMergePolicy: minMergeSize=1000, mergeFactor=49, maxMergeSize=9223372036854775807, maxMergeSizeForForcedMerge=9223372036854775807, calibrateSizeByDeletes=true, maxMergeDocs=2147483647, maxCFSSegmentSizeMB=8.796093022207999E12, noCFSRatio=0.3952218846408454]
   [junit4]   2> 1581993 T5178 oasc.SolrDeletionPolicy.onInit SolrDeletionPolicy.onInit: commits: num=1
   [junit4]   2> 		commit{dir=RateLimitedDirectoryWrapper(MockDirectoryWrapper(MMapDirectory@/Users/jenkins/workspace/Lucene-Solr-trunk-MacOSX/solr/build/solr-core/test/J0/temp/solr.handler.admin.InfoHandlerTest-7968162ACC5089E2-001/index-MMapDirectory-001 lockFactory=org.apache.lucene.store.SingleInstanceLockFactory@64bad49a)),segFN=segments_1,generation=1}
   [junit4]   2> 1581993 T5178 oasc.SolrDeletionPolicy.updateCommits newest commit generation = 1
   [junit4]   2> 1581994 T5178 oass.SolrIndexSearcher.<init> Opening Searcher@53351e12[collection1] main
   [junit4]   2> 1581994 T5178 oasr.RestManager.init Initializing RestManager with initArgs: {storageIO=org.apache.solr.rest.ManagedResourceStorage$InMemoryStorageIO}
   [junit4]   2> 1581994 T5178 oasr.ManagedResourceStorage.load Reading _rest_managed.json using InMemoryStorage
   [junit4]   2> 1581995 T5178 oasr.ManagedResource.reloadFromStorage WARN No stored data found for /rest/managed
   [junit4]   2> 1581995 T5178 oasr.ManagedResource.notifyObserversDuringInit WARN No registered observers for /rest/managed
   [junit4]   2> 1581995 T5178 oasr.RestManager.init Initializing 0 registered ManagedResources
   [junit4]   2> 1581995 T5178 oashc.SpellCheckComponent.inform Initializing spell checkers
   [junit4]   2> 1582005 T5178 oass.DirectSolrSpellChecker.init init: {name=direct,classname=DirectSolrSpellChecker,field=lowerfilt,minQueryLength=3}
   [junit4]   2> 1582068 T5179 oasc.SolrCore.registerSearcher [collection1] Registered new searcher Searcher@53351e12[collection1] main{UninvertingDirectoryReader()}
   [junit4]   2> 1582073 T5178 oasc.CoreContainer.registerCore registering core: collection1
   [junit4]   2> 1582077 T5177 oas.SolrTestCaseJ4.initCore ####initCore end
   [junit4]   2> 1582082 T5177 oas.SolrTestCaseJ4.setUp ###Starting testCoreAdminHandler
   [junit4]   2> 1582109 T5177 oas.SolrTestCaseJ4.tearDown ###Ending testCoreAdminHandler
   [junit4]   2> 1582116 T5177 oas.SolrTestCaseJ4.setUp ###Starting testOverriddenHandlers
   [junit4]   2> 1582166 T5177 oas.SolrTestCaseJ4.tearDown ###Ending testOverriddenHandlers
   [junit4]   2> NOTE: reproduce with: ant test  -Dtestcase=InfoHandlerTest -Dtests.method=testOverriddenHandlers -Dtests.seed=7968162ACC5089E2 -Dtests.slow=true -Dtests.locale=tr_TR -Dtests.timezone=America/Argentina/San_Luis -Dtests.file.encoding=US-ASCII
   [junit4] ERROR   0.08s | InfoHandlerTest.testOverriddenHandlers <<<
   [junit4]    > Throwable #1: java.lang.Error: posix_spawn is not a supported process launch mechanism on this platform.
   [junit4]    > 	at __randomizedtesting.SeedInfo.seed([7968162ACC5089E2:9F331A0D35194656]:0)
   [junit4]    > 	at java.lang.UNIXProcess$1.run(UNIXProcess.java:105)
   [junit4]    > 	at java.lang.UNIXProcess$1.run(UNIXProcess.java:94)
   [junit4]    > 	at java.security.AccessController.doPrivileged(Native Method)
   [junit4]    > 	at java.lang.UNIXProcess.<clinit>(UNIXProcess.java:92)
   [junit4]    > 	at java.lang.ProcessImpl.start(ProcessImpl.java:130)
   [junit4]    > 	at java.lang.ProcessBuilder.start(ProcessBuilder.java:1023)
   [junit4]    > 	at java.lang.Runtime.exec(Runtime.java:620)
   [junit4]    > 	at java.lang.Runtime.exec(Runtime.java:450)
   [junit4]    > 	at java.lang.Runtime.exec(Runtime.java:347)
   [junit4]    > 	at org.apache.solr.handler.admin.SystemInfoHandler.execute(SystemInfoHandler.java:220)
   [junit4]    > 	at org.apache.solr.handler.admin.SystemInfoHandler.getSystemInfo(SystemInfoHandler.java:176)
   [junit4]    > 	at org.apache.solr.handler.admin.SystemInfoHandler.handleRequestBody(SystemInfoHandler.java:97)
   [junit4]    > 	at org.apache.solr.handler.admin.InfoHandlerTest$CountSystemInfoHandler.handleRequestBody(InfoHandlerTest.java:157)
   [junit4]    > 	at org.apache.solr.handler.RequestHandlerBase.handleRequest(RequestHandlerBase.java:135)
   [junit4]    > 	at org.apache.solr.handler.admin.InfoHandler.handleRequestBody(InfoHandler.java:88)
   [junit4]    > 	at org.apache.solr.handler.admin.InfoHandlerTest.handleRequest(InfoHandlerTest.java:168)
   [junit4]    > 	at org.apache.solr.handler.admin.InfoHandlerTest.testOverriddenHandlers(InfoHandlerTest.java:98)
   [junit4]    > 	at java.lang.Thread.run(Thread.java:745)
   [junit4]   2> 1582187 T5177 oas.SolrTestCaseJ4.deleteCore ###deleteCore
   [junit4]   2> 1582188 T5177 oasc.CoreContainer.shutdown Shutting down CoreContainer instance=44126816
   [junit4]   2> 1582188 T5177 oasc.SolrCore.close [collection1]  CLOSING SolrCore org.apache.solr.core.SolrCore@6a357b6d
   [junit4]   2> 1582206 T5177 oasu.DirectUpdateHandler2.close closing DirectUpdateHandler2{commits=0,autocommits=0,soft autocommits=0,optimizes=0,rollbacks=0,expungeDeletes=0,docsPending=0,adds=0,deletesById=0,deletesByQuery=0,errors=0,cumulative_adds=0,cumulative_deletesById=0,cumulative_deletesByQuery=0,cumulative_errors=0,transaction_logs_total_size=0,transaction_logs_total_number=0}
   [junit4]   2> 1582207 T5177 oasu.SolrCoreState.decrefSolrCoreState Closing SolrCoreState
   [junit4]   2> 1582207 T5177 oasu.DefaultSolrCoreState.closeIndexWriter SolrCoreState ref count has reached 0 - closing IndexWriter
   [junit4]   2> 1582207 T5177 oasu.DefaultSolrCoreState.closeIndexWriter closing IndexWriter with IndexWriterCloser
   [junit4]   2> 1582211 T5177 oasc.SolrCore.closeSearcher [collection1] Closing main searcher on request.
   [junit4]   2> 1582211 T5177 oasc.CachingDirectoryFactory.close Closing MockDirectoryFactory - 2 directories currently being tracked
   [junit4]   2> 1582211 T5177 oasc.CachingDirectoryFactory.closeCacheValue looking to close /Users/jenkins/workspace/Lucene-Solr-trunk-MacOSX/solr/build/solr-core/test/J0/./temp/solr.handler.admin.InfoHandlerTest-7968162ACC5089E2-001/init-core-data-001/index [CachedDir<<refCount=0;path=/Users/jenkins/workspace/Lucene-Solr-trunk-MacOSX/solr/build/solr-core/test/J0/./temp/solr.handler.admin.InfoHandlerTest-7968162ACC5089E2-001/init-core-data-001/index;done=false>>]
   [junit4]   2> 1582212 T5177 oasc.CachingDirectoryFactory.close Closing directory: /Users/jenkins/workspace/Lucene-Solr-trunk-MacOSX/solr/build/solr-core/test/J0/./temp/solr.handler.admin.InfoHandlerTest-7968162ACC5089E2-001/init-core-data-001/index
   [junit4]   2> 1582212 T5177 oasc.CachingDirectoryFactory.closeCacheValue looking to close /Users/jenkins/workspace/Lucene-Solr-trunk-MacOSX/solr/build/solr-core/test/J0/./temp/solr.handler.admin.InfoHandlerTest-7968162ACC5089E2-001/init-core-data-001 [CachedDir<<refCount=0;path=/Users/jenkins/workspace/Lucene-Solr-trunk-MacOSX/solr/build/solr-core/test/J0/./temp/solr.handler.admin.InfoHandlerTest-7968162ACC5089E2-001/init-core-data-001;done=false>>]
   [junit4]   2> 1582212 T5177 oasc.CachingDirectoryFactory.close Closing directory: /Users/jenkins/workspace/Lucene-Solr-trunk-MacOSX/solr/build/solr-core/test/J0/./temp/solr.handler.admin.InfoHandlerTest-7968162ACC5089E2-001/init-core-data-001
   [junit4]   2> NOTE: leaving temporary files on disk at: /Users/jenkins/workspace/Lucene-Solr-trunk-MacOSX/solr/build/solr-core/test/J0/./temp/solr.handler.admin.InfoHandlerTest-7968162ACC5089E2-001
   [junit4]   2> NOTE: test params are: codec=FastDecompressionCompressingStoredFields(storedFieldsFormat=CompressingStoredFieldsFormat(compressionMode=FAST_DECOMPRESSION, chunkSize=56), termVectorsFormat=CompressingTermVectorsFormat(compressionMode=FAST_DECOMPRESSION, chunkSize=56)), sim=DefaultSimilarity, locale=tr_TR, timezone=America/Argentina/San_Luis
   [junit4]   2> NOTE: Mac OS X 10.8.5 x86_64/Oracle Corporation 1.8.0_05 (64-bit)/cpus=2,threads=1,free=67913832,total=536870912
   [junit4]   2> NOTE: All tests run in this JVM: [TestSolrQueryParserDefaultOperatorResource, TestPhraseSuggestions, TestManagedResource, FullSolrCloudDistribCmdsTest, TestAnalyzedSuggestions, SimpleFacetsTest, TestDistributedSearch, HdfsBasicDistributedZk2Test, QueryFacetTest, UpdateRequestProcessorFactoryTest, SoftAutoCommitTest, TestComplexPhraseQParserPlugin, TestClassNameShortening, ClusterStateUpdateTest, TestDefaultSimilarityFactory, ZkSolrClientTest, DistribDocExpirationUpdateProcessorTest, SuggesterTSTTest, DistributedDebugComponentTest, XsltUpdateRequestHandlerTest, TestRemoteStreaming, TestIndexingPerformance, TestReplicationHandler, DirectUpdateHandlerTest, SSLMigrationTest, StatelessScriptUpdateProcessorFactoryTest, HdfsBasicDistributedZkTest, TestDynamicFieldCollectionResource, TestCollationField, DefaultValueUpdateProcessorTest, DateRangeFieldTest, TestUtils, QueryElevationComponentTest, SimplePostToolTest, AbstractAnalyticsFacetTest, TestGroupingSearch, CoreAdminRequestStatusTest, OverseerCollectionProcessorTest, SliceStateTest, TestChildDocTransformer, LeaderElectionIntegrationTest, TestPartialUpdateDeduplication, QueryEqualityTest, TestStandardQParsers, OverseerStatusTest, TestSolrDeletionPolicy2, DebugComponentTest, TestValueSourceCache, TestBinaryResponseWriter, TestSolrIndexConfig, ExternalFileFieldSortTest, TestCoreContainer, TestLazyCores, TestFreeTextSuggestions, IndexBasedSpellCheckerTest, ClusterStateTest, ReplicationFactorTest, TestCustomSort, AsyncMigrateRouteKeyTest, NoFacetTest, TestCloudManagedSchema, TestCSVLoader, HdfsLockFactoryTest, TestTrie, CoreAdminHandlerTest, TestPseudoReturnFields, DisMaxRequestHandlerTest, TestHighFrequencyDictionaryFactory, BinaryUpdateRequestHandlerTest, LegacyHTMLStripCharFilterTest, TestSurroundQueryParser, TestCodecSupport, TestManagedResourceStorage, OverseerRolesTest, TestDFRSimilarityFactory, AnalysisAfterCoreReloadTest, ShowFileRequestHandlerTest, PrimitiveFieldTypeTest, BadComponentTest, TestSchemaResource, TestStressRecovery, TriLevelCompositeIdRoutingTest, BlockDirectoryTest, TestSolrXmlPersistor, TestFiltering, TestSchemaSimilarityResource, TestJmxMonitoredMap, TestCSVResponseWriter, CollectionsAPIAsyncDistributedZkTest, ConvertedLegacyTest, TestSweetSpotSimilarityFactory, FieldMutatingUpdateProcessorTest, SpatialFilterTest, TermVectorComponentTest, TestSchemaNameResource, OpenCloseCoreStressTest, ZkControllerTest, DateFieldTest, SchemaVersionSpecificBehaviorTest, BasicZkTest, TestCloudManagedSchemaAddFields, TestElisionMultitermQuery, TestExtendedDismaxParser, SpellCheckComponentTest, TestDocSet, SolrPluginUtilsTest, HdfsCollectionsAPIDistributedZkTest, TermVectorComponentDistributedTest, CollectionsAPIDistributedZkTest, DocumentBuilderTest, TestCopyFieldCollectionResource, TestHashPartitioner, TestSolrXMLSerializer, TestReRankQParserPlugin, TestJmxIntegration, ZkNodePropsTest, RequestHandlersTest, TestExpandComponent, DateMathParserTest, TestReload, HighlighterMaxOffsetTest, CoreAdminCreateDiscoverTest, AssignTest, MultiTermTest, TestFastLRUCache, PeerSyncTest, DeleteShardTest, InfoHandlerTest]
   [junit4] Completed in 0.90s, 2 tests, 1 error <<< FAILURES!

[...truncated 493 lines...]
   [junit4] Suite: org.apache.solr.MinimalSchemaTest
   [junit4]   2> Creating dataDir: /Users/jenkins/workspace/Lucene-Solr-trunk-MacOSX/solr/build/solr-core/test/J0/./temp/solr.MinimalSchemaTest-7968162ACC5089E2-001/init-core-data-001
   [junit4]   2> 2966477 T10676 oas.SolrTestCaseJ4.buildSSLConfig Randomized ssl (true) and clientAuth (false)
   [junit4]   2> 2966478 T10676 oas.SolrTestCaseJ4.initCore ####initCore
   [junit4]   2> 2966478 T10676 oasc.SolrResourceLoader.<init> new SolrResourceLoader for directory: '/Users/jenkins/workspace/Lucene-Solr-trunk-MacOSX/solr/core/src/test-files/solr/collection1/'
   [junit4]   2> 2966479 T10676 oasc.SolrResourceLoader.replaceClassLoader Adding 'file:/Users/jenkins/workspace/Lucene-Solr-trunk-MacOSX/solr/core/src/test-files/solr/collection1/lib/.svn/' to classloader
   [junit4]   2> 2966480 T10676 oasc.SolrResourceLoader.replaceClassLoader Adding 'file:/Users/jenkins/workspace/Lucene-Solr-trunk-MacOSX/solr/core/src/test-files/solr/collection1/lib/classes/' to classloader
   [junit4]   2> 2966480 T10676 oasc.SolrResourceLoader.replaceClassLoader Adding 'file:/Users/jenkins/workspace/Lucene-Solr-trunk-MacOSX/solr/core/src/test-files/solr/collection1/lib/README' to classloader
   [junit4]   2> 2966568 T10676 oasc.SolrConfig.<init> Using Lucene MatchVersion: LUCENE_5_0
   [junit4]   2> 2966598 T10676 oasc.SolrConfig.<init> Loaded SolrConfig: solr/collection1/conf/solrconfig.xml
   [junit4]   2> 2966601 T10676 oass.IndexSchema.readSchema Reading Solr Schema from solr/collection1/conf/schema-minimal.xml
   [junit4]   2> 2966605 T10676 oass.IndexSchema.readSchema [null] Schema name=minimal
   [junit4]   2> 2966611 T10676 oass.IndexSchema.readSchema WARN no uniqueKey specified in schema.
   [junit4]   2> 2966612 T10676 oasc.SolrResourceLoader.locateSolrHome JNDI not configured for solr (NoInitialContextEx)
   [junit4]   2> 2966612 T10676 oasc.SolrResourceLoader.locateSolrHome using system property solr.solr.home: /Users/jenkins/workspace/Lucene-Solr-trunk-MacOSX/solr/core/src/test-files/solr
   [junit4]   2> 2966612 T10676 oasc.SolrResourceLoader.<init> new SolrResourceLoader for directory: '/Users/jenkins/workspace/Lucene-Solr-trunk-MacOSX/solr/core/src/test-files/solr/'
   [junit4]   2> 2966645 T10676 oasc.CoreContainer.<init> New CoreContainer 1397303362
   [junit4]   2> 2966646 T10676 oasc.CoreContainer.load Loading cores into CoreContainer [instanceDir=/Users/jenkins/workspace/Lucene-Solr-trunk-MacOSX/solr/core/src/test-files/solr/]
   [junit4]   2> 2966647 T10676 oashc.HttpShardHandlerFactory.getParameter Setting socketTimeout to: 0
   [junit4]   2> 2966647 T10676 oashc.HttpShardHandlerFactory.getParameter Setting urlScheme to: null
   [junit4]   2> 2966647 T10676 oashc.HttpShardHandlerFactory.getParameter Setting connTimeout to: 0
   [junit4]   2> 2966648 T10676 oashc.HttpShardHandlerFactory.getParameter Setting maxConnectionsPerHost to: 20
   [junit4]   2> 2966648 T10676 oashc.HttpShardHandlerFactory.getParameter Setting corePoolSize to: 0
   [junit4]   2> 2966648 T10676 oashc.HttpShardHandlerFactory.getParameter Setting maximumPoolSize to: 2147483647
   [junit4]   2> 2966648 T10676 oashc.HttpShardHandlerFactory.getParameter Setting maxThreadIdleTime to: 5
   [junit4]   2> 2966649 T10676 oashc.HttpShardHandlerFactory.getParameter Setting sizeOfQueue to: -1
   [junit4]   2> 2966649 T10676 oashc.HttpShardHandlerFactory.getParameter Setting fairnessPolicy to: false
   [junit4]   2> 2966653 T10676 oasl.LogWatcher.createWatcher SLF4J impl is org.slf4j.impl.Log4jLoggerFactory
   [junit4]   2> 2966653 T10676 oasl.LogWatcher.newRegisteredLogWatcher Registering Log Listener [Log4j (org.slf4j.impl.Log4jLoggerFactory)]
   [junit4]   2> 2966653 T10676 oasc.CoreContainer.load Host Name: 
   [junit4]   2> 2966657 T10677 oasc.SolrResourceLoader.<init> new SolrResourceLoader for directory: '/Users/jenkins/workspace/Lucene-Solr-trunk-MacOSX/solr/core/src/test-files/solr/collection1/'
   [junit4]   2> 2966658 T10677 oasc.SolrResourceLoader.replaceClassLoader Adding 'file:/Users/jenkins/workspace/Lucene-Solr-trunk-MacOSX/solr/core/src/test-files/solr/collection1/lib/.svn/' to classloader
   [junit4]   2> 2966659 T10677 oasc.SolrResourceLoader.replaceClassLoader Adding 'file:/Users/jenkins/workspace/Lucene-Solr-trunk-MacOSX/solr/core/src/test-files/solr/collection1/lib/classes/' to classloader
   [junit4]   2> 2966659 T10677 oasc.SolrResourceLoader.replaceClassLoader Adding 'file:/Users/jenkins/workspace/Lucene-Solr-trunk-MacOSX/solr/core/src/test-files/solr/collection1/lib/README' to classloader
   [junit4]   2> 2966707 T10677 oasc.SolrConfig.<init> Using Lucene MatchVersion: LUCENE_5_0
   [junit4]   2> 2966754 T10677 oasc.SolrConfig.<init> Loaded SolrConfig: solr/collection1/conf/solrconfig.xml
   [junit4]   2> 2966756 T10677 oass.IndexSchema.readSchema Reading Solr Schema from solr/collection1/conf/schema-minimal.xml
   [junit4]   2> 2966759 T10677 oass.IndexSchema.readSchema [collection1] Schema name=minimal
   [junit4]   2> 2966762 T10677 oass.IndexSchema.readSchema WARN no uniqueKey specified in schema.
   [junit4]   2> 2966764 T10677 oasc.CoreContainer.create Creating SolrCore 'collection1' using configuration from instancedir /Users/jenkins/workspace/Lucene-Solr-trunk-MacOSX/solr/core/src/test-files/solr/collection1/
   [junit4]   2> 2966764 T10677 oasc.SolrCore.initDirectoryFactory org.apache.solr.core.MockDirectoryFactory
   [junit4]   2> 2966765 T10677 oasc.SolrCore.<init> [collection1] Opening new SolrCore at /Users/jenkins/workspace/Lucene-Solr-trunk-MacOSX/solr/core/src/test-files/solr/collection1/, dataDir=/Users/jenkins/workspace/Lucene-Solr-trunk-MacOSX/solr/build/solr-core/test/J0/./temp/solr.MinimalSchemaTest-7968162ACC5089E2-001/init-core-data-001/
   [junit4]   2> 2966765 T10677 oasc.JmxMonitoredMap.<init> JMX monitoring is enabled. Adding Solr mbeans to JMX Server: com.sun.jmx.mbeanserver.JmxMBeanServer@159e00a1
   [junit4]   2> 2966767 T10677 oasc.CachingDirectoryFactory.get return new directory for /Users/jenkins/workspace/Lucene-Solr-trunk-MacOSX/solr/build/solr-core/test/J0/./temp/solr.MinimalSchemaTest-7968162ACC5089E2-001/init-core-data-001
   [junit4]   2> 2966767 T10677 oasc.SolrCore.getNewIndexDir New index directory detected: old=null new=/Users/jenkins/workspace/Lucene-Solr-trunk-MacOSX/solr/build/solr-core/test/J0/./temp/solr.MinimalSchemaTest-7968162ACC5089E2-001/init-core-data-001/index/
   [junit4]   2> 2966767 T10677 oasc.SolrCore.initIndex WARN [collection1] Solr index directory '/Users/jenkins/workspace/Lucene-Solr-trunk-MacOSX/solr/build/solr-core/test/J0/./temp/solr.MinimalSchemaTest-7968162ACC5089E2-001/init-core-data-001/index' doesn't exist. Creating new index...
   [junit4]   2> 2966768 T10677 oasc.CachingDirectoryFactory.get return new directory for /Users/jenkins/workspace/Lucene-Solr-trunk-MacOSX/solr/build/solr-core/test/J0/./temp/solr.MinimalSchemaTest-7968162ACC5089E2-001/init-core-data-001/index
   [junit4]   2> 2966769 T10677 oasu.RandomMergePolicy.<init> RandomMergePolicy wrapping class org.apache.lucene.index.AlcoholicMergePolicy: [AlcoholicMergePolicy: minMergeSize=0, mergeFactor=10, maxMergeSize=223762848, maxMergeSizeForForcedMerge=9223372036854775807, calibrateSizeByDeletes=true, maxMergeDocs=2147483647, maxCFSSegmentSizeMB=8.796093022207999E12, noCFSRatio=0.1]
   [junit4]   2> 2966770 T10677 oasc.SolrDeletionPolicy.onCommit SolrDeletionPolicy.onCommit: commits: num=1
   [junit4]   2> 		commit{dir=RateLimitedDirectoryWrapper(MockDirectoryWrapper(RAMDirectory@7fb2568b lockFactory=org.apache.lucene.store.SingleInstanceLockFactory@5317abd6)),segFN=segments_1,generation=1}
   [junit4]   2> 2966770 T10677 oasc.SolrDeletionPolicy.updateCommits newest commit generation = 1
   [junit4]   2> 2966770 T10677 oasc.SolrCore.initWriters created xml: solr.XMLResponseWriter
   [junit4]   2> 2966774 T10677 oasup.UpdateRequestProcessorChain.init creating updateRequestProcessorChain "dedupe"
   [junit4]   2> 2966775 T10677 oasup.UpdateRequestProcessorChain.init inserting DistributedUpdateProcessorFactory into updateRequestProcessorChain "dedupe"
   [junit4]   2> 2966775 T10677 oasup.UpdateRequestProcessorChain.init creating updateRequestProcessorChain "dedupe-allfields"
   [junit4]   2> 2966775 T10677 oasup.UpdateRequestProcessorChain.init inserting DistributedUpdateProcessorFactory into updateRequestProcessorChain "dedupe-allfields"
   [junit4]   2> 2966775 T10677 oasup.UpdateRequestProcessorChain.init creating updateRequestProcessorChain "stored_sig"
   [junit4]   2> 2966776 T10677 oasup.UpdateRequestProcessorChain.init inserting DistributedUpdateProcessorFactory into updateRequestProcessorChain "stored_sig"
   [junit4]   2> 2966776 T10677 oasup.UpdateRequestProcessorChain.init creating updateRequestProcessorChain "uniq-fields"
   [junit4]   2> 2966776 T10677 oasup.UpdateRequestProcessorChain.init inserting DistributedUpdateProcessorFactory into updateRequestProcessorChain "uniq-fields"
   [junit4]   2> 2966776 T10677 oasup.UpdateRequestProcessorChain.init creating updateRequestProcessorChain "distrib-dup-test-chain-explicit"
   [junit4]   2> 2966777 T10677 oasup.UpdateRequestProcessorChain.init creating updateRequestProcessorChain "distrib-dup-test-chain-implicit"
   [junit4]   2> 2966778 T10677 oasup.UpdateRequestProcessorChain.init inserting DistributedUpdateProcessorFactory into updateRequestProcessorChain "distrib-dup-test-chain-implicit"
   [junit4]   2> 2966779 T10677 oasc.SolrCore.loadUpdateProcessorChains no updateRequestProcessorChain defined as default, creating implicit default
   [junit4]   2> 2966780 T10677 oasc.RequestHandlers.initHandlersFromConfig adding lazy requestHandler: solr.ReplicationHandler
   [junit4]   2> 2966781 T10677 oasc.RequestHandlers.initHandlersFromConfig created /replication: solr.ReplicationHandler
   [junit4]   2> 2966781 T10677 oasc.RequestHandlers.initHandlersFromConfig created standard: solr.StandardRequestHandler
   [junit4]   2> 2966782 T10677 oasc.RequestHandlers.initHandlersFromConfig created /get: solr.RealTimeGetHandler
   [junit4]   2> 2966783 T10677 oasc.RequestHandlers.initHandlersFromConfig created dismax: solr.SearchHandler
   [junit4]   2> 2966783 T10677 oasc.RequestHandlers.initHandlersFromConfig created mock: org.apache.solr.core.MockQuerySenderListenerReqHandler
   [junit4]   2> 2966784 T10677 oasc.RequestHandlers.initHandlersFromConfig created /admin/: org.apache.solr.handler.admin.AdminHandlers
   [junit4]   2> 2966784 T10677 oasc.RequestHandlers.initHandlersFromConfig created /admin/file: solr.admin.ShowFileRequestHandler
   [junit4]   2> 2966785 T10677 oasc.RequestHandlers.initHandlersFromConfig created /admin/fileedit: solr.admin.EditFileRequestHandler
   [junit4]   2> 2966786 T10677 oasc.RequestHandlers.initHandlersFromConfig created defaults: solr.StandardRequestHandler
   [junit4]   2> 2966786 T10677 oasc.RequestHandlers.initHandlersFromConfig adding lazy requestHandler: solr.StandardRequestHandler
   [junit4]   2> 2966786 T10677 oasc.RequestHandlers.initHandlersFromConfig created lazy: solr.StandardRequestHandler
   [junit4]   2> 2966787 T10677 oasc.RequestHandlers.initHandlersFromConfig created /update: solr.UpdateRequestHandler
   [junit4]   2> 2966788 T10677 oasc.RequestHandlers.initHandlersFromConfig created /terms: org.apache.solr.handler.component.SearchHandler
   [junit4]   2> 2966788 T10677 oasc.RequestHandlers.initHandlersFromConfig created spellCheckCompRH: org.apache.solr.handler.component.SearchHandler
   [junit4]   2> 2966789 T10677 oasc.RequestHandlers.initHandlersFromConfig created spellCheckCompRH_Direct: org.apache.solr.handler.component.SearchHandler
   [junit4]   2> 2966791 T10677 oasc.RequestHandlers.initHandlersFromConfig created spellCheckWithWordbreak: org.apache.solr.handler.component.SearchHandler
   [junit4]   2> 2966791 T10677 oasc.RequestHandlers.initHandlersFromConfig created spellCheckWithWordbreak_Direct: org.apache.solr.handler.component.SearchHandler
   [junit4]   2> 2966792 T10677 oasc.RequestHandlers.initHandlersFromConfig created spellCheckCompRH1: org.apache.solr.handler.component.SearchHandler
   [junit4]   2> 2966793 T10677 oasc.RequestHandlers.initHandlersFromConfig created mltrh: org.apache.solr.handler.component.SearchHandler
   [junit4]   2> 2966793 T10677 oasc.RequestHandlers.initHandlersFromConfig created tvrh: org.apache.solr.handler.component.SearchHandler
   [junit4]   2> 2966794 T10677 oasc.RequestHandlers.initHandlersFromConfig created /mlt: solr.MoreLikeThisHandler
   [junit4]   2> 2966795 T10677 oasc.RequestHandlers.initHandlersFromConfig created /debug/dump: solr.DumpRequestHandler
   [junit4]   2> 2966806 T10677 oashl.XMLLoader.init xsltCacheLifetimeSeconds=60
   [junit4]   2> 2966806 T10677 oasc.SolrCore.initDeprecatedSupport WARN solrconfig.xml uses deprecated <admin/gettableFiles>, Please update your config to use the ShowFileRequestHandler.
   [junit4]   2> 2966809 T10677 oasu.CommitTracker.<init> Hard AutoCommit: disabled
   [junit4]   2> 2966810 T10677 oasu.CommitTracker.<init> Soft AutoCommit: disabled
   [junit4]   2> 2966811 T10677 oasu.RandomMergePolicy.<init> RandomMergePolicy wrapping class org.apache.lucene.index.TieredMergePolicy: [TieredMergePolicy: maxMergeAtOnce=17, maxMergeAtOnceExplicit=32, maxMergedSegmentMB=88.1640625, floorSegmentMB=0.908203125, forceMergeDeletesPctAllowed=24.321106420138243, segmentsPerTier=50.0, maxCFSSegmentSizeMB=8.796093022207999E12, noCFSRatio=0.0
   [junit4]   2> 2966811 T10677 oasc.SolrDeletionPolicy.onInit SolrDeletionPolicy.onInit: commits: num=1
   [junit4]   2> 		commit{dir=RateLimitedDirectoryWrapper(MockDirectoryWrapper(RAMDirectory@7fb2568b lockFactory=org.apache.lucene.store.SingleInstanceLockFactory@5317abd6)),segFN=segments_1,generation=1}
   [junit4]   2> 2966811 T10677 oasc.SolrDeletionPolicy.updateCommits newest commit generation = 1
   [junit4]   2> 2966812 T10677 oass.SolrIndexSearcher.<init> Opening Searcher@5e0d8624[collection1] main
   [junit4]   2> 2966813 T10677 oasr.RestManager.init Initializing RestManager with initArgs: {storageIO=org.apache.solr.rest.ManagedResourceStorage$InMemoryStorageIO}
   [junit4]   2> 2966813 T10677 oasr.ManagedResourceStorage.load Reading _rest_managed.json using InMemoryStorage
   [junit4]   2> 2966813 T10677 oasr.ManagedResource.reloadFromStorage WARN No stored data found for /rest/managed
   [junit4]   2> 2966814 T10677 oasr.ManagedResource.notifyObserversDuringInit WARN No registered observers for /rest/managed
   [junit4]   2> 2966814 T10677 oasr.RestManager.init Initializing 0 registered ManagedResources
   [junit4]   2> 2966814 T10677 oashc.SpellCheckComponent.inform Initializing spell checkers
   [junit4]   2> 2966825 T10677 oass.DirectSolrSpellChecker.init init: {name=direct,classname=DirectSolrSpellChecker,field=lowerfilt,minQueryLength=3}
   [junit4]   2> 2966868 T10678 oasc.SolrCore.registerSearcher [collection1] Registered new searcher Searcher@5e0d8624[collection1] main{UninvertingDirectoryReader()}
   [junit4]   2> 2966873 T10677 oasc.CoreContainer.registerCore registering core: collection1
   [junit4]   2> 2966876 T10676 oas.SolrTestCaseJ4.initCore ####initCore end
   [junit4]   2> ASYNC  NEW_CORE C2103 name=collection1 org.apache.solr.core.SolrCore@2583378
   [junit4]   2> 2966878 T10676 C2103 oasup.LogUpdateProcessor.finish [collection1] webapp=null path=null params={} {add=[(null)]} 0 2
   [junit4]   2> 2966881 T10676 C2103 oasup.LogUpdateProcessor.finish [collection1] webapp=null path=null params={} {add=[(null)]} 0 1
   [junit4]   2> 2966882 T10676 C2103 oasu.DirectUpdateHandler2.commit start commit{,optimize=false,openSearcher=true,waitSearcher=true,expungeDeletes=false,softCommit=false,prepareCommit=false}
   [junit4]   2> 2966884 T10676 C2103 oasc.SolrDeletionPolicy.onCommit SolrDeletionPolicy.onCommit: commits: num=2
   [junit4]   2> 		commit{dir=RateLimitedDirectoryWrapper(MockDirectoryWrapper(RAMDirectory@7fb2568b lockFactory=org.apache.lucene.store.SingleInstanceLockFactory@5317abd6)),segFN=segments_1,generation=1}
   [junit4]   2> 		commit{dir=RateLimitedDirectoryWrapper(MockDirectoryWrapper(RAMDirectory@7fb2568b lockFactory=org.apache.lucene.store.SingleInstanceLockFactory@5317abd6)),segFN=segments_2,generation=2}
   [junit4]   2> 2966884 T10676 C2103 oasc.SolrDeletionPolicy.updateCommits newest commit generation = 2
   [junit4]   2> 2966886 T10676 C2103 oass.SolrIndexSearcher.<init> Opening Searcher@cc4eaeb[collection1] main
   [junit4]   2> 2966886 T10676 C2103 oasu.DirectUpdateHandler2.commit end_commit_flush
   [junit4]   2> 2966889 T10678 oasc.SolrCore.registerSearcher [collection1] Registered new searcher Searcher@cc4eaeb[collection1] main{UninvertingDirectoryReader(Uninverting(_0(5.0):c2))}
   [junit4]   2> 2966889 T10676 C2103 oasup.LogUpdateProcessor.finish [collection1] webapp=null path=null params={} {commit=} 0 8
   [junit4]   2> 2966890 T10676 C2103 oasu.DirectUpdateHandler2.commit start commit{,optimize=true,openSearcher=true,waitSearcher=true,expungeDeletes=false,softCommit=false,prepareCommit=false}
   [junit4]   2> 2966894 T10676 C2103 oasc.SolrDeletionPolicy.onCommit SolrDeletionPolicy.onCommit: commits: num=2
   [junit4]   2> 		commit{dir=RateLimitedDirectoryWrapper(MockDirectoryWrapper(RAMDirectory@7fb2568b lockFactory=org.apache.lucene.store.SingleInstanceLockFactory@5317abd6)),segFN=segments_2,generation=2}
   [junit4]   2> 		commit{dir=RateLimitedDirectoryWrapper(MockDirectoryWrapper(RAMDirectory@7fb2568b lockFactory=org.apache.lucene.store.SingleInstanceLockFactory@5317abd6)),segFN=segments_3,generation=3}
   [junit4]   2> 2966895 T10676 C2103 oasc.SolrDeletionPolicy.updateCommits newest commit generation = 3
   [junit4]   2> 2966896 T10676 C2103 oass.SolrIndexSearcher.<init> Opening Searcher@2dcb402[collection1] main
   [junit4]   2> 2966896 T10676 C2103 oasu.DirectUpdateHandler2.commit end_commit_flush
   [junit4]   2> 2966898 T10678 oasc.SolrCore.registerSearcher [collection1] Registered new searcher Searcher@2dcb402[collection1] main{UninvertingDirectoryReader(Uninverting(_1(5.0):C2))}
   [junit4]   2> 2966899 T10676 C2103 oasup.LogUpdateProcessor.finish [collection1] webapp=null path=null params={} {optimize=} 0 9
   [junit4]   2> 2966904 T10676 oas.SolrTestCaseJ4.setUp ###Starting testAllConfiguredHandlers
   [junit4]   2> 2966905 T10676 C2103 oasc.SolrCore.execute [collection1] webapp=null path=null params={q=foo:bar&qt=standard&omitHeader=false} hits=0 status=0 QTime=1 
   [junit4]   2> 2966905 T10676 C2103 oasc.SolrCore.execute [collection1] webapp=null path=null params={q=foo:bar&qt=&omitHeader=false} hits=0 status=0 QTime=0 
   [junit4]   2> 2966906 T10676 C2103 oasc.SolrCore.execute [collection1] webapp=null path=null params={q=foo:bar&qt=/admin/mbeans&omitHeader=false} status=0 QTime=0 
   [junit4]   2> 2966908 T10676 C2103 oasc.SolrCore.execute [collection1] webapp=null path=null params={q=foo:bar&qt=spellCheckCompRH&omitHeader=false} hits=0 status=0 QTime=0 
   [junit4]   2> 2966909 T10676 C2103 oasc.SolrCore.execute [collection1] webapp=null path=null params={q=foo:bar&qt=lazy&omitHeader=false} hits=0 status=0 QTime=1 
   [junit4]   2> 2966909 T10676 C2103 oasc.SolrCore.execute [collection1] webapp=null path=null params={q=foo:bar&qt=/admin/luke&omitHeader=false} status=0 QTime=0 
   [junit4]   2> 2966910 T10676 C2103 oasc.SolrCore.execute [collection1] webapp=null path=null params={q=foo:bar&qt=spellCheckWithWordbreak_Direct&omitHeader=false} hits=0 status=0 QTime=0 
   [junit4]   2> 2966911 T10676 C2103 oasc.SolrCore.execute [collection1] webapp=null path=null params={q=foo:bar&qt=tvrh&omitHeader=false} hits=0 status=0 QTime=0 
   [junit4]   2> 2966912 T10676 C2103 oasc.SolrCore.execute [collection1] webapp=null path=null params={q=foo:bar&qt=/get&omitHeader=false} status=0 QTime=1 
   [junit4]   2> 2966913 T10676 C2103 oasc.SolrCore.execute [collection1] webapp=null path=null params={q=foo:bar&qt=/admin/properties&omitHeader=false} status=0 QTime=0 
   [junit4]   2> 2966914 T10676 C2103 oasc.SolrCore.execute [collection1] webapp=null path=null params={q=foo:bar&qt=mltrh&omitHeader=false} hits=0 status=0 QTime=0 
   [junit4]   2> 2966918 T10676 C2103 oasc.SolrCore.execute [collection1] webapp=null path=null params={q=foo:bar&qt=/admin/threads&omitHeader=false} status=0 QTime=3 
   [junit4]   2> 2966920 T10676 C2103 oasc.SolrCore.execute [collection1] webapp=null path=null params={q=foo:bar&qt=spellCheckCompRH1&omitHeader=false} hits=0 status=0 QTime=1 
   [junit4]   2> 2966922 T10676 oas.SolrTestCaseJ4.tearDown ###Ending testAllConfiguredHandlers
   [junit4]   2> NOTE: reproduce with: ant test  -Dtestcase=MinimalSchemaTest -Dtests.method=testAllConfiguredHandlers -Dtests.seed=7968162ACC5089E2 -Dtests.slow=true -Dtests.locale=ar_SD -Dtests.timezone=Asia/Krasnoyarsk -Dtests.file.encoding=US-ASCII
   [junit4] ERROR   0.05s | MinimalSchemaTest.testAllConfiguredHandlers <<<
   [junit4]    > Throwable #1: java.lang.NoClassDefFoundError: Could not initialize class java.lang.UNIXProcess
   [junit4]    > 	at __randomizedtesting.SeedInfo.seed([7968162ACC5089E2:9476AD10475D8866]:0)
   [junit4]    > 	at java.lang.ProcessImpl.start(ProcessImpl.java:130)
   [junit4]    > 	at java.lang.ProcessBuilder.start(ProcessBuilder.java:1023)
   [junit4]    > 	at java.lang.Runtime.exec(Runtime.java:620)
   [junit4]    > 	at java.lang.Runtime.exec(Runtime.java:450)
   [junit4]    > 	at java.lang.Runtime.exec(Runtime.java:347)
   [junit4]    > 	at org.apache.solr.handler.admin.SystemInfoHandler.execute(SystemInfoHandler.java:220)
   [junit4]    > 	at org.apache.solr.handler.admin.SystemInfoHandler.getSystemInfo(SystemInfoHandler.java:176)
   [junit4]    > 	at org.apache.solr.handler.admin.SystemInfoHandler.handleRequestBody(SystemInfoHandler.java:97)
   [junit4]    > 	at org.apache.solr.handler.RequestHandlerBase.handleRequest(RequestHandlerBase.java:135)
   [junit4]    > 	at org.apache.solr.core.SolrCore.execute(SolrCore.java:1980)
   [junit4]    > 	at org.apache.solr.util.TestHarness.query(TestHarness.java:295)
   [junit4]    > 	at org.apache.solr.util.TestHarness.query(TestHarness.java:278)
   [junit4]    > 	at org.apache.solr.SolrTestCaseJ4.assertQ(SolrTestCaseJ4.java:693)
   [junit4]    > 	at org.apache.solr.MinimalSchemaTest.testAllConfiguredHandlers(MinimalSchemaTest.java:115)
   [junit4]    > 	at java.lang.Thread.run(Thread.java:745)
   [junit4]   2> 2966951 T10676 oas.SolrTestCaseJ4.setUp ###Starting testLuke
   [junit4]   2> 2966952 T10676 C2103 oasc.SolrCore.execute [collection1] webapp=null path=null params={qt=/admin/luke} status=0 QTime=1 
   [junit4]   2> 2966953 T10676 C2103 oasc.SolrCore.execute [collection1] webapp=null path=null params={qt=/admin/luke&show=schema} status=0 QTime=0 
   [junit4]   2> 2966954 T10676 oas.SolrTestCaseJ4.tearDown ###Ending testLuke
   [junit4]   2> 2966959 T10676 oas.SolrTestCaseJ4.setUp ###Starting testSimpleQueries
   [junit4]   2> 2966960 T10676 C2103 oasc.SolrCore.execute [collection1] webapp=null path=null params={q=subject:Hoss&qt=standard&start=0&rows=20&version=2.2} hits=1 status=0 QTime=1 
   [junit4]   2> 2966961 T10676 C2103 oasc.SolrCore.execute [collection1] webapp=null path=null params={q=subject:Yonik&qt=standard&start=0&rows=20&version=2.2} hits=1 status=0 QTime=1 
   [junit4]   2> 2966961 T10676 oas.SolrTestCaseJ4.tearDown ###Ending testSimpleQueries
   [junit4]   2> 2966963 T10676 oas.SolrTestCaseJ4.deleteCore ###deleteCore
   [junit4]   2> 2966963 T10676 oasc.CoreContainer.shutdown Shutting down CoreContainer instance=1397303362
   [junit4]   2> 2966964 T10676 oasc.SolrCore.close [collection1]  CLOSING SolrCore org.apache.solr.core.SolrCore@2583378
   [junit4]   2> 2966978 T10676 oasu.DirectUpdateHandler2.close closing DirectUpdateHandler2{commits=1,autocommits=0,soft autocommits=0,optimizes=1,rollbacks=0,expungeDeletes=0,docsPending=0,adds=0,deletesById=0,deletesByQuery=0,errors=0,cumulative_adds=2,cumulative_deletesById=0,cumulative_deletesByQuery=0,cumulative_errors=0,transaction_logs_total_size=132,transaction_logs_total_number=1}
   [junit4]   2> 2966978 T10676 oasu.SolrCoreState.decrefSolrCoreState Closing SolrCoreState
   [junit4]   2> 2966978 T10676 oasu.DefaultSolrCoreState.closeIndexWriter SolrCoreState ref count has reached 0 - closing IndexWriter
   [junit4]   2> 2966979 T10676 oasu.DefaultSolrCoreState.closeIndexWriter closing IndexWriter with IndexWriterCloser
   [junit4]   2> 2966980 T10676 oasc.SolrCore.closeSearcher [collection1] Closing main searcher on request.
   [junit4]   2> 2966980 T10676 oasc.CachingDirectoryFactory.close Closing MockDirectoryFactory - 2 directories currently being tracked
   [junit4]   2> 2966980 T10676 oasc.CachingDirectoryFactory.closeCacheValue looking to close /Users/jenkins/workspace/Lucene-Solr-trunk-MacOSX/solr/build/solr-core/test/J0/./temp/solr.MinimalSchemaTest-7968162ACC5089E2-001/init-core-data-001 [CachedDir<<refCount=0;path=/Users/jenkins/workspace/Lucene-Solr-trunk-MacOSX/solr/build/solr-core/test/J0/./temp/solr.MinimalSchemaTest-7968162ACC5089E2-001/init-core-data-001;done=false>>]
   [junit4]   2> 2966981 T10676 oasc.CachingDirectoryFactory.close Closing directory: /Users/jenkins/workspace/Lucene-Solr-trunk-MacOSX/solr/build/solr-core/test/J0/./temp/solr.MinimalSchemaTest-7968162ACC5089E2-001/init-core-data-001
   [junit4]   2> 2966981 T10676 oasc.CachingDirectoryFactory.closeCacheValue looking to close /Users/jenkins/workspace/Lucene-Solr-trunk-MacOSX/solr/build/solr-core/test/J0/./temp/solr.MinimalSchemaTest-7968162ACC5089E2-001/init-core-data-001/index [CachedDir<<refCount=0;path=/Users/jenkins/workspace/Lucene-Solr-trunk-MacOSX/solr/build/solr-core/test/J0/./temp/solr.MinimalSchemaTest-7968162ACC5089E2-001/init-core-data-001/index;done=false>>]
   [junit4]   2> 2966981 T10676 oasc.CachingDirectoryFactory.close Closing directory: /Users/jenkins/workspace/Lucene-Solr-trunk-MacOSX/solr/build/solr-core/test/J0/./temp/solr.MinimalSchemaTest-7968162ACC5089E2-001/init-core-data-001/index
   [junit4]   2> NOTE: leaving temporary files on disk at: /Users/jenkins/workspace/Lucene-Solr-trunk-MacOSX/solr/build/solr-core/test/J0/./temp/solr.MinimalSchemaTest-7968162ACC5089E2-001
   [junit4]   2> NOTE: test params are: codec=Lucene40, sim=DefaultSimilarity, locale=ar_SD, timezone=Asia/Krasnoyarsk
   [junit4]   2> NOTE: Mac OS X 10.8.5 x86_64/Oracle Corporation 1.8.0_05 (64-bit)/cpus=2,threads=1,free=262158864,total=536870912
   [junit4]   2> NOTE: All tests run in this JVM: [TestSolrQueryParserDefaultOperatorResource, TestPhraseSuggestions, TestManagedResource, FullSolrCloudDistribCmdsTest, TestAnalyzedSuggestions, SimpleFacetsTest, TestDistributedSearch, HdfsBasicDistributedZk2Test, QueryFacetTest, UpdateRequestProcessorFactoryTest, SoftAutoCommitTest, TestComplexPhraseQParserPlugin, TestClassNameShortening, ClusterStateUpdateTest, TestDefaultSimilarityFactory, ZkSolrClientTest, DistribDocExpirationUpdateProcessorTest, SuggesterTSTTest, DistributedDebugComponentTest, XsltUpdateRequestHandlerTest, TestRemoteStreaming, TestIndexingPerformance, TestReplicationHandler, DirectUpdateHandlerTest, SSLMigrationTest, StatelessScriptUpdateProcessorFactoryTest, HdfsBasicDistributedZkTest, TestDynamicFieldCollectionResource, TestCollationField, DefaultValueUpdateProcessorTest, DateRangeFieldTest, TestUtils, QueryElevationComponentTest, SimplePostToolTest, AbstractAnalyticsFacetTest, TestGroupingSearch, CoreAdminRequestStatusTest, OverseerCollectionProcessorTest, SliceStateTest, TestChildDocTransformer, LeaderElectionIntegrationTest, TestPartialUpdateDeduplication, QueryEqualityTest, TestStandardQParsers, OverseerStatusTest, TestSolrDeletionPolicy2, DebugComponentTest, TestValueSourceCache, TestBinaryResponseWriter, TestSolrIndexConfig, ExternalFileFieldSortTest, TestCoreContainer, TestLazyCores, TestFreeTextSuggestions, IndexBasedSpellCheckerTest, ClusterStateTest, ReplicationFactorTest, TestCustomSort, AsyncMigrateRouteKeyTest, NoFacetTest, TestCloudManagedSchema, TestCSVLoader, HdfsLockFactoryTest, TestTrie, CoreAdminHandlerTest, TestPseudoReturnFields, DisMaxRequestHandlerTest, TestHighFrequencyDictionaryFactory, BinaryUpdateRequestHandlerTest, LegacyHTMLStripCharFilterTest, TestSurroundQueryParser, TestCodecSupport, TestManagedResourceStorage, OverseerRolesTest, TestDFRSimilarityFactory, AnalysisAfterCoreReloadTest, ShowFileRequestHandlerTest, PrimitiveFieldTypeTest, BadComponentTest, TestSchemaResource, TestStressRecovery, TriLevelCompositeIdRoutingTest, BlockDirectoryTest, TestSolrXmlPersistor, TestFiltering, TestSchemaSimilarityResource, TestJmxMonitoredMap, TestCSVResponseWriter, CollectionsAPIAsyncDistributedZkTest, ConvertedLegacyTest, TestSweetSpotSimilarityFactory, FieldMutatingUpdateProcessorTest, SpatialFilterTest, TermVectorComponentTest, TestSchemaNameResource, OpenCloseCoreStressTest, ZkControllerTest, DateFieldTest, SchemaVersionSpecificBehaviorTest, BasicZkTest, TestCloudManagedSchemaAddFields, TestElisionMultitermQuery, TestExtendedDismaxParser, SpellCheckComponentTest, TestDocSet, SolrPluginUtilsTest, HdfsCollectionsAPIDistributedZkTest, TermVectorComponentDistributedTest, CollectionsAPIDistributedZkTest, DocumentBuilderTest, TestCopyFieldCollectionResource, TestHashPartitioner, TestSolrXMLSerializer, TestReRankQParserPlugin, TestJmxIntegration, ZkNodePropsTest, RequestHandlersTest, TestExpandComponent, DateMathParserTest, TestReload, HighlighterMaxOffsetTest, CoreAdminCreateDiscoverTest, AssignTest, MultiTermTest, TestFastLRUCache, PeerSyncTest, DeleteShardTest, InfoHandlerTest, PluginInfoTest, DeleteInactiveReplicaTest, DirectSolrConnectionTest, SpellPossibilityIteratorTest, TestNoOpRegenerator, CircularListTest, JSONWriterTest, TestManagedSchemaFieldResource, BadCopyFieldTest, TestZkChroot, TestInfoStreamLogging, DistributedSpellCheckComponentTest, FieldFacetTest, TestAnalyzeInfixSuggestions, TestLFUCache, ChaosMonkeyNothingIsSafeTest, OverseerTest, ParsingFieldUpdateProcessorsTest, TestManagedSchema, NotRequiredUniqueKeyTest, TestDynamicFieldResource, SpellingQueryConverterTest, TestDocBasedVersionConstraints, WordBreakSolrSpellCheckerTest, TestMultiCoreConfBootstrap, RankQueryTest, NoCacheHeaderTest, TestFaceting, TestStressReorder, TestUpdate, ShardRoutingTest, TestSolr4Spatial, DocValuesTest, ResourceLoaderTest, DOMUtilTest, TestSolrJ, PreAnalyzedUpdateProcessorTest, MigrateRouteKeyTest, FieldAnalysisRequestHandlerTest, LoggingHandlerTest, TestDefaultSearchFieldResource, DocValuesMultiTest, TestCollationFieldDocValues, HardAutoCommitTest, SolrInfoMBeanTest, RecoveryZkTest, QueryResultKeyTest, ConnectionManagerTest, ReturnFieldsTest, TestRecoveryHdfs, HighlighterTest, TestQueryUtils, TestCollapseQParserPlugin, RemoteQueryErrorTest, FileUtilsTest, HdfsWriteToMultipleCollectionsTest, TestOmitPositions, TestReplicationHandlerBackup, BlockCacheTest, TestDistributedGrouping, TestSystemIdResolver, CacheHeaderTest, SuggestComponentTest, DistributedSuggestComponentTest, TestWriterPerf, SignatureUpdateProcessorFactoryTest, JsonLoaderTest, TestConfigSets, TestRealTimeGet, TestMergePolicyConfig, TestLuceneMatchVersion, TestRequestStatusCollectionAPI, TestInitQParser, TestReloadAndDeleteDocs, TestRandomDVFaceting, BasicDistributedZkTest, ChaosMonkeySafeLeaderTest, BasicDistributedZk2Test, UnloadDistributedZkTest, SyncSliceTest, TestRandomFaceting, LeaderElectionTest, ZkCLITest, ShardRoutingCustomTest, SliceStateUpdateTest, AutoCommitTest, TestRecovery, TestJoin, TestStressVersions, DistributedTermsComponentTest, TestRangeQuery, SolrCoreTest, StatsComponentTest, SolrCmdDistributorTest, BadIndexSchemaTest, TestSort, TestFunctionQuery, BasicFunctionalityTest, TestBadConfig, TestIndexSearcher, CurrencyFieldOpenExchangeTest, DistributedQueryElevationComponentTest, CurrencyFieldXmlFileTest, SolrIndexSplitterTest, TestCoreDiscovery, SpellCheckCollatorTest, SuggesterFSTTest, SolrRequestParserTest, TestFoldingMultitermQuery, SuggesterTest, TestStressLucene, SuggesterWFSTTest, PolyFieldTest, SolrCoreCheckLockOnStartupTest, TestAtomicUpdateErrorCases, TestWordDelimiterFilterFactory, DirectUpdateHandlerOptimizeTest, SortByFunctionTest, DistanceFunctionTest, TestSolrDeletionPolicy1, LukeRequestHandlerTest, StandardRequestHandlerTest, DirectSolrSpellCheckerTest, TestReversedWildcardFilterFactory, DocumentAnalysisRequestHandlerTest, TestQueryTypes, FileBasedSpellCheckerTest, TermsComponentTest, XmlUpdateRequestHandlerTest, PathHierarchyTokenizerFactoryTest, MoreLikeThisHandlerTest, RequiredFieldsTest, TestSolrQueryParser, TestArbitraryIndexDir, FastVectorHighlighterTest, IndexSchemaRuntimeFieldTest, RegexBoostProcessorTest, IndexSchemaTest, MBeansHandlerTest, QueryParsingTest, UniqFieldsUpdateProcessorFactoryTest, TestPHPSerializedResponseWriter, PingRequestHandlerTest, CSVRequestHandlerTest, TestComponentsName, SearchHandlerTest, CoreContainerCoreInitFailuresTest, HighlighterConfigTest, SOLR749Test, TestQuerySenderListener, UpdateParamsTest, AlternateDirectoryTest, TestQuerySenderNoQuery, CopyFieldTest, ResponseLogComponentTest, SolrIndexConfigTest, SampleTest, TestBinaryField, TestSearchPerf, NumericFieldsTest, MinimalSchemaTest]
   [junit4] Completed in 0.54s, 3 tests, 1 error <<< FAILURES!

[...truncated 374 lines...]
BUILD FAILED
/Users/jenkins/workspace/Lucene-Solr-trunk-MacOSX/build.xml:467: The following error occurred while executing this line:
/Users/jenkins/workspace/Lucene-Solr-trunk-MacOSX/build.xml:447: The following error occurred while executing this line:
/Users/jenkins/workspace/Lucene-Solr-trunk-MacOSX/build.xml:45: The following error occurred while executing this line:
/Users/jenkins/workspace/Lucene-Solr-trunk-MacOSX/extra-targets.xml:37: The following error occurred while executing this line:
/Users/jenkins/workspace/Lucene-Solr-trunk-MacOSX/solr/build.xml:189: The following error occurred while executing this line:
/Users/jenkins/workspace/Lucene-Solr-trunk-MacOSX/solr/common-build.xml:496: The following error occurred while executing this line:
/Users/jenkins/workspace/Lucene-Solr-trunk-MacOSX/lucene/common-build.xml:1296: The following error occurred while executing this line:
/Users/jenkins/workspace/Lucene-Solr-trunk-MacOSX/lucene/common-build.xml:920: There were test failures: 416 suites, 1703 tests, 2 errors, 42 ignored (15 assumptions)

Total time: 108 minutes 10 seconds
Build step 'Invoke Ant' marked build as failure
Description set: Java: 64bit/jdk1.8.0 -XX:-UseCompressedOops -XX:+UseG1GC
Archiving artifacts
Recording test results
Email was triggered for: Failure - Any
Sending email for trigger: Failure - Any



Mime
View raw message