lucene-dev mailing list archives

Site index · List index
Message view « Date » · « Thread »
Top « Date » · « Thread »
From Apache Jenkins Server <jenk...@builds.apache.org>
Subject [JENKINS-MAVEN] Lucene-Solr-Maven-4.x #637: POMs out of sync
Date Mon, 02 Jun 2014 05:00:42 GMT
Build: https://builds.apache.org/job/Lucene-Solr-Maven-4.x/637/

2 tests failed.
REGRESSION:  org.apache.solr.cloud.OverseerTest.testOverseerFailure

Error Message:
Could not register as the leader because creating the ephemeral registration node in ZooKeeper
failed

Stack Trace:
org.apache.solr.common.SolrException: Could not register as the leader because creating the
ephemeral registration node in ZooKeeper failed
	at org.apache.zookeeper.KeeperException.create(KeeperException.java:119)
	at org.apache.zookeeper.KeeperException.create(KeeperException.java:51)
	at org.apache.zookeeper.ZooKeeper.create(ZooKeeper.java:783)
	at org.apache.solr.common.cloud.SolrZkClient$10.execute(SolrZkClient.java:432)
	at org.apache.solr.common.cloud.ZkCmdExecutor.retryOperation(ZkCmdExecutor.java:73)
	at org.apache.solr.common.cloud.SolrZkClient.makePath(SolrZkClient.java:429)
	at org.apache.solr.common.cloud.SolrZkClient.makePath(SolrZkClient.java:386)
	at org.apache.solr.common.cloud.SolrZkClient.makePath(SolrZkClient.java:373)
	at org.apache.solr.cloud.ShardLeaderElectionContextBase$1.execute(ElectionContext.java:127)
	at org.apache.solr.common.util.RetryUtil.retryOnThrowable(RetryUtil.java:34)
	at org.apache.solr.cloud.ShardLeaderElectionContextBase.runLeaderProcess(ElectionContext.java:122)
	at org.apache.solr.cloud.LeaderElector.runIamLeaderProcess(LeaderElector.java:142)
	at org.apache.solr.cloud.LeaderElector.checkIfIamLeader(LeaderElector.java:110)
	at org.apache.solr.cloud.LeaderElector.checkIfIamLeader(LeaderElector.java:134)
	at org.apache.solr.cloud.LeaderElector.joinElection(LeaderElector.java:267)
	at org.apache.solr.cloud.OverseerTest$MockZKController.publishState(OverseerTest.java:155)
	at org.apache.solr.cloud.OverseerTest.testOverseerFailure(OverseerTest.java:661)


FAILED:  org.apache.solr.cloud.HttpPartitionTest.testDistribSearch

Error Message:
No registered leader was found after waiting for 60000ms , collection: c8n_1x3_lf slice: shard1

Stack Trace:
org.apache.solr.common.SolrException: No registered leader was found after waiting for 60000ms
, collection: c8n_1x3_lf slice: shard1
	at __randomizedtesting.SeedInfo.seed([BA76D4C60884B8D:8A41E35417D72BB1]:0)
	at org.apache.solr.common.cloud.ZkStateReader.getLeaderRetry(ZkStateReader.java:545)
	at org.apache.solr.cloud.HttpPartitionTest.testRf3WithLeaderFailover(HttpPartitionTest.java:349)
	at org.apache.solr.cloud.HttpPartitionTest.doTest(HttpPartitionTest.java:148)




Build Log:
[...truncated 54697 lines...]
BUILD FAILED
/usr/home/hudson/hudson-slave/workspace/Lucene-Solr-Maven-4.x/build.xml:490: The following
error occurred while executing this line:
/usr/home/hudson/hudson-slave/workspace/Lucene-Solr-Maven-4.x/build.xml:182: The following
error occurred while executing this line:
/usr/home/hudson/hudson-slave/workspace/Lucene-Solr-Maven-4.x/extra-targets.xml:77: Java returned:
1

Total time: 198 minutes 2 seconds
Build step 'Invoke Ant' marked build as failure
Recording test results
Email was triggered for: Failure
Sending email for trigger: Failure



Mime
View raw message