lucene-dev mailing list archives

Site index · List index
Message view « Date » · « Thread »
Top « Date » · « Thread »
From Robert Muir <rcm...@gmail.com>
Subject Re: [JENKINS] Lucene-4x-Linux-Java7-64-test-only - Build # 24260 - Failure!
Date Thu, 19 Jun 2014 16:01:36 GMT
this is a real bug... ill fix

On Thu, Jun 19, 2014 at 11:54 AM,  <builder@flonkings.com> wrote:
> Build: builds.flonkings.com/job/Lucene-4x-Linux-Java7-64-test-only/24260/
>
> 1 tests failed.
> REGRESSION:  org.apache.lucene.util.TestFieldCacheSanityChecker.testInsanity1
>
> Error Message:
> CheckIndex failed
>
> Stack Trace:
> java.lang.RuntimeException: CheckIndex failed
>         at __randomizedtesting.SeedInfo.seed([55A55EBC9A4D4E5F:3E1B8730F613CE4F]:0)
>         at org.apache.lucene.util.TestUtil.checkIndex(TestUtil.java:205)
>         at org.apache.lucene.store.BaseDirectoryWrapper.close(BaseDirectoryWrapper.java:45)
>         at org.apache.lucene.util.TestFieldCacheSanityChecker.tearDown(TestFieldCacheSanityChecker.java:88)
>         at sun.reflect.GeneratedMethodAccessor3.invoke(Unknown Source)
>         at sun.reflect.DelegatingMethodAccessorImpl.invoke(DelegatingMethodAccessorImpl.java:43)
>         at java.lang.reflect.Method.invoke(Method.java:606)
>         at com.carrotsearch.randomizedtesting.RandomizedRunner.invoke(RandomizedRunner.java:1618)
>         at com.carrotsearch.randomizedtesting.RandomizedRunner$8.evaluate(RandomizedRunner.java:885)
>         at org.apache.lucene.util.TestRuleSetupTeardownChained$1.evaluate(TestRuleSetupTeardownChained.java:50)
>         at org.apache.lucene.util.TestRuleFieldCacheSanity$1.evaluate(TestRuleFieldCacheSanity.java:51)
>         at org.apache.lucene.util.AbstractBeforeAfterRule$1.evaluate(AbstractBeforeAfterRule.java:46)
>         at com.carrotsearch.randomizedtesting.rules.SystemPropertiesInvariantRule$1.evaluate(SystemPropertiesInvariantRule.java:55)
>         at org.apache.lucene.util.TestRuleThreadAndTestName$1.evaluate(TestRuleThreadAndTestName.java:49)
>         at org.apache.lucene.util.TestRuleIgnoreAfterMaxFailures$1.evaluate(TestRuleIgnoreAfterMaxFailures.java:65)
>         at org.apache.lucene.util.TestRuleMarkFailure$1.evaluate(TestRuleMarkFailure.java:48)
>         at com.carrotsearch.randomizedtesting.rules.StatementAdapter.evaluate(StatementAdapter.java:36)
>         at com.carrotsearch.randomizedtesting.ThreadLeakControl$StatementRunner.run(ThreadLeakControl.java:360)
>         at com.carrotsearch.randomizedtesting.ThreadLeakControl.forkTimeoutingTask(ThreadLeakControl.java:793)
>         at com.carrotsearch.randomizedtesting.ThreadLeakControl$3.evaluate(ThreadLeakControl.java:453)
>         at com.carrotsearch.randomizedtesting.RandomizedRunner.runSingleTest(RandomizedRunner.java:836)
>         at com.carrotsearch.randomizedtesting.RandomizedRunner$3.evaluate(RandomizedRunner.java:738)
>         at com.carrotsearch.randomizedtesting.RandomizedRunner$4.evaluate(RandomizedRunner.java:772)
>         at com.carrotsearch.randomizedtesting.RandomizedRunner$5.evaluate(RandomizedRunner.java:783)
>         at org.apache.lucene.util.AbstractBeforeAfterRule$1.evaluate(AbstractBeforeAfterRule.java:46)
>         at org.apache.lucene.util.TestRuleStoreClassName$1.evaluate(TestRuleStoreClassName.java:42)
>         at com.carrotsearch.randomizedtesting.rules.SystemPropertiesInvariantRule$1.evaluate(SystemPropertiesInvariantRule.java:55)
>         at com.carrotsearch.randomizedtesting.rules.NoShadowingOrOverridesOnMethodsRule$1.evaluate(NoShadowingOrOverridesOnMethodsRule.java:39)
>         at com.carrotsearch.randomizedtesting.rules.NoShadowingOrOverridesOnMethodsRule$1.evaluate(NoShadowingOrOverridesOnMethodsRule.java:39)
>         at com.carrotsearch.randomizedtesting.rules.StatementAdapter.evaluate(StatementAdapter.java:36)
>         at com.carrotsearch.randomizedtesting.rules.StatementAdapter.evaluate(StatementAdapter.java:36)
>         at com.carrotsearch.randomizedtesting.rules.StatementAdapter.evaluate(StatementAdapter.java:36)
>         at org.apache.lucene.util.TestRuleAssertionsRequired$1.evaluate(TestRuleAssertionsRequired.java:43)
>         at org.apache.lucene.util.TestRuleMarkFailure$1.evaluate(TestRuleMarkFailure.java:48)
>         at org.apache.lucene.util.TestRuleIgnoreAfterMaxFailures$1.evaluate(TestRuleIgnoreAfterMaxFailures.java:65)
>         at org.apache.lucene.util.TestRuleIgnoreTestSuites$1.evaluate(TestRuleIgnoreTestSuites.java:55)
>         at com.carrotsearch.randomizedtesting.rules.StatementAdapter.evaluate(StatementAdapter.java:36)
>         at com.carrotsearch.randomizedtesting.ThreadLeakControl$StatementRunner.run(ThreadLeakControl.java:360)
>         at java.lang.Thread.run(Thread.java:745)
>
>
>
>
> Build Log:
> [...truncated 1019 lines...]
>    [junit4] Suite: org.apache.lucene.util.TestFieldCacheSanityChecker
>    [junit4]   1> CheckIndex failed
>    [junit4]   1> Segments file=segments_1 numSegments=1 version=4.10 format=
>    [junit4]   1>   1 of 1: name=_0 docCount=334
>    [junit4]   1>     codec=Lucene49
>    [junit4]   1>     compound=true
>    [junit4]   1>     numFiles=3
>    [junit4]   1>     size (MB)=0.012
>    [junit4]   1>     diagnostics = {os=Linux, timestamp=1403193225970, java.vendor=Oracle
Corporation, lucene.version=4.10-SNAPSHOT, source=flush, java.version=1.7.0_55, os.arch=amd64,
os.version=3.2.0-26-generic}
>    [junit4]   1>     no deletions
>    [junit4]   1>     test: open reader.........OK
>    [junit4]   1>     test: check integrity.....OK
>    [junit4]   1>     test: check live docs.....OK
>    [junit4]   1>     test: fields..............OK [6 fields]
>    [junit4]   1>     test: field norms.........OK [0 fields]
>    [junit4]   1>     test: terms, freq, prox...ERROR: java.lang.IllegalArgumentException:
bufferSize must be greater than MIN_BUFFER_SIZE (got 8)
>    [junit4]   1> java.lang.IllegalArgumentException: bufferSize must be greater than
MIN_BUFFER_SIZE (got 8)
>    [junit4]   1>        at org.apache.lucene.store.BufferedIndexInput.checkBufferSize(BufferedIndexInput.java:111)
>    [junit4]   1>        at org.apache.lucene.store.BufferedIndexInput.setBufferSize(BufferedIndexInput.java:77)
>    [junit4]   1>        at org.apache.lucene.codecs.MultiLevelSkipListReader.loadSkipLevels(MultiLevelSkipListReader.java:244)
>    [junit4]   1>        at org.apache.lucene.codecs.MultiLevelSkipListReader.skipTo(MultiLevelSkipListReader.java:125)
>    [junit4]   1>        at org.apache.lucene.codecs.sep.SepPostingsReader$SepDocsEnum.advance(SepPostingsReader.java:395)
>    [junit4]   1>        at org.apache.lucene.index.CheckIndex.checkFields(CheckIndex.java:1113)
>    [junit4]   1>        at org.apache.lucene.index.CheckIndex.testPostings(CheckIndex.java:1325)
>    [junit4]   1>        at org.apache.lucene.index.CheckIndex.checkIndex(CheckIndex.java:631)
>    [junit4]   1>        at org.apache.lucene.util.TestUtil.checkIndex(TestUtil.java:201)
>    [junit4]   1>        at org.apache.lucene.store.BaseDirectoryWrapper.close(BaseDirectoryWrapper.java:45)
>    [junit4]   1>        at org.apache.lucene.util.TestFieldCacheSanityChecker.tearDown(TestFieldCacheSanityChecker.java:88)
>    [junit4]   1>        at sun.reflect.GeneratedMethodAccessor3.invoke(Unknown Source)
>    [junit4]   1>        at sun.reflect.DelegatingMethodAccessorImpl.invoke(DelegatingMethodAccessorImpl.java:43)
>    [junit4]   1>        at java.lang.reflect.Method.invoke(Method.java:606)
>    [junit4]   1>        at com.carrotsearch.randomizedtesting.RandomizedRunner.invoke(RandomizedRunner.java:1618)
>    [junit4]   1>        at com.carrotsearch.randomizedtesting.RandomizedRunner$8.evaluate(RandomizedRunner.java:885)
>    [junit4]   1>        at org.apache.lucene.util.TestRuleSetupTeardownChained$1.evaluate(TestRuleSetupTeardownChained.java:50)
>    [junit4]   1>        at org.apache.lucene.util.TestRuleFieldCacheSanity$1.evaluate(TestRuleFieldCacheSanity.java:51)
>    [junit4]   1>        at org.apache.lucene.util.AbstractBeforeAfterRule$1.evaluate(AbstractBeforeAfterRule.java:46)
>    [junit4]   1>        at com.carrotsearch.randomizedtesting.rules.SystemPropertiesInvariantRule$1.evaluate(SystemPropertiesInvariantRule.java:55)
>    [junit4]   1>        at org.apache.lucene.util.TestRuleThreadAndTestName$1.evaluate(TestRuleThreadAndTestName.java:49)
>    [junit4]   1>        at org.apache.lucene.util.TestRuleIgnoreAfterMaxFailures$1.evaluate(TestRuleIgnoreAfterMaxFailures.java:65)
>    [junit4]   1>        at org.apache.lucene.util.TestRuleMarkFailure$1.evaluate(TestRuleMarkFailure.java:48)
>    [junit4]   1>        at com.carrotsearch.randomizedtesting.rules.StatementAdapter.evaluate(StatementAdapter.java:36)
>    [junit4]   1>        at com.carrotsearch.randomizedtesting.ThreadLeakControl$StatementRunner.run(ThreadLeakControl.java:360)
>    [junit4]   1>        at com.carrotsearch.randomizedtesting.ThreadLeakControl.forkTimeoutingTask(ThreadLeakControl.java:793)
>    [junit4]   1>        at com.carrotsearch.randomizedtesting.ThreadLeakControl$3.evaluate(ThreadLeakControl.java:453)
>    [junit4]   1>        at com.carrotsearch.randomizedtesting.RandomizedRunner.runSingleTest(RandomizedRunner.java:836)
>    [junit4]   1>        at com.carrotsearch.randomizedtesting.RandomizedRunner$3.evaluate(RandomizedRunner.java:738)
>    [junit4]   1>        at com.carrotsearch.randomizedtesting.RandomizedRunner$4.evaluate(RandomizedRunner.java:772)
>    [junit4]   1>        at com.carrotsearch.randomizedtesting.RandomizedRunner$5.evaluate(RandomizedRunner.java:783)
>    [junit4]   1>        at org.apache.lucene.util.AbstractBeforeAfterRule$1.evaluate(AbstractBeforeAfterRule.java:46)
>    [junit4]   1>        at org.apache.lucene.util.TestRuleStoreClassName$1.evaluate(TestRuleStoreClassName.java:42)
>    [junit4]   1>        at com.carrotsearch.randomizedtesting.rules.SystemPropertiesInvariantRule$1.evaluate(SystemPropertiesInvariantRule.java:55)
>    [junit4]   1>        at com.carrotsearch.randomizedtesting.rules.NoShadowingOrOverridesOnMethodsRule$1.evaluate(NoShadowingOrOverridesOnMethodsRule.java:39)
>    [junit4]   1>        at com.carrotsearch.randomizedtesting.rules.NoShadowingOrOverridesOnMethodsRule$1.evaluate(NoShadowingOrOverridesOnMethodsRule.java:39)
>    [junit4]   1>        at com.carrotsearch.randomizedtesting.rules.StatementAdapter.evaluate(StatementAdapter.java:36)
>    [junit4]   1>        at com.carrotsearch.randomizedtesting.rules.StatementAdapter.evaluate(StatementAdapter.java:36)
>    [junit4]   1>        at com.carrotsearch.randomizedtesting.rules.StatementAdapter.evaluate(StatementAdapter.java:36)
>    [junit4]   1>        at org.apache.lucene.util.TestRuleAssertionsRequired$1.evaluate(TestRuleAssertionsRequired.java:43)
>    [junit4]   1>        at org.apache.lucene.util.TestRuleMarkFailure$1.evaluate(TestRuleMarkFailure.java:48)
>    [junit4]   1>        at org.apache.lucene.util.TestRuleIgnoreAfterMaxFailures$1.evaluate(TestRuleIgnoreAfterMaxFailures.java:65)
>    [junit4]   1>        at org.apache.lucene.util.TestRuleIgnoreTestSuites$1.evaluate(TestRuleIgnoreTestSuites.java:55)
>    [junit4]   1>        at com.carrotsearch.randomizedtesting.rules.StatementAdapter.evaluate(StatementAdapter.java:36)
>    [junit4]   1>        at com.carrotsearch.randomizedtesting.ThreadLeakControl$StatementRunner.run(ThreadLeakControl.java:360)
>    [junit4]   1>        at java.lang.Thread.run(Thread.java:745)
>    [junit4]   1>     test: stored fields.......OK [0 total field count; avg 0 fields
per doc]
>    [junit4]   1>     test: term vectors........OK [0 total vector count; avg 0 term/freq
vector fields per doc]
>    [junit4]   1>     test: docvalues...........OK [0 docvalues fields; 0 BINARY; 0
NUMERIC; 0 SORTED; 0 SORTED_NUMERIC; 0 SORTED_SET]
>    [junit4]   1> FAILED
>    [junit4]   1>     WARNING: fixIndex() would remove reference to this segment; full
exception:
>    [junit4]   1> java.lang.RuntimeException: Term Index test failed
>    [junit4]   1>        at org.apache.lucene.index.CheckIndex.checkIndex(CheckIndex.java:646)
>    [junit4]   1>        at org.apache.lucene.util.TestUtil.checkIndex(TestUtil.java:201)
>    [junit4]   1>        at org.apache.lucene.store.BaseDirectoryWrapper.close(BaseDirectoryWrapper.java:45)
>    [junit4]   1>        at org.apache.lucene.util.TestFieldCacheSanityChecker.tearDown(TestFieldCacheSanityChecker.java:88)
>    [junit4]   1>        at sun.reflect.GeneratedMethodAccessor3.invoke(Unknown Source)
>    [junit4]   1>        at sun.reflect.DelegatingMethodAccessorImpl.invoke(DelegatingMethodAccessorImpl.java:43)
>    [junit4]   1>        at java.lang.reflect.Method.invoke(Method.java:606)
>    [junit4]   1>        at com.carrotsearch.randomizedtesting.RandomizedRunner.invoke(RandomizedRunner.java:1618)
>    [junit4]   1>        at com.carrotsearch.randomizedtesting.RandomizedRunner$8.evaluate(RandomizedRunner.java:885)
>    [junit4]   1>        at org.apache.lucene.util.TestRuleSetupTeardownChained$1.evaluate(TestRuleSetupTeardownChained.java:50)
>    [junit4]   1>        at org.apache.lucene.util.TestRuleFieldCacheSanity$1.evaluate(TestRuleFieldCacheSanity.java:51)
>    [junit4]   1>        at org.apache.lucene.util.AbstractBeforeAfterRule$1.evaluate(AbstractBeforeAfterRule.java:46)
>    [junit4]   1>        at com.carrotsearch.randomizedtesting.rules.SystemPropertiesInvariantRule$1.evaluate(SystemPropertiesInvariantRule.java:55)
>    [junit4]   1>        at org.apache.lucene.util.TestRuleThreadAndTestName$1.evaluate(TestRuleThreadAndTestName.java:49)
>    [junit4]   1>        at org.apache.lucene.util.TestRuleIgnoreAfterMaxFailures$1.evaluate(TestRuleIgnoreAfterMaxFailures.java:65)
>    [junit4]   1>        at org.apache.lucene.util.TestRuleMarkFailure$1.evaluate(TestRuleMarkFailure.java:48)
>    [junit4]   1>        at com.carrotsearch.randomizedtesting.rules.StatementAdapter.evaluate(StatementAdapter.java:36)
>    [junit4]   1>        at com.carrotsearch.randomizedtesting.ThreadLeakControl$StatementRunner.run(ThreadLeakControl.java:360)
>    [junit4]   1>        at com.carrotsearch.randomizedtesting.ThreadLeakControl.forkTimeoutingTask(ThreadLeakControl.java:793)
>    [junit4]   1>        at com.carrotsearch.randomizedtesting.ThreadLeakControl$3.evaluate(ThreadLeakControl.java:453)
>    [junit4]   1>        at com.carrotsearch.randomizedtesting.RandomizedRunner.runSingleTest(RandomizedRunner.java:836)
>    [junit4]   1>        at com.carrotsearch.randomizedtesting.RandomizedRunner$3.evaluate(RandomizedRunner.java:738)
>    [junit4]   1>        at com.carrotsearch.randomizedtesting.RandomizedRunner$4.evaluate(RandomizedRunner.java:772)
>    [junit4]   1>        at com.carrotsearch.randomizedtesting.RandomizedRunner$5.evaluate(RandomizedRunner.java:783)
>    [junit4]   1>        at org.apache.lucene.util.AbstractBeforeAfterRule$1.evaluate(AbstractBeforeAfterRule.java:46)
>    [junit4]   1>        at org.apache.lucene.util.TestRuleStoreClassName$1.evaluate(TestRuleStoreClassName.java:42)
>    [junit4]   1>        at com.carrotsearch.randomizedtesting.rules.SystemPropertiesInvariantRule$1.evaluate(SystemPropertiesInvariantRule.java:55)
>    [junit4]   1>        at com.carrotsearch.randomizedtesting.rules.NoShadowingOrOverridesOnMethodsRule$1.evaluate(NoShadowingOrOverridesOnMethodsRule.java:39)
>    [junit4]   1>        at com.carrotsearch.randomizedtesting.rules.NoShadowingOrOverridesOnMethodsRule$1.evaluate(NoShadowingOrOverridesOnMethodsRule.java:39)
>    [junit4]   1>        at com.carrotsearch.randomizedtesting.rules.StatementAdapter.evaluate(StatementAdapter.java:36)
>    [junit4]   1>        at com.carrotsearch.randomizedtesting.rules.StatementAdapter.evaluate(StatementAdapter.java:36)
>    [junit4]   1>        at com.carrotsearch.randomizedtesting.rules.StatementAdapter.evaluate(StatementAdapter.java:36)
>    [junit4]   1>        at org.apache.lucene.util.TestRuleAssertionsRequired$1.evaluate(TestRuleAssertionsRequired.java:43)
>    [junit4]   1>        at org.apache.lucene.util.TestRuleMarkFailure$1.evaluate(TestRuleMarkFailure.java:48)
>    [junit4]   1>        at org.apache.lucene.util.TestRuleIgnoreAfterMaxFailures$1.evaluate(TestRuleIgnoreAfterMaxFailures.java:65)
>    [junit4]   1>        at org.apache.lucene.util.TestRuleIgnoreTestSuites$1.evaluate(TestRuleIgnoreTestSuites.java:55)
>    [junit4]   1>        at com.carrotsearch.randomizedtesting.rules.StatementAdapter.evaluate(StatementAdapter.java:36)
>    [junit4]   1>        at com.carrotsearch.randomizedtesting.ThreadLeakControl$StatementRunner.run(ThreadLeakControl.java:360)
>    [junit4]   1>        at java.lang.Thread.run(Thread.java:745)
>    [junit4]   1>
>    [junit4]   1> WARNING: 1 broken segments (containing 334 documents) detected
>    [junit4]   1>
>    [junit4]   2> NOTE: reproduce with: ant test  -Dtestcase=TestFieldCacheSanityChecker
-Dtests.method=testInsanity1 -Dtests.seed=55A55EBC9A4D4E5F -Dtests.slow=true -Dtests.locale=cs
-Dtests.timezone=Australia/Broken_Hill -Dtests.file.encoding=US-ASCII
>    [junit4] ERROR   0.35s J7 | TestFieldCacheSanityChecker.testInsanity1 <<<
>    [junit4]    > Throwable #1: java.lang.RuntimeException: CheckIndex failed
>    [junit4]    >        at __randomizedtesting.SeedInfo.seed([55A55EBC9A4D4E5F:3E1B8730F613CE4F]:0)
>    [junit4]    >        at org.apache.lucene.util.TestUtil.checkIndex(TestUtil.java:205)
>    [junit4]    >        at org.apache.lucene.store.BaseDirectoryWrapper.close(BaseDirectoryWrapper.java:45)
>    [junit4]    >        at org.apache.lucene.util.TestFieldCacheSanityChecker.tearDown(TestFieldCacheSanityChecker.java:88)
>    [junit4]    >        at java.lang.Thread.run(Thread.java:745)
>    [junit4]   2> NOTE: test params are: codec=Lucene49: {theShort=PostingsFormat(name=Memory
doPackFST= false), theByte=PostingsFormat(name=FSTOrdPulsing41), theInt=PostingsFormat(name=MockRandom),
theFloat=PostingsFormat(name=Memory doPackFST= false), theLong=PostingsFormat(name=FSTOrdPulsing41),
theDouble=PostingsFormat(name=MockRandom)}, docValues:{}, sim=RandomSimilarityProvider(queryNorm=true,coord=crazy):
{}, locale=cs, timezone=Australia/Broken_Hill
>    [junit4]   2> NOTE: Linux 3.2.0-26-generic amd64/Oracle Corporation 1.7.0_55 (64-bit)/cpus=8,threads=1,free=109060112,total=188743680
>    [junit4]   2> NOTE: All tests run in this JVM: [TestPForDeltaDocIdSet, TestIndexWriterForceMerge,
TestNorms, TestMultiTermQueryRewrites, TestRollingUpdates, TestSortRandom, TestNearSpansOrdered,
TestReuseDocsEnum, TestIndexReaderClose, TestIndexWriterExceptions2, TestMultiPhraseQuery,
TestOmitTf, TestBasicOperations, TestSloppyMath, TestNormsFormat, TestConsistentFieldNumbers,
TestIndexWriterMerging, TestBlockPostingsFormat3, TestIndexWriterThreadsToSegments, TestTermRangeFilter,
TestPostingsOffsets, TestRateLimitedDirectoryWrapper, TestFSTs, TestRollingBuffer, TestQueryBuilder,
TestByteBlockPool, TestPerFieldPostingsFormat2, TestFieldCacheSanityChecker]
>    [junit4] Completed on J7 in 1.58s, 3 tests, 1 error <<< FAILURES!
>
> [...truncated 610 lines...]
> BUILD FAILED
> /var/lib/jenkins/workspace/Lucene-4x-Linux-Java7-64-test-only/checkout/lucene/build.xml:49:
The following error occurred while executing this line:
> /var/lib/jenkins/workspace/Lucene-4x-Linux-Java7-64-test-only/checkout/lucene/common-build.xml:1297:
The following error occurred while executing this line:
> /var/lib/jenkins/workspace/Lucene-4x-Linux-Java7-64-test-only/checkout/lucene/common-build.xml:921:
There were test failures: 413 suites, 3445 tests, 1 error, 138 ignored (127 assumptions)
>
> Total time: 6 minutes 15 seconds
> Build step 'Invoke Ant' marked build as failure
> Recording test results
> Email was triggered for: Failure
> Sending email for trigger: Failure
>
>
>
>
> ---------------------------------------------------------------------
> To unsubscribe, e-mail: dev-unsubscribe@lucene.apache.org
> For additional commands, e-mail: dev-help@lucene.apache.org

---------------------------------------------------------------------
To unsubscribe, e-mail: dev-unsubscribe@lucene.apache.org
For additional commands, e-mail: dev-help@lucene.apache.org


Mime
View raw message