lucene-dev mailing list archives

Site index · List index
Message view « Date » · « Thread »
Top « Date » · « Thread »
From Apache Jenkins Server <jenk...@builds.apache.org>
Subject [JENKINS-MAVEN] Lucene-Solr-Maven-trunk #1171: POMs out of sync
Date Tue, 22 Jul 2014 13:10:50 GMT
Build: https://builds.apache.org/job/Lucene-Solr-Maven-trunk/1171/

3 tests failed.
FAILED:  org.apache.solr.handler.TestReplicationHandlerBackup.org.apache.solr.handler.TestReplicationHandlerBackup

Error Message:
1 thread leaked from SUITE scope at org.apache.solr.handler.TestReplicationHandlerBackup:

   1) Thread[id=47828, name=Thread-7787, state=RUNNABLE, group=TGRP-TestReplicationHandlerBackup]
        at java.net.PlainSocketImpl.socketConnect(Native Method)
        at java.net.AbstractPlainSocketImpl.doConnect(AbstractPlainSocketImpl.java:339)
        at java.net.AbstractPlainSocketImpl.connectToAddress(AbstractPlainSocketImpl.java:200)
        at java.net.AbstractPlainSocketImpl.connect(AbstractPlainSocketImpl.java:182)
        at java.net.SocksSocketImpl.connect(SocksSocketImpl.java:392)
        at java.net.Socket.connect(Socket.java:579)
        at java.net.Socket.connect(Socket.java:528)
        at sun.net.NetworkClient.doConnect(NetworkClient.java:180)
        at sun.net.www.http.HttpClient.openServer(HttpClient.java:432)
        at sun.net.www.http.HttpClient.openServer(HttpClient.java:527)
        at sun.net.www.http.HttpClient.parseHTTP(HttpClient.java:652)
        at sun.net.www.protocol.http.HttpURLConnection.getInputStream(HttpURLConnection.java:1323)
        at java.net.URL.openStream(URL.java:1037)
        at org.apache.solr.handler.TestReplicationHandlerBackup$BackupThread.run(TestReplicationHandlerBackup.java:314)

Stack Trace:
com.carrotsearch.randomizedtesting.ThreadLeakError: 1 thread leaked from SUITE scope at org.apache.solr.handler.TestReplicationHandlerBackup:

   1) Thread[id=47828, name=Thread-7787, state=RUNNABLE, group=TGRP-TestReplicationHandlerBackup]
        at java.net.PlainSocketImpl.socketConnect(Native Method)
        at java.net.AbstractPlainSocketImpl.doConnect(AbstractPlainSocketImpl.java:339)
        at java.net.AbstractPlainSocketImpl.connectToAddress(AbstractPlainSocketImpl.java:200)
        at java.net.AbstractPlainSocketImpl.connect(AbstractPlainSocketImpl.java:182)
        at java.net.SocksSocketImpl.connect(SocksSocketImpl.java:392)
        at java.net.Socket.connect(Socket.java:579)
        at java.net.Socket.connect(Socket.java:528)
        at sun.net.NetworkClient.doConnect(NetworkClient.java:180)
        at sun.net.www.http.HttpClient.openServer(HttpClient.java:432)
        at sun.net.www.http.HttpClient.openServer(HttpClient.java:527)
        at sun.net.www.http.HttpClient.parseHTTP(HttpClient.java:652)
        at sun.net.www.protocol.http.HttpURLConnection.getInputStream(HttpURLConnection.java:1323)
        at java.net.URL.openStream(URL.java:1037)
        at org.apache.solr.handler.TestReplicationHandlerBackup$BackupThread.run(TestReplicationHandlerBackup.java:314)
	at __randomizedtesting.SeedInfo.seed([4BCCBD2ACF23D62E]:0)


FAILED:  org.apache.solr.handler.TestReplicationHandlerBackup.org.apache.solr.handler.TestReplicationHandlerBackup

Error Message:
There are still zombie threads that couldn't be terminated:
   1) Thread[id=47828, name=Thread-7787, state=RUNNABLE, group=TGRP-TestReplicationHandlerBackup]
        at java.net.PlainSocketImpl.socketConnect(Native Method)
        at java.net.AbstractPlainSocketImpl.doConnect(AbstractPlainSocketImpl.java:339)
        at java.net.AbstractPlainSocketImpl.connectToAddress(AbstractPlainSocketImpl.java:200)
        at java.net.AbstractPlainSocketImpl.connect(AbstractPlainSocketImpl.java:182)
        at java.net.SocksSocketImpl.connect(SocksSocketImpl.java:392)
        at java.net.Socket.connect(Socket.java:579)
        at java.net.Socket.connect(Socket.java:528)
        at sun.net.NetworkClient.doConnect(NetworkClient.java:180)
        at sun.net.www.http.HttpClient.openServer(HttpClient.java:432)
        at sun.net.www.http.HttpClient.openServer(HttpClient.java:527)
        at sun.net.www.http.HttpClient.parseHTTP(HttpClient.java:652)
        at sun.net.www.protocol.http.HttpURLConnection.getInputStream(HttpURLConnection.java:1323)
        at java.net.URL.openStream(URL.java:1037)
        at org.apache.solr.handler.TestReplicationHandlerBackup$BackupThread.run(TestReplicationHandlerBackup.java:314)

Stack Trace:
com.carrotsearch.randomizedtesting.ThreadLeakError: There are still zombie threads that couldn't
be terminated:
   1) Thread[id=47828, name=Thread-7787, state=RUNNABLE, group=TGRP-TestReplicationHandlerBackup]
        at java.net.PlainSocketImpl.socketConnect(Native Method)
        at java.net.AbstractPlainSocketImpl.doConnect(AbstractPlainSocketImpl.java:339)
        at java.net.AbstractPlainSocketImpl.connectToAddress(AbstractPlainSocketImpl.java:200)
        at java.net.AbstractPlainSocketImpl.connect(AbstractPlainSocketImpl.java:182)
        at java.net.SocksSocketImpl.connect(SocksSocketImpl.java:392)
        at java.net.Socket.connect(Socket.java:579)
        at java.net.Socket.connect(Socket.java:528)
        at sun.net.NetworkClient.doConnect(NetworkClient.java:180)
        at sun.net.www.http.HttpClient.openServer(HttpClient.java:432)
        at sun.net.www.http.HttpClient.openServer(HttpClient.java:527)
        at sun.net.www.http.HttpClient.parseHTTP(HttpClient.java:652)
        at sun.net.www.protocol.http.HttpURLConnection.getInputStream(HttpURLConnection.java:1323)
        at java.net.URL.openStream(URL.java:1037)
        at org.apache.solr.handler.TestReplicationHandlerBackup$BackupThread.run(TestReplicationHandlerBackup.java:314)
	at __randomizedtesting.SeedInfo.seed([4BCCBD2ACF23D62E]:0)


FAILED:  org.apache.solr.cloud.MultiThreadedOCPTest.testDistribSearch

Error Message:
Task 3002 did not complete, final state: running

Stack Trace:
java.lang.AssertionError: Task 3002 did not complete, final state: running
	at __randomizedtesting.SeedInfo.seed([3128025D8854CD47:B0CE8C45FF0BAD7B]:0)
	at org.junit.Assert.fail(Assert.java:93)
	at org.junit.Assert.assertTrue(Assert.java:43)
	at org.apache.solr.cloud.MultiThreadedOCPTest.testDeduplicationOfSubmittedTasks(MultiThreadedOCPTest.java:162)
	at org.apache.solr.cloud.MultiThreadedOCPTest.doTest(MultiThreadedOCPTest.java:71)




Build Log:
[...truncated 55181 lines...]
BUILD FAILED
/usr/home/hudson/hudson-slave/workspace/Lucene-Solr-Maven-trunk/build.xml:490: The following
error occurred while executing this line:
/usr/home/hudson/hudson-slave/workspace/Lucene-Solr-Maven-trunk/build.xml:182: The following
error occurred while executing this line:
/usr/home/hudson/hudson-slave/workspace/Lucene-Solr-Maven-trunk/extra-targets.xml:77: Java
returned: 1

Total time: 178 minutes 59 seconds
Build step 'Invoke Ant' marked build as failure
Recording test results
Email was triggered for: Failure
Sending email for trigger: Failure



Mime
View raw message