lucene-dev mailing list archives

Site index · List index
Message view « Date » · « Thread »
Top « Date » · « Thread »
From Policeman Jenkins Server <jenk...@thetaphi.de>
Subject [JENKINS] Lucene-Solr-trunk-Linux (32bit/jdk1.8.0_11) - Build # 10907 - Failure!
Date Sun, 27 Jul 2014 19:34:50 GMT
Build: http://jenkins.thetaphi.de/job/Lucene-Solr-trunk-Linux/10907/
Java: 32bit/jdk1.8.0_11 -client -XX:+UseParallelGC

1 tests failed.
REGRESSION:  org.apache.lucene.analysis.core.TestRandomChains.testRandomChains

Error Message:
startOffset must be non-negative, and endOffset must be >= startOffset, startOffset=8,endOffset=4

Stack Trace:
java.lang.IllegalArgumentException: startOffset must be non-negative, and endOffset must be
>= startOffset, startOffset=8,endOffset=4
	at __randomizedtesting.SeedInfo.seed([14666A656EA6C181:2987430429B4DC41]:0)
	at org.apache.lucene.analysis.tokenattributes.PackedTokenAttributeImpl.setOffset(PackedTokenAttributeImpl.java:107)
	at org.apache.lucene.analysis.shingle.ShingleFilter.incrementToken(ShingleFilter.java:345)
	at org.apache.lucene.analysis.ValidatingTokenFilter.incrementToken(ValidatingTokenFilter.java:68)
	at org.apache.lucene.analysis.util.FilteringTokenFilter.incrementToken(FilteringTokenFilter.java:55)
	at org.apache.lucene.analysis.ngram.NGramTokenFilter.incrementToken(NGramTokenFilter.java:135)
	at org.apache.lucene.analysis.ValidatingTokenFilter.incrementToken(ValidatingTokenFilter.java:68)
	at org.apache.lucene.analysis.BaseTokenStreamTestCase.checkAnalysisConsistency(BaseTokenStreamTestCase.java:704)
	at org.apache.lucene.analysis.BaseTokenStreamTestCase.checkRandomData(BaseTokenStreamTestCase.java:615)
	at org.apache.lucene.analysis.BaseTokenStreamTestCase.checkRandomData(BaseTokenStreamTestCase.java:513)
	at org.apache.lucene.analysis.core.TestRandomChains.testRandomChains(TestRandomChains.java:906)
	at sun.reflect.NativeMethodAccessorImpl.invoke0(Native Method)
	at sun.reflect.NativeMethodAccessorImpl.invoke(NativeMethodAccessorImpl.java:62)
	at sun.reflect.DelegatingMethodAccessorImpl.invoke(DelegatingMethodAccessorImpl.java:43)
	at java.lang.reflect.Method.invoke(Method.java:483)
	at com.carrotsearch.randomizedtesting.RandomizedRunner.invoke(RandomizedRunner.java:1618)
	at com.carrotsearch.randomizedtesting.RandomizedRunner$6.evaluate(RandomizedRunner.java:827)
	at com.carrotsearch.randomizedtesting.RandomizedRunner$7.evaluate(RandomizedRunner.java:863)
	at com.carrotsearch.randomizedtesting.RandomizedRunner$8.evaluate(RandomizedRunner.java:877)
	at org.apache.lucene.util.TestRuleSetupTeardownChained$1.evaluate(TestRuleSetupTeardownChained.java:50)
	at org.apache.lucene.util.AbstractBeforeAfterRule$1.evaluate(AbstractBeforeAfterRule.java:46)
	at com.carrotsearch.randomizedtesting.rules.SystemPropertiesInvariantRule$1.evaluate(SystemPropertiesInvariantRule.java:55)
	at org.apache.lucene.util.TestRuleThreadAndTestName$1.evaluate(TestRuleThreadAndTestName.java:49)
	at org.apache.lucene.util.TestRuleIgnoreAfterMaxFailures$1.evaluate(TestRuleIgnoreAfterMaxFailures.java:65)
	at org.apache.lucene.util.TestRuleMarkFailure$1.evaluate(TestRuleMarkFailure.java:48)
	at com.carrotsearch.randomizedtesting.rules.StatementAdapter.evaluate(StatementAdapter.java:36)
	at com.carrotsearch.randomizedtesting.ThreadLeakControl$StatementRunner.run(ThreadLeakControl.java:365)
	at com.carrotsearch.randomizedtesting.ThreadLeakControl.forkTimeoutingTask(ThreadLeakControl.java:798)
	at com.carrotsearch.randomizedtesting.ThreadLeakControl$3.evaluate(ThreadLeakControl.java:458)
	at com.carrotsearch.randomizedtesting.RandomizedRunner.runSingleTest(RandomizedRunner.java:836)
	at com.carrotsearch.randomizedtesting.RandomizedRunner$3.evaluate(RandomizedRunner.java:738)
	at com.carrotsearch.randomizedtesting.RandomizedRunner$4.evaluate(RandomizedRunner.java:772)
	at com.carrotsearch.randomizedtesting.RandomizedRunner$5.evaluate(RandomizedRunner.java:783)
	at org.apache.lucene.util.AbstractBeforeAfterRule$1.evaluate(AbstractBeforeAfterRule.java:46)
	at org.apache.lucene.util.TestRuleStoreClassName$1.evaluate(TestRuleStoreClassName.java:42)
	at com.carrotsearch.randomizedtesting.rules.SystemPropertiesInvariantRule$1.evaluate(SystemPropertiesInvariantRule.java:55)
	at com.carrotsearch.randomizedtesting.rules.NoShadowingOrOverridesOnMethodsRule$1.evaluate(NoShadowingOrOverridesOnMethodsRule.java:39)
	at com.carrotsearch.randomizedtesting.rules.NoShadowingOrOverridesOnMethodsRule$1.evaluate(NoShadowingOrOverridesOnMethodsRule.java:39)
	at com.carrotsearch.randomizedtesting.rules.StatementAdapter.evaluate(StatementAdapter.java:36)
	at com.carrotsearch.randomizedtesting.rules.StatementAdapter.evaluate(StatementAdapter.java:36)
	at com.carrotsearch.randomizedtesting.rules.StatementAdapter.evaluate(StatementAdapter.java:36)
	at org.apache.lucene.util.TestRuleAssertionsRequired$1.evaluate(TestRuleAssertionsRequired.java:43)
	at org.apache.lucene.util.TestRuleMarkFailure$1.evaluate(TestRuleMarkFailure.java:48)
	at org.apache.lucene.util.TestRuleIgnoreAfterMaxFailures$1.evaluate(TestRuleIgnoreAfterMaxFailures.java:65)
	at org.apache.lucene.util.TestRuleIgnoreTestSuites$1.evaluate(TestRuleIgnoreTestSuites.java:55)
	at com.carrotsearch.randomizedtesting.rules.StatementAdapter.evaluate(StatementAdapter.java:36)
	at com.carrotsearch.randomizedtesting.ThreadLeakControl$StatementRunner.run(ThreadLeakControl.java:365)
	at java.lang.Thread.run(Thread.java:745)




Build Log:
[...truncated 5737 lines...]
   [junit4] Suite: org.apache.lucene.analysis.core.TestRandomChains
   [junit4]   2> TEST FAIL: useCharFilter=true text='\u3143\u3135 \u02809  ikpp </p'
   [junit4]   2> Exception from random analyzer: 
   [junit4]   2> charfilters=
   [junit4]   2>   org.apache.lucene.analysis.fa.PersianCharFilter(java.io.StringReader@1af0068)
   [junit4]   2> tokenizer=
   [junit4]   2>   org.apache.lucene.analysis.path.PathHierarchyTokenizer()
   [junit4]   2> filters=
   [junit4]   2>   org.apache.lucene.analysis.miscellaneous.WordDelimiterFilter(LUCENE_5_0,
ValidatingTokenFilter@1e65f64 term=,bytes=[],startOffset=0,endOffset=0,positionIncrement=1,positionLength=1,type=word,
[-17, -123, -113, -67, -26, -65, 45, 13, -102, 8, -77, -97, 27, 120, -121, 64, -12, -63, -50,
-69, 65, 108, 127, -23, 40, -34, 5, -85, 122, 49, -104, -31, 127, 76, -57, 34, -7, -87, 16,
-63, 33, -42, 103, -56, -109, -124, 83, -124, 62, -85, 36, -80, 40, 74, 42, -79, 56, 24, 127,
-18, -69, -65, 15, -87, -106, -125, -103, 14, 112, 66, 11, -112, -61, -10, -46, 80, -41, 106,
-35, 97, -38, -106, 85, -83, 28, -57, -85, 66, 27, 104, -118, 126, 32, 104, 18, 60, -70, -51,
98, 92, -123, 99, -107, 15, 37, 65, -120, 2, 42, -35, 95, 33, -7, 6, 3, 26, -74, -76], -37,
[ld, vfvv, ibepgglru, mrtns, xiamj, azyehbj])
   [junit4]   2>   org.apache.lucene.analysis.miscellaneous.ASCIIFoldingFilter(ValidatingTokenFilter@2392ac
term=,bytes=[],startOffset=0,endOffset=0,positionIncrement=1,positionLength=1,type=word)
   [junit4]   2>   org.apache.lucene.analysis.shingle.ShingleFilter(ValidatingTokenFilter@a9e372
term=,bytes=[],startOffset=0,endOffset=0,positionIncrement=1,positionLength=1,type=word, <IDEOGRAPHIC>)
   [junit4]   2>   org.apache.lucene.analysis.ngram.NGramTokenFilter(LUCENE_5_0, ValidatingTokenFilter@e89efa
term=,bytes=[],startOffset=0,endOffset=0,positionIncrement=1,positionLength=1,type=word)
   [junit4]   2> offsetsAreCorrect=false
   [junit4]   2> NOTE: reproduce with: ant test  -Dtestcase=TestRandomChains -Dtests.method=testRandomChains
-Dtests.seed=14666A656EA6C181 -Dtests.multiplier=3 -Dtests.slow=true -Dtests.locale=ms -Dtests.timezone=Pacific/Pohnpei
-Dtests.file.encoding=UTF-8
   [junit4] ERROR   18.6s J1 | TestRandomChains.testRandomChains <<<
   [junit4]    > Throwable #1: java.lang.IllegalArgumentException: startOffset must be
non-negative, and endOffset must be >= startOffset, startOffset=8,endOffset=4
   [junit4]    > 	at __randomizedtesting.SeedInfo.seed([14666A656EA6C181:2987430429B4DC41]:0)
   [junit4]    > 	at org.apache.lucene.analysis.tokenattributes.PackedTokenAttributeImpl.setOffset(PackedTokenAttributeImpl.java:107)
   [junit4]    > 	at org.apache.lucene.analysis.shingle.ShingleFilter.incrementToken(ShingleFilter.java:345)
   [junit4]    > 	at org.apache.lucene.analysis.ValidatingTokenFilter.incrementToken(ValidatingTokenFilter.java:68)
   [junit4]    > 	at org.apache.lucene.analysis.util.FilteringTokenFilter.incrementToken(FilteringTokenFilter.java:55)
   [junit4]    > 	at org.apache.lucene.analysis.ngram.NGramTokenFilter.incrementToken(NGramTokenFilter.java:135)
   [junit4]    > 	at org.apache.lucene.analysis.ValidatingTokenFilter.incrementToken(ValidatingTokenFilter.java:68)
   [junit4]    > 	at org.apache.lucene.analysis.BaseTokenStreamTestCase.checkAnalysisConsistency(BaseTokenStreamTestCase.java:704)
   [junit4]    > 	at org.apache.lucene.analysis.BaseTokenStreamTestCase.checkRandomData(BaseTokenStreamTestCase.java:615)
   [junit4]    > 	at org.apache.lucene.analysis.BaseTokenStreamTestCase.checkRandomData(BaseTokenStreamTestCase.java:513)
   [junit4]    > 	at org.apache.lucene.analysis.core.TestRandomChains.testRandomChains(TestRandomChains.java:906)
   [junit4]    > 	at java.lang.Thread.run(Thread.java:745)
   [junit4]   2> NOTE: leaving temporary files on disk at: /mnt/ssd/jenkins/workspace/Lucene-Solr-trunk-Linux/lucene/build/analysis/common/test/J1/./temp/lucene.analysis.core.TestRandomChains-14666A656EA6C181-001
   [junit4]   2> NOTE: test params are: codec=Lucene41, sim=RandomSimilarityProvider(queryNorm=true,coord=crazy):
{dummy=DFR I(F)Z(0.3)}, locale=ms, timezone=Pacific/Pohnpei
   [junit4]   2> NOTE: Linux 3.13.0-32-generic i386/Oracle Corporation 1.8.0_11 (32-bit)/cpus=8,threads=1,free=107387672,total=229113856
   [junit4]   2> NOTE: All tests run in this JVM: [DateRecognizerSinkTokenizerTest, NGramTokenFilterTest,
TestNorwegianMinimalStemFilter, TestZeroAffix2, TestPortugueseStemFilter, TestStandardAnalyzer,
TestZeroAffix, TestApostropheFilterFactory, TestCondition, TestFullStrip, TestSnowballPorterFilterFactory,
TestHindiAnalyzer, TestCommonGramsQueryFilterFactory, TestIrishLowerCaseFilter, TestDictionaryCompoundWordTokenFilterFactory,
TestCollationDocValuesField, TestRollingCharBuffer, TestNorwegianLightStemFilterFactory, TestMorphAlias,
TestGalicianStemFilterFactory, TestAnalysisSPILoader, TestKeepFilterFactory, TestHungarianLightStemFilterFactory,
TestCJKBigramFilter, TestStopFilter, TestEnglishMinimalStemFilter, TestUAX29URLEmailTokenizer,
TestCaseInsensitive, TestFrenchMinimalStemFilterFactory, TestHunspellStemFilter, TestRandomChains]
   [junit4] Completed on J1 in 36.67s, 2 tests, 1 error <<< FAILURES!

[...truncated 517 lines...]
BUILD FAILED
/mnt/ssd/jenkins/workspace/Lucene-Solr-trunk-Linux/build.xml:467: The following error occurred
while executing this line:
/mnt/ssd/jenkins/workspace/Lucene-Solr-trunk-Linux/build.xml:447: The following error occurred
while executing this line:
/mnt/ssd/jenkins/workspace/Lucene-Solr-trunk-Linux/build.xml:45: The following error occurred
while executing this line:
/mnt/ssd/jenkins/workspace/Lucene-Solr-trunk-Linux/extra-targets.xml:37: The following error
occurred while executing this line:
/mnt/ssd/jenkins/workspace/Lucene-Solr-trunk-Linux/lucene/build.xml:544: The following error
occurred while executing this line:
/mnt/ssd/jenkins/workspace/Lucene-Solr-trunk-Linux/lucene/common-build.xml:2019: The following
error occurred while executing this line:
/mnt/ssd/jenkins/workspace/Lucene-Solr-trunk-Linux/lucene/analysis/build.xml:106: The following
error occurred while executing this line:
/mnt/ssd/jenkins/workspace/Lucene-Solr-trunk-Linux/lucene/analysis/build.xml:38: The following
error occurred while executing this line:
/mnt/ssd/jenkins/workspace/Lucene-Solr-trunk-Linux/lucene/module-build.xml:60: The following
error occurred while executing this line:
/mnt/ssd/jenkins/workspace/Lucene-Solr-trunk-Linux/lucene/common-build.xml:1298: The following
error occurred while executing this line:
/mnt/ssd/jenkins/workspace/Lucene-Solr-trunk-Linux/lucene/common-build.xml:922: There were
test failures: 268 suites, 1358 tests, 1 error, 1 ignored

Total time: 34 minutes 34 seconds
Build step 'Invoke Ant' marked build as failure
[description-setter] Description set: Java: 32bit/jdk1.8.0_11 -client -XX:+UseParallelGC
Archiving artifacts
Recording test results
Email was triggered for: Failure - Any
Sending email for trigger: Failure - Any



Mime
View raw message