lucene-dev mailing list archives

Site index · List index
Message view « Date » · « Thread »
Top « Date » · « Thread »
From Apache Jenkins Server <jenk...@builds.apache.org>
Subject [JENKINS-MAVEN] Lucene-Solr-Maven-4.x #651: POMs out of sync
Date Sat, 05 Jul 2014 10:58:47 GMT
Build: https://builds.apache.org/job/Lucene-Solr-Maven-4.x/651/

2 tests failed.
REGRESSION:  org.apache.solr.cloud.RecoveryZkTest.testDistribSearch

Error Message:
shard1 is not consistent.  Got 90 from http://127.0.0.1:64539/dm/o/collection1lastClient and
got 54 from http://127.0.0.1:33759/dm/o/collection1

Stack Trace:
java.lang.AssertionError: shard1 is not consistent.  Got 90 from http://127.0.0.1:64539/dm/o/collection1lastClient
and got 54 from http://127.0.0.1:33759/dm/o/collection1
	at __randomizedtesting.SeedInfo.seed([6D8316A0477559F1:EC6598B8302A39CD]:0)
	at org.junit.Assert.fail(Assert.java:93)
	at org.apache.solr.cloud.RecoveryZkTest.doTest(RecoveryZkTest.java:123)


FAILED:  org.apache.solr.cloud.MultiThreadedOCPTest.testDistribSearch

Error Message:
Task 3002 did not complete, final state: running

Stack Trace:
java.lang.AssertionError: Task 3002 did not complete, final state: running
	at __randomizedtesting.SeedInfo.seed([F811E72207AC299D:79F7693A70F349A1]:0)
	at org.junit.Assert.fail(Assert.java:93)
	at org.junit.Assert.assertTrue(Assert.java:43)
	at org.apache.solr.cloud.MultiThreadedOCPTest.testDeduplicationOfSubmittedTasks(MultiThreadedOCPTest.java:161)
	at org.apache.solr.cloud.MultiThreadedOCPTest.doTest(MultiThreadedOCPTest.java:70)




Build Log:
[...truncated 55007 lines...]
BUILD FAILED
/usr/home/hudson/hudson-slave/workspace/Lucene-Solr-Maven-4.x/build.xml:490: The following
error occurred while executing this line:
/usr/home/hudson/hudson-slave/workspace/Lucene-Solr-Maven-4.x/build.xml:182: The following
error occurred while executing this line:
/usr/home/hudson/hudson-slave/workspace/Lucene-Solr-Maven-4.x/extra-targets.xml:77: Java returned:
1

Total time: 214 minutes 8 seconds
Build step 'Invoke Ant' marked build as failure
Recording test results
Email was triggered for: Failure
Sending email for trigger: Failure



Mime
View raw message