lucene-dev mailing list archives

Site index · List index
Message view « Date » · « Thread »
Top « Date » · « Thread »
From Apache Jenkins Server <jenk...@builds.apache.org>
Subject [JENKINS] Lucene-Solr-Tests-trunk-Java7 - Build # 4782 - Failure
Date Sat, 26 Jul 2014 20:06:47 GMT
Build: https://builds.apache.org/job/Lucene-Solr-Tests-trunk-Java7/4782/

3 tests failed.
REGRESSION:  org.apache.solr.client.solrj.SolrExampleXMLTest.testExampleConfig

Error Message:
Expected mime type application/octet-stream but got text/html. <html> <head> <meta http-equiv="Content-Type" content="text/html;charset=ISO-8859-1"/> <title>Error 500 {msg=Could not initialize class java.lang.UNIXProcess,trace=java.lang.NoClassDefFoundError: Could not initialize class java.lang.UNIXProcess  at java.lang.ProcessImpl.start(ProcessImpl.java:130)  at java.lang.ProcessBuilder.start(ProcessBuilder.java:1022)  at java.lang.Runtime.exec(Runtime.java:617)  at java.lang.Runtime.exec(Runtime.java:450)  at java.lang.Runtime.exec(Runtime.java:347)  at org.apache.solr.handler.admin.SystemInfoHandler.execute(SystemInfoHandler.java:220)  at org.apache.solr.handler.admin.SystemInfoHandler.getSystemInfo(SystemInfoHandler.java:176)  at org.apache.solr.handler.admin.SystemInfoHandler.handleRequestBody(SystemInfoHandler.java:97)  at org.apache.solr.handler.RequestHandlerBase.handleRequest(RequestHandlerBase.java:135)  at org.apache.solr.handler.admin.InfoHandler.handleRequestBody(InfoHandler.java:88)  at org.apache.solr.handler.RequestHandlerBase.handleRequest(RequestHandlerBase.java:135)  at org.apache.solr.servlet.SolrDispatchFilter.handleAdminRequest(SolrDispatchFilter.java:732)  at org.apache.solr.servlet.SolrDispatchFilter.doFilter(SolrDispatchFilter.java:275)  at org.apache.solr.servlet.SolrDispatchFilter.doFilter(SolrDispatchFilter.java:208)  at org.eclipse.jetty.servlet.ServletHandler$CachedChain.doFilter(ServletHandler.java:1419)  at org.apache.solr.client.solrj.embedded.JettySolrRunner$DebugFilter.doFilter(JettySolrRunner.java:137)  at org.eclipse.jetty.servlet.ServletHandler$CachedChain.doFilter(ServletHandler.java:1419)  at org.eclipse.jetty.servlet.ServletHandler.doHandle(ServletHandler.java:455)  at org.eclipse.jetty.server.session.SessionHandler.doHandle(SessionHandler.java:229)  at org.eclipse.jetty.server.handler.ScopedHandler.handle(ScopedHandler.java:137)  at org.eclipse.jetty.server.handler.GzipHandler.handle(GzipHandler.java:301)  at org.eclipse.jetty.server.handler.ContextHandler.doHandle(ContextHandler.java:1077)  at org.eclipse.jetty.servlet.ServletHandler.doScope(ServletHandler.java:384)  at org.eclipse.jetty.server.session.SessionHandler.doScope(SessionHandler.java:193)  at org.eclipse.jetty.server.handler.ContextHandler.doScope(ContextHandler.java:1009)  at org.eclipse.jetty.server.handler.ScopedHandler.handle(ScopedHandler.java:135)  at org.eclipse.jetty.server.handler.HandlerWrapper.handle(HandlerWrapper.java:116)  at org.eclipse.jetty.server.Server.handle(Server.java:368)  at org.eclipse.jetty.server.AbstractHttpConnection.handleRequest(AbstractHttpConnection.java:489)  at org.eclipse.jetty.server.BlockingHttpConnection.handleRequest(BlockingHttpConnection.java:53)  at org.eclipse.jetty.server.AbstractHttpConnection.headerComplete(AbstractHttpConnection.java:942)  at org.eclipse.jetty.server.AbstractHttpConnection$RequestHandler.headerComplete(AbstractHttpConnection.java:1004)  at org.eclipse.jetty.http.HttpParser.parseNext(HttpParser.java:640)  at org.eclipse.jetty.http.HttpParser.parseAvailable(HttpParser.java:235)  at org.eclipse.jetty.server.BlockingHttpConnection.handle(BlockingHttpConnection.java:72)  at org.eclipse.jetty.server.bio.SocketConnector$ConnectorEndPoint.run(SocketConnector.java:264)  at org.eclipse.jetty.util.thread.QueuedThreadPool.runJob(QueuedThreadPool.java:608)  at org.eclipse.jetty.util.thread.QueuedThreadPool$3.run(QueuedThreadPool.java:543)  at java.lang.Thread.run(Thread.java:745) ,code=500}</title> </head> <body> <h2>HTTP ERROR: 500</h2> <p>Problem accessing /solr/admin/info/system. Reason: <pre>    {msg=Could not initialize class java.lang.UNIXProcess,trace=java.lang.NoClassDefFoundError: Could not initialize class java.lang.UNIXProcess  at java.lang.ProcessImpl.start(ProcessImpl.java:130)  at java.lang.ProcessBuilder.start(ProcessBuilder.java:1022)  at java.lang.Runtime.exec(Runtime.java:617)  at java.lang.Runtime.exec(Runtime.java:450)  at java.lang.Runtime.exec(Runtime.java:347)  at org.apache.solr.handler.admin.SystemInfoHandler.execute(SystemInfoHandler.java:220)  at org.apache.solr.handler.admin.SystemInfoHandler.getSystemInfo(SystemInfoHandler.java:176)  at org.apache.solr.handler.admin.SystemInfoHandler.handleRequestBody(SystemInfoHandler.java:97)  at org.apache.solr.handler.RequestHandlerBase.handleRequest(RequestHandlerBase.java:135)  at org.apache.solr.handler.admin.InfoHandler.handleRequestBody(InfoHandler.java:88)  at org.apache.solr.handler.RequestHandlerBase.handleRequest(RequestHandlerBase.java:135)  at org.apache.solr.servlet.SolrDispatchFilter.handleAdminRequest(SolrDispatchFilter.java:732)  at org.apache.solr.servlet.SolrDispatchFilter.doFilter(SolrDispatchFilter.java:275)  at org.apache.solr.servlet.SolrDispatchFilter.doFilter(SolrDispatchFilter.java:208)  at org.eclipse.jetty.servlet.ServletHandler$CachedChain.doFilter(ServletHandler.java:1419)  at org.apache.solr.client.solrj.embedded.JettySolrRunner$DebugFilter.doFilter(JettySolrRunner.java:137)  at org.eclipse.jetty.servlet.ServletHandler$CachedChain.doFilter(ServletHandler.java:1419)  at org.eclipse.jetty.servlet.ServletHandler.doHandle(ServletHandler.java:455)  at org.eclipse.jetty.server.session.SessionHandler.doHandle(SessionHandler.java:229)  at org.eclipse.jetty.server.handler.ScopedHandler.handle(ScopedHandler.java:137)  at org.eclipse.jetty.server.handler.GzipHandler.handle(GzipHandler.java:301)  at org.eclipse.jetty.server.handler.ContextHandler.doHandle(ContextHandler.java:1077)  at org.eclipse.jetty.servlet.ServletHandler.doScope(ServletHandler.java:384)  at org.eclipse.jetty.server.session.SessionHandler.doScope(SessionHandler.java:193)  at org.eclipse.jetty.server.handler.ContextHandler.doScope(ContextHandler.java:1009)  at org.eclipse.jetty.server.handler.ScopedHandler.handle(ScopedHandler.java:135)  at org.eclipse.jetty.server.handler.HandlerWrapper.handle(HandlerWrapper.java:116)  at org.eclipse.jetty.server.Server.handle(Server.java:368)  at org.eclipse.jetty.server.AbstractHttpConnection.handleRequest(AbstractHttpConnection.java:489)  at org.eclipse.jetty.server.BlockingHttpConnection.handleRequest(BlockingHttpConnection.java:53)  at org.eclipse.jetty.server.AbstractHttpConnection.headerComplete(AbstractHttpConnection.java:942)  at org.eclipse.jetty.server.AbstractHttpConnection$RequestHandler.headerComplete(AbstractHttpConnection.java:1004)  at org.eclipse.jetty.http.HttpParser.parseNext(HttpParser.java:640)  at org.eclipse.jetty.http.HttpParser.parseAvailable(HttpParser.java:235)  at org.eclipse.jetty.server.BlockingHttpConnection.handle(BlockingHttpConnection.java:72)  at org.eclipse.jetty.server.bio.SocketConnector$ConnectorEndPoint.run(SocketConnector.java:264)  at org.eclipse.jetty.util.thread.QueuedThreadPool.runJob(QueuedThreadPool.java:608)  at org.eclipse.jetty.util.thread.QueuedThreadPool$3.run(QueuedThreadPool.java:543)  at java.lang.Thread.run(Thread.java:745) ,code=500}</pre></p> <hr /><i><small>Powered by Jetty://</small></i>                                                                                                                                                                                                                                                                                                                                                                                                                                                                                                                                                                                                                                                                                                                                                                                                                                                                                                                                                                                                                     </body> </html> 

Stack Trace:
org.apache.solr.client.solrj.impl.HttpSolrServer$RemoteSolrException: Expected mime type application/octet-stream but got text/html. <html>
<head>
<meta http-equiv="Content-Type" content="text/html;charset=ISO-8859-1"/>
<title>Error 500 {msg=Could not initialize class java.lang.UNIXProcess,trace=java.lang.NoClassDefFoundError: Could not initialize class java.lang.UNIXProcess
	at java.lang.ProcessImpl.start(ProcessImpl.java:130)
	at java.lang.ProcessBuilder.start(ProcessBuilder.java:1022)
	at java.lang.Runtime.exec(Runtime.java:617)
	at java.lang.Runtime.exec(Runtime.java:450)
	at java.lang.Runtime.exec(Runtime.java:347)
	at org.apache.solr.handler.admin.SystemInfoHandler.execute(SystemInfoHandler.java:220)
	at org.apache.solr.handler.admin.SystemInfoHandler.getSystemInfo(SystemInfoHandler.java:176)
	at org.apache.solr.handler.admin.SystemInfoHandler.handleRequestBody(SystemInfoHandler.java:97)
	at org.apache.solr.handler.RequestHandlerBase.handleRequest(RequestHandlerBase.java:135)
	at org.apache.solr.handler.admin.InfoHandler.handleRequestBody(InfoHandler.java:88)
	at org.apache.solr.handler.RequestHandlerBase.handleRequest(RequestHandlerBase.java:135)
	at org.apache.solr.servlet.SolrDispatchFilter.handleAdminRequest(SolrDispatchFilter.java:732)
	at org.apache.solr.servlet.SolrDispatchFilter.doFilter(SolrDispatchFilter.java:275)
	at org.apache.solr.servlet.SolrDispatchFilter.doFilter(SolrDispatchFilter.java:208)
	at org.eclipse.jetty.servlet.ServletHandler$CachedChain.doFilter(ServletHandler.java:1419)
	at org.apache.solr.client.solrj.embedded.JettySolrRunner$DebugFilter.doFilter(JettySolrRunner.java:137)
	at org.eclipse.jetty.servlet.ServletHandler$CachedChain.doFilter(ServletHandler.java:1419)
	at org.eclipse.jetty.servlet.ServletHandler.doHandle(ServletHandler.java:455)
	at org.eclipse.jetty.server.session.SessionHandler.doHandle(SessionHandler.java:229)
	at org.eclipse.jetty.server.handler.ScopedHandler.handle(ScopedHandler.java:137)
	at org.eclipse.jetty.server.handler.GzipHandler.handle(GzipHandler.java:301)
	at org.eclipse.jetty.server.handler.ContextHandler.doHandle(ContextHandler.java:1077)
	at org.eclipse.jetty.servlet.ServletHandler.doScope(ServletHandler.java:384)
	at org.eclipse.jetty.server.session.SessionHandler.doScope(SessionHandler.java:193)
	at org.eclipse.jetty.server.handler.ContextHandler.doScope(ContextHandler.java:1009)
	at org.eclipse.jetty.server.handler.ScopedHandler.handle(ScopedHandler.java:135)
	at org.eclipse.jetty.server.handler.HandlerWrapper.handle(HandlerWrapper.java:116)
	at org.eclipse.jetty.server.Server.handle(Server.java:368)
	at org.eclipse.jetty.server.AbstractHttpConnection.handleRequest(AbstractHttpConnection.java:489)
	at org.eclipse.jetty.server.BlockingHttpConnection.handleRequest(BlockingHttpConnection.java:53)
	at org.eclipse.jetty.server.AbstractHttpConnection.headerComplete(AbstractHttpConnection.java:942)
	at org.eclipse.jetty.server.AbstractHttpConnection$RequestHandler.headerComplete(AbstractHttpConnection.java:1004)
	at org.eclipse.jetty.http.HttpParser.parseNext(HttpParser.java:640)
	at org.eclipse.jetty.http.HttpParser.parseAvailable(HttpParser.java:235)
	at org.eclipse.jetty.server.BlockingHttpConnection.handle(BlockingHttpConnection.java:72)
	at org.eclipse.jetty.server.bio.SocketConnector$ConnectorEndPoint.run(SocketConnector.java:264)
	at org.eclipse.jetty.util.thread.QueuedThreadPool.runJob(QueuedThreadPool.java:608)
	at org.eclipse.jetty.util.thread.QueuedThreadPool$3.run(QueuedThreadPool.java:543)
	at java.lang.Thread.run(Thread.java:745)
,code=500}</title>
</head>
<body>
<h2>HTTP ERROR: 500</h2>
<p>Problem accessing /solr/admin/info/system. Reason:
<pre>    {msg=Could not initialize class java.lang.UNIXProcess,trace=java.lang.NoClassDefFoundError: Could not initialize class java.lang.UNIXProcess
	at java.lang.ProcessImpl.start(ProcessImpl.java:130)
	at java.lang.ProcessBuilder.start(ProcessBuilder.java:1022)
	at java.lang.Runtime.exec(Runtime.java:617)
	at java.lang.Runtime.exec(Runtime.java:450)
	at java.lang.Runtime.exec(Runtime.java:347)
	at org.apache.solr.handler.admin.SystemInfoHandler.execute(SystemInfoHandler.java:220)
	at org.apache.solr.handler.admin.SystemInfoHandler.getSystemInfo(SystemInfoHandler.java:176)
	at org.apache.solr.handler.admin.SystemInfoHandler.handleRequestBody(SystemInfoHandler.java:97)
	at org.apache.solr.handler.RequestHandlerBase.handleRequest(RequestHandlerBase.java:135)
	at org.apache.solr.handler.admin.InfoHandler.handleRequestBody(InfoHandler.java:88)
	at org.apache.solr.handler.RequestHandlerBase.handleRequest(RequestHandlerBase.java:135)
	at org.apache.solr.servlet.SolrDispatchFilter.handleAdminRequest(SolrDispatchFilter.java:732)
	at org.apache.solr.servlet.SolrDispatchFilter.doFilter(SolrDispatchFilter.java:275)
	at org.apache.solr.servlet.SolrDispatchFilter.doFilter(SolrDispatchFilter.java:208)
	at org.eclipse.jetty.servlet.ServletHandler$CachedChain.doFilter(ServletHandler.java:1419)
	at org.apache.solr.client.solrj.embedded.JettySolrRunner$DebugFilter.doFilter(JettySolrRunner.java:137)
	at org.eclipse.jetty.servlet.ServletHandler$CachedChain.doFilter(ServletHandler.java:1419)
	at org.eclipse.jetty.servlet.ServletHandler.doHandle(ServletHandler.java:455)
	at org.eclipse.jetty.server.session.SessionHandler.doHandle(SessionHandler.java:229)
	at org.eclipse.jetty.server.handler.ScopedHandler.handle(ScopedHandler.java:137)
	at org.eclipse.jetty.server.handler.GzipHandler.handle(GzipHandler.java:301)
	at org.eclipse.jetty.server.handler.ContextHandler.doHandle(ContextHandler.java:1077)
	at org.eclipse.jetty.servlet.ServletHandler.doScope(ServletHandler.java:384)
	at org.eclipse.jetty.server.session.SessionHandler.doScope(SessionHandler.java:193)
	at org.eclipse.jetty.server.handler.ContextHandler.doScope(ContextHandler.java:1009)
	at org.eclipse.jetty.server.handler.ScopedHandler.handle(ScopedHandler.java:135)
	at org.eclipse.jetty.server.handler.HandlerWrapper.handle(HandlerWrapper.java:116)
	at org.eclipse.jetty.server.Server.handle(Server.java:368)
	at org.eclipse.jetty.server.AbstractHttpConnection.handleRequest(AbstractHttpConnection.java:489)
	at org.eclipse.jetty.server.BlockingHttpConnection.handleRequest(BlockingHttpConnection.java:53)
	at org.eclipse.jetty.server.AbstractHttpConnection.headerComplete(AbstractHttpConnection.java:942)
	at org.eclipse.jetty.server.AbstractHttpConnection$RequestHandler.headerComplete(AbstractHttpConnection.java:1004)
	at org.eclipse.jetty.http.HttpParser.parseNext(HttpParser.java:640)
	at org.eclipse.jetty.http.HttpParser.parseAvailable(HttpParser.java:235)
	at org.eclipse.jetty.server.BlockingHttpConnection.handle(BlockingHttpConnection.java:72)
	at org.eclipse.jetty.server.bio.SocketConnector$ConnectorEndPoint.run(SocketConnector.java:264)
	at org.eclipse.jetty.util.thread.QueuedThreadPool.runJob(QueuedThreadPool.java:608)
	at org.eclipse.jetty.util.thread.QueuedThreadPool$3.run(QueuedThreadPool.java:543)
	at java.lang.Thread.run(Thread.java:745)
,code=500}</pre></p>
<hr /><i><small>Powered by Jetty://</small></i>
                                                
                                                
                                                
                                                
                                                
                                                
                                                
                                                
                                                
                                                
                                                
                                                
                                                
                                                
                                                
                                                
                                                
                                                
                                                
                                                
</body>
</html>

	at __randomizedtesting.SeedInfo.seed([58B9693DB651AE2E:EF947DA5715648F7]:0)
	at org.apache.solr.client.solrj.impl.HttpSolrServer.executeMethod(HttpSolrServer.java:513)
	at org.apache.solr.client.solrj.impl.HttpSolrServer.request(HttpSolrServer.java:210)
	at org.apache.solr.client.solrj.impl.HttpSolrServer.request(HttpSolrServer.java:206)
	at org.apache.solr.client.solrj.request.QueryRequest.process(QueryRequest.java:91)
	at org.apache.solr.client.solrj.SolrServer.query(SolrServer.java:301)
	at org.apache.solr.client.solrj.SolrExampleTests.testExampleConfig(SolrExampleTests.java:220)
	at sun.reflect.NativeMethodAccessorImpl.invoke0(Native Method)
	at sun.reflect.NativeMethodAccessorImpl.invoke(NativeMethodAccessorImpl.java:57)
	at sun.reflect.DelegatingMethodAccessorImpl.invoke(DelegatingMethodAccessorImpl.java:43)
	at java.lang.reflect.Method.invoke(Method.java:606)
	at com.carrotsearch.randomizedtesting.RandomizedRunner.invoke(RandomizedRunner.java:1618)
	at com.carrotsearch.randomizedtesting.RandomizedRunner$6.evaluate(RandomizedRunner.java:827)
	at com.carrotsearch.randomizedtesting.RandomizedRunner$7.evaluate(RandomizedRunner.java:863)
	at com.carrotsearch.randomizedtesting.RandomizedRunner$8.evaluate(RandomizedRunner.java:877)
	at com.carrotsearch.randomizedtesting.rules.SystemPropertiesRestoreRule$1.evaluate(SystemPropertiesRestoreRule.java:53)
	at org.apache.lucene.util.TestRuleSetupTeardownChained$1.evaluate(TestRuleSetupTeardownChained.java:50)
	at org.apache.lucene.util.AbstractBeforeAfterRule$1.evaluate(AbstractBeforeAfterRule.java:46)
	at com.carrotsearch.randomizedtesting.rules.SystemPropertiesInvariantRule$1.evaluate(SystemPropertiesInvariantRule.java:55)
	at org.apache.lucene.util.TestRuleThreadAndTestName$1.evaluate(TestRuleThreadAndTestName.java:49)
	at org.apache.lucene.util.TestRuleIgnoreAfterMaxFailures$1.evaluate(TestRuleIgnoreAfterMaxFailures.java:65)
	at org.apache.lucene.util.TestRuleMarkFailure$1.evaluate(TestRuleMarkFailure.java:48)
	at com.carrotsearch.randomizedtesting.rules.StatementAdapter.evaluate(StatementAdapter.java:36)
	at com.carrotsearch.randomizedtesting.ThreadLeakControl$StatementRunner.run(ThreadLeakControl.java:365)
	at com.carrotsearch.randomizedtesting.ThreadLeakControl.forkTimeoutingTask(ThreadLeakControl.java:798)
	at com.carrotsearch.randomizedtesting.ThreadLeakControl$3.evaluate(ThreadLeakControl.java:458)
	at com.carrotsearch.randomizedtesting.RandomizedRunner.runSingleTest(RandomizedRunner.java:836)
	at com.carrotsearch.randomizedtesting.RandomizedRunner$3.evaluate(RandomizedRunner.java:738)
	at com.carrotsearch.randomizedtesting.RandomizedRunner$4.evaluate(RandomizedRunner.java:772)
	at com.carrotsearch.randomizedtesting.RandomizedRunner$5.evaluate(RandomizedRunner.java:783)
	at com.carrotsearch.randomizedtesting.rules.StatementAdapter.evaluate(StatementAdapter.java:36)
	at com.carrotsearch.randomizedtesting.rules.SystemPropertiesRestoreRule$1.evaluate(SystemPropertiesRestoreRule.java:53)
	at org.apache.lucene.util.AbstractBeforeAfterRule$1.evaluate(AbstractBeforeAfterRule.java:46)
	at org.apache.lucene.util.TestRuleStoreClassName$1.evaluate(TestRuleStoreClassName.java:42)
	at com.carrotsearch.randomizedtesting.rules.SystemPropertiesInvariantRule$1.evaluate(SystemPropertiesInvariantRule.java:55)
	at com.carrotsearch.randomizedtesting.rules.NoShadowingOrOverridesOnMethodsRule$1.evaluate(NoShadowingOrOverridesOnMethodsRule.java:39)
	at com.carrotsearch.randomizedtesting.rules.NoShadowingOrOverridesOnMethodsRule$1.evaluate(NoShadowingOrOverridesOnMethodsRule.java:39)
	at com.carrotsearch.randomizedtesting.rules.StatementAdapter.evaluate(StatementAdapter.java:36)
	at com.carrotsearch.randomizedtesting.rules.StatementAdapter.evaluate(StatementAdapter.java:36)
	at com.carrotsearch.randomizedtesting.rules.StatementAdapter.evaluate(StatementAdapter.java:36)
	at org.apache.lucene.util.TestRuleAssertionsRequired$1.evaluate(TestRuleAssertionsRequired.java:43)
	at org.apache.lucene.util.TestRuleMarkFailure$1.evaluate(TestRuleMarkFailure.java:48)
	at org.apache.lucene.util.TestRuleIgnoreAfterMaxFailures$1.evaluate(TestRuleIgnoreAfterMaxFailures.java:65)
	at org.apache.lucene.util.TestRuleIgnoreTestSuites$1.evaluate(TestRuleIgnoreTestSuites.java:55)
	at com.carrotsearch.randomizedtesting.rules.StatementAdapter.evaluate(StatementAdapter.java:36)
	at com.carrotsearch.randomizedtesting.ThreadLeakControl$StatementRunner.run(ThreadLeakControl.java:365)
	at java.lang.Thread.run(Thread.java:745)


REGRESSION:  org.apache.solr.client.solrj.embedded.MultiCoreEmbeddedTest.testMultiCore

Error Message:
Could not initialize class java.lang.UNIXProcess

Stack Trace:
java.lang.NoClassDefFoundError: Could not initialize class java.lang.UNIXProcess
	at __randomizedtesting.SeedInfo.seed([58B9693DB651AE2E:DC9172CE7982A31B]:0)
	at java.lang.ProcessImpl.start(ProcessImpl.java:130)
	at java.lang.ProcessBuilder.start(ProcessBuilder.java:1022)
	at java.lang.Runtime.exec(Runtime.java:617)
	at java.lang.Runtime.exec(Runtime.java:450)
	at java.lang.Runtime.exec(Runtime.java:347)
	at org.apache.solr.handler.admin.SystemInfoHandler.execute(SystemInfoHandler.java:220)
	at org.apache.solr.handler.admin.SystemInfoHandler.getSystemInfo(SystemInfoHandler.java:176)
	at org.apache.solr.handler.admin.SystemInfoHandler.handleRequestBody(SystemInfoHandler.java:97)
	at org.apache.solr.handler.RequestHandlerBase.handleRequest(RequestHandlerBase.java:135)
	at org.apache.solr.core.SolrCore.execute(SolrCore.java:1981)
	at org.apache.solr.client.solrj.embedded.EmbeddedSolrServer.request(EmbeddedSolrServer.java:150)
	at org.apache.solr.client.solrj.request.QueryRequest.process(QueryRequest.java:91)
	at org.apache.solr.client.solrj.SolrServer.query(SolrServer.java:301)
	at org.apache.solr.client.solrj.MultiCoreExampleTestBase.testMultiCore(MultiCoreExampleTestBase.java:239)
	at sun.reflect.NativeMethodAccessorImpl.invoke0(Native Method)
	at sun.reflect.NativeMethodAccessorImpl.invoke(NativeMethodAccessorImpl.java:57)
	at sun.reflect.DelegatingMethodAccessorImpl.invoke(DelegatingMethodAccessorImpl.java:43)
	at java.lang.reflect.Method.invoke(Method.java:606)
	at com.carrotsearch.randomizedtesting.RandomizedRunner.invoke(RandomizedRunner.java:1618)
	at com.carrotsearch.randomizedtesting.RandomizedRunner$6.evaluate(RandomizedRunner.java:827)
	at com.carrotsearch.randomizedtesting.RandomizedRunner$7.evaluate(RandomizedRunner.java:863)
	at com.carrotsearch.randomizedtesting.RandomizedRunner$8.evaluate(RandomizedRunner.java:877)
	at com.carrotsearch.randomizedtesting.rules.SystemPropertiesRestoreRule$1.evaluate(SystemPropertiesRestoreRule.java:53)
	at org.apache.lucene.util.TestRuleSetupTeardownChained$1.evaluate(TestRuleSetupTeardownChained.java:50)
	at org.apache.lucene.util.AbstractBeforeAfterRule$1.evaluate(AbstractBeforeAfterRule.java:46)
	at com.carrotsearch.randomizedtesting.rules.SystemPropertiesInvariantRule$1.evaluate(SystemPropertiesInvariantRule.java:55)
	at org.apache.lucene.util.TestRuleThreadAndTestName$1.evaluate(TestRuleThreadAndTestName.java:49)
	at org.apache.lucene.util.TestRuleIgnoreAfterMaxFailures$1.evaluate(TestRuleIgnoreAfterMaxFailures.java:65)
	at org.apache.lucene.util.TestRuleMarkFailure$1.evaluate(TestRuleMarkFailure.java:48)
	at com.carrotsearch.randomizedtesting.rules.StatementAdapter.evaluate(StatementAdapter.java:36)
	at com.carrotsearch.randomizedtesting.ThreadLeakControl$StatementRunner.run(ThreadLeakControl.java:365)
	at com.carrotsearch.randomizedtesting.ThreadLeakControl.forkTimeoutingTask(ThreadLeakControl.java:798)
	at com.carrotsearch.randomizedtesting.ThreadLeakControl$3.evaluate(ThreadLeakControl.java:458)
	at com.carrotsearch.randomizedtesting.RandomizedRunner.runSingleTest(RandomizedRunner.java:836)
	at com.carrotsearch.randomizedtesting.RandomizedRunner$3.evaluate(RandomizedRunner.java:738)
	at com.carrotsearch.randomizedtesting.RandomizedRunner$4.evaluate(RandomizedRunner.java:772)
	at com.carrotsearch.randomizedtesting.RandomizedRunner$5.evaluate(RandomizedRunner.java:783)
	at com.carrotsearch.randomizedtesting.rules.StatementAdapter.evaluate(StatementAdapter.java:36)
	at com.carrotsearch.randomizedtesting.rules.SystemPropertiesRestoreRule$1.evaluate(SystemPropertiesRestoreRule.java:53)
	at org.apache.lucene.util.AbstractBeforeAfterRule$1.evaluate(AbstractBeforeAfterRule.java:46)
	at org.apache.lucene.util.TestRuleStoreClassName$1.evaluate(TestRuleStoreClassName.java:42)
	at com.carrotsearch.randomizedtesting.rules.SystemPropertiesInvariantRule$1.evaluate(SystemPropertiesInvariantRule.java:55)
	at com.carrotsearch.randomizedtesting.rules.NoShadowingOrOverridesOnMethodsRule$1.evaluate(NoShadowingOrOverridesOnMethodsRule.java:39)
	at com.carrotsearch.randomizedtesting.rules.NoShadowingOrOverridesOnMethodsRule$1.evaluate(NoShadowingOrOverridesOnMethodsRule.java:39)
	at com.carrotsearch.randomizedtesting.rules.StatementAdapter.evaluate(StatementAdapter.java:36)
	at com.carrotsearch.randomizedtesting.rules.StatementAdapter.evaluate(StatementAdapter.java:36)
	at com.carrotsearch.randomizedtesting.rules.StatementAdapter.evaluate(StatementAdapter.java:36)
	at org.apache.lucene.util.TestRuleAssertionsRequired$1.evaluate(TestRuleAssertionsRequired.java:43)
	at org.apache.lucene.util.TestRuleMarkFailure$1.evaluate(TestRuleMarkFailure.java:48)
	at org.apache.lucene.util.TestRuleIgnoreAfterMaxFailures$1.evaluate(TestRuleIgnoreAfterMaxFailures.java:65)
	at org.apache.lucene.util.TestRuleIgnoreTestSuites$1.evaluate(TestRuleIgnoreTestSuites.java:55)
	at com.carrotsearch.randomizedtesting.rules.StatementAdapter.evaluate(StatementAdapter.java:36)
	at com.carrotsearch.randomizedtesting.ThreadLeakControl$StatementRunner.run(ThreadLeakControl.java:365)
	at java.lang.Thread.run(Thread.java:745)


REGRESSION:  org.apache.solr.client.solrj.embedded.SolrExampleStreamingBinaryTest.testExampleConfig

Error Message:
Expected mime type application/octet-stream but got text/html. <html> <head> <meta http-equiv="Content-Type" content="text/html;charset=ISO-8859-1"/> <title>Error 500 {msg=posix_spawn is not a supported process launch mechanism on this platform.,trace=java.lang.Error: posix_spawn is not a supported process launch mechanism on this platform.  at java.lang.UNIXProcess$1.run(UNIXProcess.java:111)  at java.lang.UNIXProcess$1.run(UNIXProcess.java:93)  at java.security.AccessController.doPrivileged(Native Method)  at java.lang.UNIXProcess.&lt;clinit&gt;(UNIXProcess.java:91)  at java.lang.ProcessImpl.start(ProcessImpl.java:130)  at java.lang.ProcessBuilder.start(ProcessBuilder.java:1022)  at java.lang.Runtime.exec(Runtime.java:617)  at java.lang.Runtime.exec(Runtime.java:450)  at java.lang.Runtime.exec(Runtime.java:347)  at org.apache.solr.handler.admin.SystemInfoHandler.execute(SystemInfoHandler.java:220)  at org.apache.solr.handler.admin.SystemInfoHandler.getSystemInfo(SystemInfoHandler.java:176)  at org.apache.solr.handler.admin.SystemInfoHandler.handleRequestBody(SystemInfoHandler.java:97)  at org.apache.solr.handler.RequestHandlerBase.handleRequest(RequestHandlerBase.java:135)  at org.apache.solr.handler.admin.InfoHandler.handleRequestBody(InfoHandler.java:88)  at org.apache.solr.handler.RequestHandlerBase.handleRequest(RequestHandlerBase.java:135)  at org.apache.solr.servlet.SolrDispatchFilter.handleAdminRequest(SolrDispatchFilter.java:732)  at org.apache.solr.servlet.SolrDispatchFilter.doFilter(SolrDispatchFilter.java:275)  at org.apache.solr.servlet.SolrDispatchFilter.doFilter(SolrDispatchFilter.java:208)  at org.eclipse.jetty.servlet.ServletHandler$CachedChain.doFilter(ServletHandler.java:1419)  at org.apache.solr.client.solrj.embedded.JettySolrRunner$DebugFilter.doFilter(JettySolrRunner.java:137)  at org.eclipse.jetty.servlet.ServletHandler$CachedChain.doFilter(ServletHandler.java:1419)  at org.eclipse.jetty.servlet.ServletHandler.doHandle(ServletHandler.java:455)  at org.eclipse.jetty.server.session.SessionHandler.doHandle(SessionHandler.java:229)  at org.eclipse.jetty.server.handler.ScopedHandler.handle(ScopedHandler.java:137)  at org.eclipse.jetty.server.handler.GzipHandler.handle(GzipHandler.java:301)  at org.eclipse.jetty.server.handler.ContextHandler.doHandle(ContextHandler.java:1077)  at org.eclipse.jetty.servlet.ServletHandler.doScope(ServletHandler.java:384)  at org.eclipse.jetty.server.session.SessionHandler.doScope(SessionHandler.java:193)  at org.eclipse.jetty.server.handler.ContextHandler.doScope(ContextHandler.java:1009)  at org.eclipse.jetty.server.handler.ScopedHandler.handle(ScopedHandler.java:135)  at org.eclipse.jetty.server.handler.HandlerWrapper.handle(HandlerWrapper.java:116)  at org.eclipse.jetty.server.Server.handle(Server.java:368)  at org.eclipse.jetty.server.AbstractHttpConnection.handleRequest(AbstractHttpConnection.java:489)  at org.eclipse.jetty.server.BlockingHttpConnection.handleRequest(BlockingHttpConnection.java:53)  at org.eclipse.jetty.server.AbstractHttpConnection.headerComplete(AbstractHttpConnection.java:942)  at org.eclipse.jetty.server.AbstractHttpConnection$RequestHandler.headerComplete(AbstractHttpConnection.java:1004)  at org.eclipse.jetty.http.HttpParser.parseNext(HttpParser.java:640)  at org.eclipse.jetty.http.HttpParser.parseAvailable(HttpParser.java:235)  at org.eclipse.jetty.server.BlockingHttpConnection.handle(BlockingHttpConnection.java:72)  at org.eclipse.jetty.server.bio.SocketConnector$ConnectorEndPoint.run(SocketConnector.java:264)  at org.eclipse.jetty.util.thread.QueuedThreadPool.runJob(QueuedThreadPool.java:608)  at org.eclipse.jetty.util.thread.QueuedThreadPool$3.run(QueuedThreadPool.java:543)  at java.lang.Thread.run(Thread.java:745) ,code=500}</title> </head> <body> <h2>HTTP ERROR: 500</h2> <p>Problem accessing /solr/admin/info/system. Reason: <pre>    {msg=posix_spawn is not a supported process launch mechanism on this platform.,trace=java.lang.Error: posix_spawn is not a supported process launch mechanism on this platform.  at java.lang.UNIXProcess$1.run(UNIXProcess.java:111)  at java.lang.UNIXProcess$1.run(UNIXProcess.java:93)  at java.security.AccessController.doPrivileged(Native Method)  at java.lang.UNIXProcess.&lt;clinit&gt;(UNIXProcess.java:91)  at java.lang.ProcessImpl.start(ProcessImpl.java:130)  at java.lang.ProcessBuilder.start(ProcessBuilder.java:1022)  at java.lang.Runtime.exec(Runtime.java:617)  at java.lang.Runtime.exec(Runtime.java:450)  at java.lang.Runtime.exec(Runtime.java:347)  at org.apache.solr.handler.admin.SystemInfoHandler.execute(SystemInfoHandler.java:220)  at org.apache.solr.handler.admin.SystemInfoHandler.getSystemInfo(SystemInfoHandler.java:176)  at org.apache.solr.handler.admin.SystemInfoHandler.handleRequestBody(SystemInfoHandler.java:97)  at org.apache.solr.handler.RequestHandlerBase.handleRequest(RequestHandlerBase.java:135)  at org.apache.solr.handler.admin.InfoHandler.handleRequestBody(InfoHandler.java:88)  at org.apache.solr.handler.RequestHandlerBase.handleRequest(RequestHandlerBase.java:135)  at org.apache.solr.servlet.SolrDispatchFilter.handleAdminRequest(SolrDispatchFilter.java:732)  at org.apache.solr.servlet.SolrDispatchFilter.doFilter(SolrDispatchFilter.java:275)  at org.apache.solr.servlet.SolrDispatchFilter.doFilter(SolrDispatchFilter.java:208)  at org.eclipse.jetty.servlet.ServletHandler$CachedChain.doFilter(ServletHandler.java:1419)  at org.apache.solr.client.solrj.embedded.JettySolrRunner$DebugFilter.doFilter(JettySolrRunner.java:137)  at org.eclipse.jetty.servlet.ServletHandler$CachedChain.doFilter(ServletHandler.java:1419)  at org.eclipse.jetty.servlet.ServletHandler.doHandle(ServletHandler.java:455)  at org.eclipse.jetty.server.session.SessionHandler.doHandle(SessionHandler.java:229)  at org.eclipse.jetty.server.handler.ScopedHandler.handle(ScopedHandler.java:137)  at org.eclipse.jetty.server.handler.GzipHandler.handle(GzipHandler.java:301)  at org.eclipse.jetty.server.handler.ContextHandler.doHandle(ContextHandler.java:1077)  at org.eclipse.jetty.servlet.ServletHandler.doScope(ServletHandler.java:384)  at org.eclipse.jetty.server.session.SessionHandler.doScope(SessionHandler.java:193)  at org.eclipse.jetty.server.handler.ContextHandler.doScope(ContextHandler.java:1009)  at org.eclipse.jetty.server.handler.ScopedHandler.handle(ScopedHandler.java:135)  at org.eclipse.jetty.server.handler.HandlerWrapper.handle(HandlerWrapper.java:116)  at org.eclipse.jetty.server.Server.handle(Server.java:368)  at org.eclipse.jetty.server.AbstractHttpConnection.handleRequest(AbstractHttpConnection.java:489)  at org.eclipse.jetty.server.BlockingHttpConnection.handleRequest(BlockingHttpConnection.java:53)  at org.eclipse.jetty.server.AbstractHttpConnection.headerComplete(AbstractHttpConnection.java:942)  at org.eclipse.jetty.server.AbstractHttpConnection$RequestHandler.headerComplete(AbstractHttpConnection.java:1004)  at org.eclipse.jetty.http.HttpParser.parseNext(HttpParser.java:640)  at org.eclipse.jetty.http.HttpParser.parseAvailable(HttpParser.java:235)  at org.eclipse.jetty.server.BlockingHttpConnection.handle(BlockingHttpConnection.java:72)  at org.eclipse.jetty.server.bio.SocketConnector$ConnectorEndPoint.run(SocketConnector.java:264)  at org.eclipse.jetty.util.thread.QueuedThreadPool.runJob(QueuedThreadPool.java:608)  at org.eclipse.jetty.util.thread.QueuedThreadPool$3.run(QueuedThreadPool.java:543)  at java.lang.Thread.run(Thread.java:745) ,code=500}</pre></p> <hr /><i><small>Powered by Jetty://</small></i>                                                                                                                                                                                                                                                                                                                                                                                                                                                                                                                                                                                                                                                                                                                                                                                                                                                                                                                                                                                                                     </body> </html> 

Stack Trace:
org.apache.solr.client.solrj.impl.HttpSolrServer$RemoteSolrException: Expected mime type application/octet-stream but got text/html. <html>
<head>
<meta http-equiv="Content-Type" content="text/html;charset=ISO-8859-1"/>
<title>Error 500 {msg=posix_spawn is not a supported process launch mechanism on this platform.,trace=java.lang.Error: posix_spawn is not a supported process launch mechanism on this platform.
	at java.lang.UNIXProcess$1.run(UNIXProcess.java:111)
	at java.lang.UNIXProcess$1.run(UNIXProcess.java:93)
	at java.security.AccessController.doPrivileged(Native Method)
	at java.lang.UNIXProcess.&lt;clinit&gt;(UNIXProcess.java:91)
	at java.lang.ProcessImpl.start(ProcessImpl.java:130)
	at java.lang.ProcessBuilder.start(ProcessBuilder.java:1022)
	at java.lang.Runtime.exec(Runtime.java:617)
	at java.lang.Runtime.exec(Runtime.java:450)
	at java.lang.Runtime.exec(Runtime.java:347)
	at org.apache.solr.handler.admin.SystemInfoHandler.execute(SystemInfoHandler.java:220)
	at org.apache.solr.handler.admin.SystemInfoHandler.getSystemInfo(SystemInfoHandler.java:176)
	at org.apache.solr.handler.admin.SystemInfoHandler.handleRequestBody(SystemInfoHandler.java:97)
	at org.apache.solr.handler.RequestHandlerBase.handleRequest(RequestHandlerBase.java:135)
	at org.apache.solr.handler.admin.InfoHandler.handleRequestBody(InfoHandler.java:88)
	at org.apache.solr.handler.RequestHandlerBase.handleRequest(RequestHandlerBase.java:135)
	at org.apache.solr.servlet.SolrDispatchFilter.handleAdminRequest(SolrDispatchFilter.java:732)
	at org.apache.solr.servlet.SolrDispatchFilter.doFilter(SolrDispatchFilter.java:275)
	at org.apache.solr.servlet.SolrDispatchFilter.doFilter(SolrDispatchFilter.java:208)
	at org.eclipse.jetty.servlet.ServletHandler$CachedChain.doFilter(ServletHandler.java:1419)
	at org.apache.solr.client.solrj.embedded.JettySolrRunner$DebugFilter.doFilter(JettySolrRunner.java:137)
	at org.eclipse.jetty.servlet.ServletHandler$CachedChain.doFilter(ServletHandler.java:1419)
	at org.eclipse.jetty.servlet.ServletHandler.doHandle(ServletHandler.java:455)
	at org.eclipse.jetty.server.session.SessionHandler.doHandle(SessionHandler.java:229)
	at org.eclipse.jetty.server.handler.ScopedHandler.handle(ScopedHandler.java:137)
	at org.eclipse.jetty.server.handler.GzipHandler.handle(GzipHandler.java:301)
	at org.eclipse.jetty.server.handler.ContextHandler.doHandle(ContextHandler.java:1077)
	at org.eclipse.jetty.servlet.ServletHandler.doScope(ServletHandler.java:384)
	at org.eclipse.jetty.server.session.SessionHandler.doScope(SessionHandler.java:193)
	at org.eclipse.jetty.server.handler.ContextHandler.doScope(ContextHandler.java:1009)
	at org.eclipse.jetty.server.handler.ScopedHandler.handle(ScopedHandler.java:135)
	at org.eclipse.jetty.server.handler.HandlerWrapper.handle(HandlerWrapper.java:116)
	at org.eclipse.jetty.server.Server.handle(Server.java:368)
	at org.eclipse.jetty.server.AbstractHttpConnection.handleRequest(AbstractHttpConnection.java:489)
	at org.eclipse.jetty.server.BlockingHttpConnection.handleRequest(BlockingHttpConnection.java:53)
	at org.eclipse.jetty.server.AbstractHttpConnection.headerComplete(AbstractHttpConnection.java:942)
	at org.eclipse.jetty.server.AbstractHttpConnection$RequestHandler.headerComplete(AbstractHttpConnection.java:1004)
	at org.eclipse.jetty.http.HttpParser.parseNext(HttpParser.java:640)
	at org.eclipse.jetty.http.HttpParser.parseAvailable(HttpParser.java:235)
	at org.eclipse.jetty.server.BlockingHttpConnection.handle(BlockingHttpConnection.java:72)
	at org.eclipse.jetty.server.bio.SocketConnector$ConnectorEndPoint.run(SocketConnector.java:264)
	at org.eclipse.jetty.util.thread.QueuedThreadPool.runJob(QueuedThreadPool.java:608)
	at org.eclipse.jetty.util.thread.QueuedThreadPool$3.run(QueuedThreadPool.java:543)
	at java.lang.Thread.run(Thread.java:745)
,code=500}</title>
</head>
<body>
<h2>HTTP ERROR: 500</h2>
<p>Problem accessing /solr/admin/info/system. Reason:
<pre>    {msg=posix_spawn is not a supported process launch mechanism on this platform.,trace=java.lang.Error: posix_spawn is not a supported process launch mechanism on this platform.
	at java.lang.UNIXProcess$1.run(UNIXProcess.java:111)
	at java.lang.UNIXProcess$1.run(UNIXProcess.java:93)
	at java.security.AccessController.doPrivileged(Native Method)
	at java.lang.UNIXProcess.&lt;clinit&gt;(UNIXProcess.java:91)
	at java.lang.ProcessImpl.start(ProcessImpl.java:130)
	at java.lang.ProcessBuilder.start(ProcessBuilder.java:1022)
	at java.lang.Runtime.exec(Runtime.java:617)
	at java.lang.Runtime.exec(Runtime.java:450)
	at java.lang.Runtime.exec(Runtime.java:347)
	at org.apache.solr.handler.admin.SystemInfoHandler.execute(SystemInfoHandler.java:220)
	at org.apache.solr.handler.admin.SystemInfoHandler.getSystemInfo(SystemInfoHandler.java:176)
	at org.apache.solr.handler.admin.SystemInfoHandler.handleRequestBody(SystemInfoHandler.java:97)
	at org.apache.solr.handler.RequestHandlerBase.handleRequest(RequestHandlerBase.java:135)
	at org.apache.solr.handler.admin.InfoHandler.handleRequestBody(InfoHandler.java:88)
	at org.apache.solr.handler.RequestHandlerBase.handleRequest(RequestHandlerBase.java:135)
	at org.apache.solr.servlet.SolrDispatchFilter.handleAdminRequest(SolrDispatchFilter.java:732)
	at org.apache.solr.servlet.SolrDispatchFilter.doFilter(SolrDispatchFilter.java:275)
	at org.apache.solr.servlet.SolrDispatchFilter.doFilter(SolrDispatchFilter.java:208)
	at org.eclipse.jetty.servlet.ServletHandler$CachedChain.doFilter(ServletHandler.java:1419)
	at org.apache.solr.client.solrj.embedded.JettySolrRunner$DebugFilter.doFilter(JettySolrRunner.java:137)
	at org.eclipse.jetty.servlet.ServletHandler$CachedChain.doFilter(ServletHandler.java:1419)
	at org.eclipse.jetty.servlet.ServletHandler.doHandle(ServletHandler.java:455)
	at org.eclipse.jetty.server.session.SessionHandler.doHandle(SessionHandler.java:229)
	at org.eclipse.jetty.server.handler.ScopedHandler.handle(ScopedHandler.java:137)
	at org.eclipse.jetty.server.handler.GzipHandler.handle(GzipHandler.java:301)
	at org.eclipse.jetty.server.handler.ContextHandler.doHandle(ContextHandler.java:1077)
	at org.eclipse.jetty.servlet.ServletHandler.doScope(ServletHandler.java:384)
	at org.eclipse.jetty.server.session.SessionHandler.doScope(SessionHandler.java:193)
	at org.eclipse.jetty.server.handler.ContextHandler.doScope(ContextHandler.java:1009)
	at org.eclipse.jetty.server.handler.ScopedHandler.handle(ScopedHandler.java:135)
	at org.eclipse.jetty.server.handler.HandlerWrapper.handle(HandlerWrapper.java:116)
	at org.eclipse.jetty.server.Server.handle(Server.java:368)
	at org.eclipse.jetty.server.AbstractHttpConnection.handleRequest(AbstractHttpConnection.java:489)
	at org.eclipse.jetty.server.BlockingHttpConnection.handleRequest(BlockingHttpConnection.java:53)
	at org.eclipse.jetty.server.AbstractHttpConnection.headerComplete(AbstractHttpConnection.java:942)
	at org.eclipse.jetty.server.AbstractHttpConnection$RequestHandler.headerComplete(AbstractHttpConnection.java:1004)
	at org.eclipse.jetty.http.HttpParser.parseNext(HttpParser.java:640)
	at org.eclipse.jetty.http.HttpParser.parseAvailable(HttpParser.java:235)
	at org.eclipse.jetty.server.BlockingHttpConnection.handle(BlockingHttpConnection.java:72)
	at org.eclipse.jetty.server.bio.SocketConnector$ConnectorEndPoint.run(SocketConnector.java:264)
	at org.eclipse.jetty.util.thread.QueuedThreadPool.runJob(QueuedThreadPool.java:608)
	at org.eclipse.jetty.util.thread.QueuedThreadPool$3.run(QueuedThreadPool.java:543)
	at java.lang.Thread.run(Thread.java:745)
,code=500}</pre></p>
<hr /><i><small>Powered by Jetty://</small></i>
                                                
                                                
                                                
                                                
                                                
                                                
                                                
                                                
                                                
                                                
                                                
                                                
                                                
                                                
                                                
                                                
                                                
                                                
                                                
                                                
</body>
</html>

	at __randomizedtesting.SeedInfo.seed([58B9693DB651AE2E:EF947DA5715648F7]:0)
	at org.apache.solr.client.solrj.impl.HttpSolrServer.executeMethod(HttpSolrServer.java:513)
	at org.apache.solr.client.solrj.impl.HttpSolrServer.request(HttpSolrServer.java:210)
	at org.apache.solr.client.solrj.impl.HttpSolrServer.request(HttpSolrServer.java:206)
	at org.apache.solr.client.solrj.request.QueryRequest.process(QueryRequest.java:91)
	at org.apache.solr.client.solrj.SolrServer.query(SolrServer.java:301)
	at org.apache.solr.client.solrj.SolrExampleTests.testExampleConfig(SolrExampleTests.java:220)
	at sun.reflect.NativeMethodAccessorImpl.invoke0(Native Method)
	at sun.reflect.NativeMethodAccessorImpl.invoke(NativeMethodAccessorImpl.java:57)
	at sun.reflect.DelegatingMethodAccessorImpl.invoke(DelegatingMethodAccessorImpl.java:43)
	at java.lang.reflect.Method.invoke(Method.java:606)
	at com.carrotsearch.randomizedtesting.RandomizedRunner.invoke(RandomizedRunner.java:1618)
	at com.carrotsearch.randomizedtesting.RandomizedRunner$6.evaluate(RandomizedRunner.java:827)
	at com.carrotsearch.randomizedtesting.RandomizedRunner$7.evaluate(RandomizedRunner.java:863)
	at com.carrotsearch.randomizedtesting.RandomizedRunner$8.evaluate(RandomizedRunner.java:877)
	at com.carrotsearch.randomizedtesting.rules.SystemPropertiesRestoreRule$1.evaluate(SystemPropertiesRestoreRule.java:53)
	at org.apache.lucene.util.TestRuleSetupTeardownChained$1.evaluate(TestRuleSetupTeardownChained.java:50)
	at org.apache.lucene.util.AbstractBeforeAfterRule$1.evaluate(AbstractBeforeAfterRule.java:46)
	at com.carrotsearch.randomizedtesting.rules.SystemPropertiesInvariantRule$1.evaluate(SystemPropertiesInvariantRule.java:55)
	at org.apache.lucene.util.TestRuleThreadAndTestName$1.evaluate(TestRuleThreadAndTestName.java:49)
	at org.apache.lucene.util.TestRuleIgnoreAfterMaxFailures$1.evaluate(TestRuleIgnoreAfterMaxFailures.java:65)
	at org.apache.lucene.util.TestRuleMarkFailure$1.evaluate(TestRuleMarkFailure.java:48)
	at com.carrotsearch.randomizedtesting.rules.StatementAdapter.evaluate(StatementAdapter.java:36)
	at com.carrotsearch.randomizedtesting.ThreadLeakControl$StatementRunner.run(ThreadLeakControl.java:365)
	at com.carrotsearch.randomizedtesting.ThreadLeakControl.forkTimeoutingTask(ThreadLeakControl.java:798)
	at com.carrotsearch.randomizedtesting.ThreadLeakControl$3.evaluate(ThreadLeakControl.java:458)
	at com.carrotsearch.randomizedtesting.RandomizedRunner.runSingleTest(RandomizedRunner.java:836)
	at com.carrotsearch.randomizedtesting.RandomizedRunner$3.evaluate(RandomizedRunner.java:738)
	at com.carrotsearch.randomizedtesting.RandomizedRunner$4.evaluate(RandomizedRunner.java:772)
	at com.carrotsearch.randomizedtesting.RandomizedRunner$5.evaluate(RandomizedRunner.java:783)
	at com.carrotsearch.randomizedtesting.rules.StatementAdapter.evaluate(StatementAdapter.java:36)
	at com.carrotsearch.randomizedtesting.rules.SystemPropertiesRestoreRule$1.evaluate(SystemPropertiesRestoreRule.java:53)
	at org.apache.lucene.util.AbstractBeforeAfterRule$1.evaluate(AbstractBeforeAfterRule.java:46)
	at org.apache.lucene.util.TestRuleStoreClassName$1.evaluate(TestRuleStoreClassName.java:42)
	at com.carrotsearch.randomizedtesting.rules.SystemPropertiesInvariantRule$1.evaluate(SystemPropertiesInvariantRule.java:55)
	at com.carrotsearch.randomizedtesting.rules.NoShadowingOrOverridesOnMethodsRule$1.evaluate(NoShadowingOrOverridesOnMethodsRule.java:39)
	at com.carrotsearch.randomizedtesting.rules.NoShadowingOrOverridesOnMethodsRule$1.evaluate(NoShadowingOrOverridesOnMethodsRule.java:39)
	at com.carrotsearch.randomizedtesting.rules.StatementAdapter.evaluate(StatementAdapter.java:36)
	at com.carrotsearch.randomizedtesting.rules.StatementAdapter.evaluate(StatementAdapter.java:36)
	at com.carrotsearch.randomizedtesting.rules.StatementAdapter.evaluate(StatementAdapter.java:36)
	at org.apache.lucene.util.TestRuleAssertionsRequired$1.evaluate(TestRuleAssertionsRequired.java:43)
	at org.apache.lucene.util.TestRuleMarkFailure$1.evaluate(TestRuleMarkFailure.java:48)
	at org.apache.lucene.util.TestRuleIgnoreAfterMaxFailures$1.evaluate(TestRuleIgnoreAfterMaxFailures.java:65)
	at org.apache.lucene.util.TestRuleIgnoreTestSuites$1.evaluate(TestRuleIgnoreTestSuites.java:55)
	at com.carrotsearch.randomizedtesting.rules.StatementAdapter.evaluate(StatementAdapter.java:36)
	at com.carrotsearch.randomizedtesting.ThreadLeakControl$StatementRunner.run(ThreadLeakControl.java:365)
	at java.lang.Thread.run(Thread.java:745)




Build Log:
[...truncated 12641 lines...]
   [junit4] Suite: org.apache.solr.client.solrj.embedded.SolrExampleStreamingBinaryTest
   [junit4]   2> Creating dataDir: /usr/home/hudson/hudson-slave/workspace/Lucene-Solr-Tests-trunk-Java7/solr/build/solr-solrj/test/J0/./temp/solr.client.solrj.embedded.SolrExampleStreamingBinaryTest-58B9693DB651AE2E-001/init-core-data-001
   [junit4]   2> 6081 T16 oas.SolrTestCaseJ4.initCore ####initCore
   [junit4]   2> 6081 T16 oas.SolrTestCaseJ4.initCore ####initCore end
   [junit4]   2> 7043 T16 oejs.Server.doStart jetty-8.1.10.v20130312
   [junit4]   2> 7465 T16 oejs.AbstractConnector.doStart Started SocketConnector@127.0.0.1:34656
   [junit4]   2> 7847 T16 oass.SolrDispatchFilter.init SolrDispatchFilter.init()
   [junit4]   2> 7995 T16 oasc.SolrResourceLoader.locateSolrHome JNDI not configured for solr (NoInitialContextEx)
   [junit4]   2> 7996 T16 oasc.SolrResourceLoader.locateSolrHome using system property solr.solr.home: /usr/home/hudson/hudson-slave/workspace/Lucene-Solr-Tests-trunk-Java7/solr/example/solr
   [junit4]   2> 7997 T16 oasc.SolrResourceLoader.<init> new SolrResourceLoader for directory: '/usr/home/hudson/hudson-slave/workspace/Lucene-Solr-Tests-trunk-Java7/solr/example/solr/'
   [junit4]   2> 8813 T16 oasc.ConfigSolr.fromFile Loading container configuration from /usr/home/hudson/hudson-slave/workspace/Lucene-Solr-Tests-trunk-Java7/solr/example/solr/solr.xml
   [junit4]   2> 9072 T16 oasc.CorePropertiesLocator.<init> Config-defined core root directory: /usr/home/hudson/hudson-slave/workspace/Lucene-Solr-Tests-trunk-Java7/solr/example/solr
   [junit4]   2> 9104 T16 oasc.CoreContainer.<init> New CoreContainer 226232086
   [junit4]   2> 9105 T16 oasc.CoreContainer.load Loading cores into CoreContainer [instanceDir=/usr/home/hudson/hudson-slave/workspace/Lucene-Solr-Tests-trunk-Java7/solr/example/solr/]
   [junit4]   2> 9273 T16 oashc.HttpShardHandlerFactory.getParameter Setting socketTimeout to: 0
   [junit4]   2> 9274 T16 oashc.HttpShardHandlerFactory.getParameter Setting urlScheme to: null
   [junit4]   2> 9284 T16 oashc.HttpShardHandlerFactory.getParameter Setting connTimeout to: 0
   [junit4]   2> 9284 T16 oashc.HttpShardHandlerFactory.getParameter Setting maxConnectionsPerHost to: 20
   [junit4]   2> 9285 T16 oashc.HttpShardHandlerFactory.getParameter Setting corePoolSize to: 0
   [junit4]   2> 9286 T16 oashc.HttpShardHandlerFactory.getParameter Setting maximumPoolSize to: 2147483647
   [junit4]   2> 9286 T16 oashc.HttpShardHandlerFactory.getParameter Setting maxThreadIdleTime to: 5
   [junit4]   2> 9287 T16 oashc.HttpShardHandlerFactory.getParameter Setting sizeOfQueue to: -1
   [junit4]   2> 9288 T16 oashc.HttpShardHandlerFactory.getParameter Setting fairnessPolicy to: false
   [junit4]   2> 9680 T16 oasu.UpdateShardHandler.<init> Creating UpdateShardHandler HTTP client with params: socketTimeout=0&connTimeout=0&retry=false
   [junit4]   2> 9700 T16 oasl.LogWatcher.createWatcher SLF4J impl is org.slf4j.impl.Log4jLoggerFactory
   [junit4]   2> 9706 T16 oasl.LogWatcher.newRegisteredLogWatcher Registering Log Listener [Log4j (org.slf4j.impl.Log4jLoggerFactory)]
   [junit4]   2> 9715 T16 oasc.CoreContainer.load Host Name: 
   [junit4]   2> 10063 T16 oasc.CorePropertiesLocator.discover Looking for core definitions underneath /usr/home/hudson/hudson-slave/workspace/Lucene-Solr-Tests-trunk-Java7/solr/example/solr
   [junit4]   2> 10201 T16 oasc.CorePropertiesLocator.discoverUnder Found core collection1 in /usr/home/hudson/hudson-slave/workspace/Lucene-Solr-Tests-trunk-Java7/solr/example/solr/collection1/
   [junit4]   2> 10216 T16 oasc.CorePropertiesLocator.discover Found 1 core definitions
   [junit4]   2> 10222 T28 oasc.SolrResourceLoader.<init> new SolrResourceLoader for directory: '/usr/home/hudson/hudson-slave/workspace/Lucene-Solr-Tests-trunk-Java7/solr/example/solr/collection1/'
   [junit4]   2> 10522 T28 oasc.SolrConfig.initLibs Adding specified lib dirs to ClassLoader
   [junit4]   2> 10532 T28 oasc.SolrResourceLoader.addToClassLoader WARN No files added to classloader from lib: ../../../contrib/extraction/lib (resolved as: /usr/home/hudson/hudson-slave/workspace/Lucene-Solr-Tests-trunk-Java7/solr/example/solr/collection1/../../../contrib/extraction/lib).
   [junit4]   2> 10534 T28 oasc.SolrResourceLoader.addToClassLoader WARN Can't find (or read) directory to add to classloader: ../../../dist/ (resolved as: /usr/home/hudson/hudson-slave/workspace/Lucene-Solr-Tests-trunk-Java7/solr/example/solr/collection1/../../../dist).
   [junit4]   2> 10536 T28 oasc.SolrResourceLoader.addToClassLoader WARN No files added to classloader from lib: ../../../contrib/clustering/lib/ (resolved as: /usr/home/hudson/hudson-slave/workspace/Lucene-Solr-Tests-trunk-Java7/solr/example/solr/collection1/../../../contrib/clustering/lib).
   [junit4]   2> 10537 T28 oasc.SolrResourceLoader.addToClassLoader WARN Can't find (or read) directory to add to classloader: ../../../dist/ (resolved as: /usr/home/hudson/hudson-slave/workspace/Lucene-Solr-Tests-trunk-Java7/solr/example/solr/collection1/../../../dist).
   [junit4]   2> 10539 T28 oasc.SolrResourceLoader.addToClassLoader WARN No files added to classloader from lib: ../../../contrib/langid/lib/ (resolved as: /usr/home/hudson/hudson-slave/workspace/Lucene-Solr-Tests-trunk-Java7/solr/example/solr/collection1/../../../contrib/langid/lib).
   [junit4]   2> 10541 T28 oasc.SolrResourceLoader.addToClassLoader WARN Can't find (or read) directory to add to classloader: ../../../dist/ (resolved as: /usr/home/hudson/hudson-slave/workspace/Lucene-Solr-Tests-trunk-Java7/solr/example/solr/collection1/../../../dist).
   [junit4]   2> 10543 T28 oasc.SolrResourceLoader.addToClassLoader WARN No files added to classloader from lib: ../../../contrib/velocity/lib (resolved as: /usr/home/hudson/hudson-slave/workspace/Lucene-Solr-Tests-trunk-Java7/solr/example/solr/collection1/../../../contrib/velocity/lib).
   [junit4]   2> 10544 T28 oasc.SolrResourceLoader.addToClassLoader WARN Can't find (or read) directory to add to classloader: ../../../dist/ (resolved as: /usr/home/hudson/hudson-slave/workspace/Lucene-Solr-Tests-trunk-Java7/solr/example/solr/collection1/../../../dist).
   [junit4]   2> 10777 T28 oasu.SolrIndexConfig.<init> IndexWriter infoStream solr logging is enabled
   [junit4]   2> 10789 T28 oasc.SolrConfig.<init> Using Lucene MatchVersion: LUCENE_5_0
   [junit4]   2> 11397 T28 oasc.SolrConfig.<init> Loaded SolrConfig: solrconfig.xml
   [junit4]   2> 11482 T28 oass.IndexSchema.readSchema Reading Solr Schema from schema.xml
   [junit4]   2> 11665 T28 oass.IndexSchema.readSchema [collection1] Schema name=example
   [junit4]   2> 14811 T28 oass.IndexSchema.readSchema unique key field: id
   [junit4]   2> 14977 T28 oasr.RestManager$Registry.registerManagedResource Registered ManagedResource impl org.apache.solr.rest.schema.analysis.ManagedWordSetResource for path /schema/analysis/stopwords/english
   [junit4]   2> 14986 T28 oasr.RestManager$Registry.registerManagedResource Registered ManagedResource impl org.apache.solr.rest.schema.analysis.ManagedSynonymFilterFactory$SynonymManager for path /schema/analysis/synonyms/english
   [junit4]   2> 16047 T28 oass.FileExchangeRateProvider.reload Reloading exchange rates from file currency.xml
   [junit4]   2> 16078 T28 oass.FileExchangeRateProvider.reload Reloading exchange rates from file currency.xml
   [junit4]   2> 16331 T28 oasc.CoreContainer.create Creating SolrCore 'collection1' using configuration from instancedir /usr/home/hudson/hudson-slave/workspace/Lucene-Solr-Tests-trunk-Java7/solr/example/solr/collection1/
   [junit4]   2> 16448 T28 oasc.SolrCore.initDirectoryFactory org.apache.solr.core.MockDirectoryFactory
   [junit4]   2> 16493 T28 oasc.SolrCore.<init> [collection1] Opening new SolrCore at /usr/home/hudson/hudson-slave/workspace/Lucene-Solr-Tests-trunk-Java7/solr/example/solr/collection1/, dataDir=/usr/home/hudson/hudson-slave/workspace/Lucene-Solr-Tests-trunk-Java7/solr/build/solr-solrj/test/J0/temp/solr.client.solrj.embedded.SolrExampleStreamingBinaryTest-58B9693DB651AE2E-001/tempDir-001/
   [junit4]   2> 16499 T28 oasc.JmxMonitoredMap.<init> No JMX servers found, not exposing Solr information with JMX.
   [junit4]   2> 16547 T28 oasc.SolrCore.initListeners [collection1] Added SolrEventListener for newSearcher: org.apache.solr.core.QuerySenderListener{queries=[]}
   [junit4]   2> 16548 T28 oasc.SolrCore.initListeners [collection1] Added SolrEventListener for firstSearcher: org.apache.solr.core.QuerySenderListener{queries=[{q=static firstSearcher warming in solrconfig.xml}]}
   [junit4]   2> 16680 T28 oasc.CachingDirectoryFactory.get return new directory for /usr/home/hudson/hudson-slave/workspace/Lucene-Solr-Tests-trunk-Java7/solr/build/solr-solrj/test/J0/temp/solr.client.solrj.embedded.SolrExampleStreamingBinaryTest-58B9693DB651AE2E-001/tempDir-001
   [junit4]   2> 16681 T28 oasc.SolrCore.getNewIndexDir New index directory detected: old=null new=/usr/home/hudson/hudson-slave/workspace/Lucene-Solr-Tests-trunk-Java7/solr/build/solr-solrj/test/J0/temp/solr.client.solrj.embedded.SolrExampleStreamingBinaryTest-58B9693DB651AE2E-001/tempDir-001/index/
   [junit4]   2> 16682 T28 oasc.SolrCore.initIndex WARN [collection1] Solr index directory '/usr/home/hudson/hudson-slave/workspace/Lucene-Solr-Tests-trunk-Java7/solr/build/solr-solrj/test/J0/temp/solr.client.solrj.embedded.SolrExampleStreamingBinaryTest-58B9693DB651AE2E-001/tempDir-001/index' doesn't exist. Creating new index...
   [junit4]   2> 16698 T28 oasc.CachingDirectoryFactory.get return new directory for /usr/home/hudson/hudson-slave/workspace/Lucene-Solr-Tests-trunk-Java7/solr/build/solr-solrj/test/J0/temp/solr.client.solrj.embedded.SolrExampleStreamingBinaryTest-58B9693DB651AE2E-001/tempDir-001/index
   [junit4]   2> 16843 T28 oasu.LoggingInfoStream.message [IFD][coreLoadExecutor-5-thread-1]: init: current segments file is "null"; deletionPolicy=org.apache.solr.core.IndexDeletionPolicyWrapper@309fb7a9
   [junit4]   2> 16848 T28 oasu.LoggingInfoStream.message [IFD][coreLoadExecutor-5-thread-1]: now checkpoint "" [0 segments ; isCommit = false]
   [junit4]   2> 16849 T28 oasu.LoggingInfoStream.message [IFD][coreLoadExecutor-5-thread-1]: 0 msec to checkpoint
   [junit4]   2> 16849 T28 oasu.LoggingInfoStream.message [IW][coreLoadExecutor-5-thread-1]: init: create=true
   [junit4]   2> 16850 T28 oasu.LoggingInfoStream.message [IW][coreLoadExecutor-5-thread-1]: 
   [junit4]   2> 	dir=MockDirectoryWrapper(RAMDirectory@10b9d0fd lockFactory=NativeFSLockFactory@/usr/home/hudson/hudson-slave/workspace/Lucene-Solr-Tests-trunk-Java7/solr/build/solr-solrj/test/J0/temp/solr.client.solrj.embedded.SolrExampleStreamingBinaryTest-58B9693DB651AE2E-001/tempDir-001/index)
   [junit4]   2> 	index=
   [junit4]   2> 	version=5.0-SNAPSHOT
   [junit4]   2> 	matchVersion=LUCENE_5_0
   [junit4]   2> 	analyzer=null
   [junit4]   2> 	ramBufferSizeMB=100.0
   [junit4]   2> 	maxBufferedDocs=-1
   [junit4]   2> 	maxBufferedDeleteTerms=-1
   [junit4]   2> 	mergedSegmentWarmer=null
   [junit4]   2> 	delPolicy=org.apache.solr.core.IndexDeletionPolicyWrapper
   [junit4]   2> 	commit=null
   [junit4]   2> 	openMode=CREATE
   [junit4]   2> 	similarity=org.apache.lucene.search.similarities.DefaultSimilarity
   [junit4]   2> 	mergeScheduler=ConcurrentMergeScheduler: maxThreadCount=1, maxMergeCount=2, mergeThreadPriority=-1
   [junit4]   2> 	default WRITE_LOCK_TIMEOUT=1000
   [junit4]   2> 	writeLockTimeout=1000
   [junit4]   2> 	codec=Lucene49
   [junit4]   2> 	infoStream=org.apache.solr.update.LoggingInfoStream
   [junit4]   2> 	mergePolicy=[TieredMergePolicy: maxMergeAtOnce=10, maxMergeAtOnceExplicit=30, maxMergedSegmentMB=5120.0, floorSegmentMB=2.0, forceMergeDeletesPctAllowed=10.0, segmentsPerTier=10.0, maxCFSSegmentSizeMB=8.796093022207999E12, noCFSRatio=0.0
   [junit4]   2> 	indexerThreadPool=org.apache.lucene.index.DocumentsWriterPerThreadPool@39facda
   [junit4]   2> 	readerPooling=false
   [junit4]   2> 	perThreadHardLimitMB=1945
   [junit4]   2> 	useCompoundFile=false
   [junit4]   2> 	checkIntegrityAtMerge=false
   [junit4]   2> 	writer=org.apache.lucene.util.SetOnce@680d1e11
   [junit4]   2> 	
   [junit4]   2> 16851 T28 oasu.LoggingInfoStream.message [IW][coreLoadExecutor-5-thread-1]: now flush at shutdown
   [junit4]   2> 16852 T28 oasu.LoggingInfoStream.message [IW][coreLoadExecutor-5-thread-1]:   start flush: applyAllDeletes=true
   [junit4]   2> 16852 T28 oasu.LoggingInfoStream.message [IW][coreLoadExecutor-5-thread-1]:   index before flush 
   [junit4]   2> 16852 T28 oasu.LoggingInfoStream.message [DW][coreLoadExecutor-5-thread-1]: startFullFlush
   [junit4]   2> 16853 T28 oasu.LoggingInfoStream.message [DW][coreLoadExecutor-5-thread-1]: anyChanges? numDocsInRam=0 deletes=false hasTickets:false pendingChangesInFullFlush: false
   [junit4]   2> 16853 T28 oasu.LoggingInfoStream.message [DW][coreLoadExecutor-5-thread-1]: coreLoadExecutor-5-thread-1 finishFullFlush success=true
   [junit4]   2> 16854 T28 oasu.LoggingInfoStream.message [IW][coreLoadExecutor-5-thread-1]: apply all deletes during flush
   [junit4]   2> 16859 T28 oasu.LoggingInfoStream.message [BD][coreLoadExecutor-5-thread-1]: prune sis=null:  minGen=9223372036854775807 packetCount=0
   [junit4]   2> 16860 T28 oasu.LoggingInfoStream.message [IW][coreLoadExecutor-5-thread-1]: waitForMerges
   [junit4]   2> 16860 T28 oasu.LoggingInfoStream.message [IW][coreLoadExecutor-5-thread-1]: waitForMerges done
   [junit4]   2> 16861 T28 oasu.LoggingInfoStream.message [IW][coreLoadExecutor-5-thread-1]: commit: start
   [junit4]   2> 16861 T28 oasu.LoggingInfoStream.message [IW][coreLoadExecutor-5-thread-1]: commit: enter lock
   [junit4]   2> 16861 T28 oasu.LoggingInfoStream.message [IW][coreLoadExecutor-5-thread-1]: commit: now prepare
   [junit4]   2> 16862 T28 oasu.LoggingInfoStream.message [IW][coreLoadExecutor-5-thread-1]: prepareCommit: flush
   [junit4]   2> 16862 T28 oasu.LoggingInfoStream.message [IW][coreLoadExecutor-5-thread-1]:   index before flush 
   [junit4]   2> 16862 T28 oasu.LoggingInfoStream.message [DW][coreLoadExecutor-5-thread-1]: startFullFlush
   [junit4]   2> 16863 T28 oasu.LoggingInfoStream.message [DW][coreLoadExecutor-5-thread-1]: anyChanges? numDocsInRam=0 deletes=false hasTickets:false pendingChangesInFullFlush: false
   [junit4]   2> 16863 T28 oasu.LoggingInfoStream.message [IW][coreLoadExecutor-5-thread-1]: apply all deletes during flush
   [junit4]   2> 16864 T28 oasu.LoggingInfoStream.message [BD][coreLoadExecutor-5-thread-1]: prune sis=null:  minGen=9223372036854775807 packetCount=0
   [junit4]   2> 16864 T28 oasu.LoggingInfoStream.message [DW][coreLoadExecutor-5-thread-1]: coreLoadExecutor-5-thread-1 finishFullFlush success=true
   [junit4]   2> 16865 T28 oasu.LoggingInfoStream.message [IW][coreLoadExecutor-5-thread-1]: startCommit(): start
   [junit4]   2> 16865 T28 oasu.LoggingInfoStream.message [IW][coreLoadExecutor-5-thread-1]: startCommit index= changeCount=1
   [junit4]   2> 16884 T28 oasu.LoggingInfoStream.message [IW][coreLoadExecutor-5-thread-1]: done all syncs: []
   [junit4]   2> 16885 T28 oasu.LoggingInfoStream.message [IW][coreLoadExecutor-5-thread-1]: commit: pendingCommit != null
   [junit4]   2> 16885 T28 oasu.LoggingInfoStream.message [IW][coreLoadExecutor-5-thread-1]: commit: wrote segments file "segments_1"
   [junit4]   2> 16886 T28 oasu.LoggingInfoStream.message [IFD][coreLoadExecutor-5-thread-1]: now checkpoint "" [0 segments ; isCommit = true]
   [junit4]   2> 16905 T28 oasc.SolrDeletionPolicy.onCommit SolrDeletionPolicy.onCommit: commits: num=1
   [junit4]   2> 		commit{dir=MockDirectoryWrapper(RAMDirectory@10b9d0fd lockFactory=NativeFSLockFactory@/usr/home/hudson/hudson-slave/workspace/Lucene-Solr-Tests-trunk-Java7/solr/build/solr-solrj/test/J0/temp/solr.client.solrj.embedded.SolrExampleStreamingBinaryTest-58B9693DB651AE2E-001/tempDir-001/index),segFN=segments_1,generation=1}
   [junit4]   2> 16908 T28 oasc.SolrDeletionPolicy.updateCommits newest commit generation = 1
   [junit4]   2> 16909 T28 oasu.LoggingInfoStream.message [IFD][coreLoadExecutor-5-thread-1]: 22 msec to checkpoint
   [junit4]   2> 16910 T28 oasu.LoggingInfoStream.message [IW][coreLoadExecutor-5-thread-1]: commit: took 47.5 msec
   [junit4]   2> 16911 T28 oasu.LoggingInfoStream.message [IW][coreLoadExecutor-5-thread-1]: commit: done
   [junit4]   2> 16911 T28 oasu.LoggingInfoStream.message [IW][coreLoadExecutor-5-thread-1]: rollback
   [junit4]   2> 16911 T28 oasu.LoggingInfoStream.message [IW][coreLoadExecutor-5-thread-1]: all running merges have aborted
   [junit4]   2> 16912 T28 oasu.LoggingInfoStream.message [IW][coreLoadExecutor-5-thread-1]: rollback: done finish merges
   [junit4]   2> 16912 T28 oasu.LoggingInfoStream.message [DW][coreLoadExecutor-5-thread-1]: abort
   [junit4]   2> 16917 T28 oasu.LoggingInfoStream.message [DW][coreLoadExecutor-5-thread-1]: done abort; abortedFiles=[] success=true
   [junit4]   2> 16917 T28 oasu.LoggingInfoStream.message [IW][coreLoadExecutor-5-thread-1]: rollback: infos=
   [junit4]   2> 16918 T28 oasu.LoggingInfoStream.message [IFD][coreLoadExecutor-5-thread-1]: now checkpoint "" [0 segments ; isCommit = false]
   [junit4]   2> 16918 T28 oasu.LoggingInfoStream.message [IFD][coreLoadExecutor-5-thread-1]: 0 msec to checkpoint
   [junit4]   2> 16955 T28 oasc.SolrCore.initWriters created json: solr.JSONResponseWriter
   [junit4]   2> 16955 T28 oasc.SolrCore.initWriters adding lazy queryResponseWriter: solr.VelocityResponseWriter
   [junit4]   2> 16961 T28 oasc.SolrCore.initWriters created velocity: solr.VelocityResponseWriter
   [junit4]   2> 17007 T28 oasc.SolrCore.initWriters created xslt: solr.XSLTResponseWriter
   [junit4]   2> 17008 T28 oasr.XSLTResponseWriter.init xsltCacheLifetimeSeconds=5
   [junit4]   2> 19144 T28 oasc.SolrCore.loadUpdateProcessorChains no updateRequestProcessorChain defined as default, creating implicit default
   [junit4]   2> 19327 T28 oasc.RequestHandlers.initHandlersFromConfig created /select: solr.SearchHandler
   [junit4]   2> 19328 T28 oasc.RequestHandlers.initHandlersFromConfig created /query: solr.SearchHandler
   [junit4]   2> 19359 T28 oasc.RequestHandlers.initHandlersFromConfig created /get: solr.RealTimeGetHandler
   [junit4]   2> 19360 T28 oasc.RequestHandlers.initHandlersFromConfig created /browse: solr.SearchHandler
   [junit4]   2> 19411 T28 oasc.RequestHandlers.initHandlersFromConfig created /update: solr.UpdateRequestHandler
   [junit4]   2> 19412 T28 oasc.RequestHandlers.initHandlersFromConfig created /update/json: solr.UpdateRequestHandler
   [junit4]   2> 19412 T28 oasc.RequestHandlers.initHandlersFromConfig created /update/csv: solr.UpdateRequestHandler
   [junit4]   2> 19412 T28 oasc.RequestHandlers.initHandlersFromConfig adding lazy requestHandler: solr.extraction.ExtractingRequestHandler
   [junit4]   2> 19418 T28 oasc.RequestHandlers.initHandlersFromConfig created /update/extract: solr.extraction.ExtractingRequestHandler
   [junit4]   2> 19419 T28 oasc.RequestHandlers.initHandlersFromConfig adding lazy requestHandler: solr.FieldAnalysisRequestHandler
   [junit4]   2> 19419 T28 oasc.RequestHandlers.initHandlersFromConfig created /analysis/field: solr.FieldAnalysisRequestHandler
   [junit4]   2> 19420 T28 oasc.RequestHandlers.initHandlersFromConfig adding lazy requestHandler: solr.DocumentAnalysisRequestHandler
   [junit4]   2> 19420 T28 oasc.RequestHandlers.initHandlersFromConfig created /analysis/document: solr.DocumentAnalysisRequestHandler
   [junit4]   2> 19459 T28 oasc.RequestHandlers.initHandlersFromConfig created /admin/: solr.admin.AdminHandlers
   [junit4]   2> 19493 T28 oasc.RequestHandlers.initHandlersFromConfig created /admin/ping: solr.PingRequestHandler
   [junit4]   2> 19527 T28 oasc.RequestHandlers.initHandlersFromConfig created /debug/dump: solr.DumpRequestHandler
   [junit4]   2> 19587 T28 oasc.RequestHandlers.initHandlersFromConfig created /replication: solr.ReplicationHandler
   [junit4]   2> 19587 T28 oasc.RequestHandlers.initHandlersFromConfig adding lazy requestHandler: solr.SearchHandler
   [junit4]   2> 19587 T28 oasc.RequestHandlers.initHandlersFromConfig created /spell: solr.SearchHandler
   [junit4]   2> 19588 T28 oasc.RequestHandlers.initHandlersFromConfig adding lazy requestHandler: solr.SearchHandler
   [junit4]   2> 19588 T28 oasc.RequestHandlers.initHandlersFromConfig created /suggest: solr.SearchHandler
   [junit4]   2> 19589 T28 oasc.RequestHandlers.initHandlersFromConfig adding lazy requestHandler: solr.SearchHandler
   [junit4]   2> 19589 T28 oasc.RequestHandlers.initHandlersFromConfig created /tvrh: solr.SearchHandler
   [junit4]   2> 19589 T28 oasc.RequestHandlers.initHandlersFromConfig adding lazy requestHandler: solr.SearchHandler
   [junit4]   2> 19590 T28 oasc.RequestHandlers.initHandlersFromConfig created /terms: solr.SearchHandler
   [junit4]   2> 19590 T28 oasc.RequestHandlers.initHandlersFromConfig adding lazy requestHandler: solr.SearchHandler
   [junit4]   2> 19591 T28 oasc.RequestHandlers.initHandlersFromConfig created /elevate: solr.SearchHandler
   [junit4]   2> 19640 T28 oashl.XMLLoader.init xsltCacheLifetimeSeconds=60
   [junit4]   2> 19663 T28 oashl.XMLLoader.init xsltCacheLifetimeSeconds=60
   [junit4]   2> 19665 T28 oashl.XMLLoader.init xsltCacheLifetimeSeconds=60
   [junit4]   2> 19775 T28 oasu.CommitTracker.<init> Hard AutoCommit: if uncommited for 15000ms; 
   [junit4]   2> 19776 T28 oasu.CommitTracker.<init> Soft AutoCommit: disabled
   [junit4]   2> 19833 T28 oasu.LoggingInfoStream.message [IFD][coreLoadExecutor-5-thread-1]: init: current segments file is "segments_1"; deletionPolicy=org.apache.solr.core.IndexDeletionPolicyWrapper@309fb7a9
   [junit4]   2> 19833 T28 oasu.LoggingInfoStream.message [IFD][coreLoadExecutor-5-thread-1]: init: load commit "segments_1"
   [junit4]   2> 19834 T28 oasc.SolrDeletionPolicy.onInit SolrDeletionPolicy.onInit: commits: num=1
   [junit4]   2> 		commit{dir=MockDirectoryWrapper(RAMDirectory@10b9d0fd lockFactory=NativeFSLockFactory@/usr/home/hudson/hudson-slave/workspace/Lucene-Solr-Tests-trunk-Java7/solr/build/solr-solrj/test/J0/temp/solr.client.solrj.embedded.SolrExampleStreamingBinaryTest-58B9693DB651AE2E-001/tempDir-001/index),segFN=segments_1,generation=1}
   [junit4]   2> 19835 T28 oasc.SolrDeletionPolicy.updateCommits newest commit generation = 1
   [junit4]   2> 19835 T28 oasu.LoggingInfoStream.message [IFD][coreLoadExecutor-5-thread-1]: now checkpoint "" [0 segments ; isCommit = false]
   [junit4]   2> 19835 T28 oasu.LoggingInfoStream.message [IFD][coreLoadExecutor-5-thread-1]: 0 msec to checkpoint
   [junit4]   2> 19836 T28 oasu.LoggingInfoStream.message [IW][coreLoadExecutor-5-thread-1]: init: create=false
   [junit4]   2> 19836 T28 oasu.LoggingInfoStream.message [IW][coreLoadExecutor-5-thread-1]: 
   [junit4]   2> 	dir=MockDirectoryWrapper(RAMDirectory@10b9d0fd lockFactory=NativeFSLockFactory@/usr/home/hudson/hudson-slave/workspace/Lucene-Solr-Tests-trunk-Java7/solr/build/solr-solrj/test/J0/temp/solr.client.solrj.embedded.SolrExampleStreamingBinaryTest-58B9693DB651AE2E-001/tempDir-001/index)
   [junit4]   2> 	index=
   [junit4]   2> 	version=5.0-SNAPSHOT
   [junit4]   2> 	matchVersion=LUCENE_5_0
   [junit4]   2> 	analyzer=null
   [junit4]   2> 	ramBufferSizeMB=100.0
   [junit4]   2> 	maxBufferedDocs=-1
   [junit4]   2> 	maxBufferedDeleteTerms=-1
   [junit4]   2> 	mergedSegmentWarmer=null
   [junit4]   2> 	delPolicy=org.apache.solr.core.IndexDeletionPolicyWrapper
   [junit4]   2> 	commit=null
   [junit4]   2> 	openMode=APPEND
   [junit4]   2> 	similarity=org.apache.lucene.search.similarities.DefaultSimilarity
   [junit4]   2> 	mergeScheduler=ConcurrentMergeScheduler: maxThreadCount=1, maxMergeCount=2, mergeThreadPriority=-1
   [junit4]   2> 	default WRITE_LOCK_TIMEOUT=1000
   [junit4]   2> 	writeLockTimeout=1000
   [junit4]   2> 	codec=Lucene49
   [junit4]   2> 	infoStream=org.apache.solr.update.LoggingInfoStream
   [junit4]   2> 	mergePolicy=[TieredMergePolicy: maxMergeAtOnce=10, maxMergeAtOnceExplicit=30, maxMergedSegmentMB=5120.0, floorSegmentMB=2.0, forceMergeDeletesPctAllowed=10.0, segmentsPerTier=10.0, maxCFSSegmentSizeMB=8.796093022207999E12, noCFSRatio=0.0
   [junit4]   2> 	indexerThreadPool=org.apache.lucene.index.DocumentsWriterPerThreadPool@6521c24e
   [junit4]   2> 	readerPooling=false
   [junit4]   2> 	perThreadHardLimitMB=1945
   [junit4]   2> 	useCompoundFile=false
   [junit4]   2> 	checkIntegrityAtMerge=false
   [junit4]   2> 	writer=org.apache.lucene.util.SetOnce@b5bc2c1
   [junit4]   2> 	
   [junit4]   2> 19851 T28 oasu.LoggingInfoStream.message [IW][coreLoadExecutor-5-thread-1]: flush at getReader
   [junit4]   2> 19852 T28 oasu.LoggingInfoStream.message [DW][coreLoadExecutor-5-thread-1]: startFullFlush
   [junit4]   2> 19852 T28 oasu.LoggingInfoStream.message [DW][coreLoadExecutor-5-thread-1]: anyChanges? numDocsInRam=0 deletes=false hasTickets:false pendingChangesInFullFlush: false
   [junit4]   2> 19853 T28 oasu.LoggingInfoStream.message [IW][coreLoadExecutor-5-thread-1]: apply all deletes during flush
   [junit4]   2> 19853 T28 oasu.LoggingInfoStream.message [BD][coreLoadExecutor-5-thread-1]: prune sis=segments_1:  minGen=9223372036854775807 packetCount=0
   [junit4]   2> 19864 T28 oasu.LoggingInfoStream.message [IW][coreLoadExecutor-5-thread-1]: return reader version=1 reader=StandardDirectoryReader(segments_1:1:nrt)
   [junit4]   2> 19864 T28 oasu.LoggingInfoStream.message [DW][coreLoadExecutor-5-thread-1]: coreLoadExecutor-5-thread-1 finishFullFlush success=true
   [junit4]   2> 19865 T28 oasu.LoggingInfoStream.message [IW][coreLoadExecutor-5-thread-1]: getReader took 14 msec
   [junit4]   2> 19952 T28 oass.SolrIndexSearcher.<init> Opening Searcher@3cab7269[collection1] main
   [junit4]   2> 20019 T28 oasr.ManagedResourceStorage.newStorageIO WARN Cannot write to config directory /usr/home/hudson/hudson-slave/workspace/Lucene-Solr-Tests-trunk-Java7/solr/example/solr/collection1/conf; switching to use InMemory storage instead.
   [junit4]   2> 20032 T28 oasr.RestManager.init Initializing RestManager with initArgs: {}
   [junit4]   2> 20045 T28 oasr.ManagedResourceStorage.load Reading _rest_managed.json using InMemoryStorage
   [junit4]   2> 20045 T28 oasr.ManagedResource.reloadFromStorage WARN No stored data found for /rest/managed
   [junit4]   2> 20061 T28 oasr.ManagedResourceStorage$JsonStorage.store Saved JSON object to path _rest_managed.json using InMemoryStorage
   [junit4]   2> 20062 T28 oasr.RestManager.init Initializing 2 registered ManagedResources
   [junit4]   2> 20062 T28 oasr.ManagedResourceStorage.load Reading _schema_analysis_stopwords_english.json using InMemoryStorage
   [junit4]   2> 20063 T28 oasr.ManagedResource.reloadFromStorage WARN No stored data found for /schema/analysis/stopwords/english
   [junit4]   2> 20070 T28 oasr.ManagedResourceStorage$JsonStorage.store Saved JSON object to path _schema_analysis_stopwords_english.json using InMemoryStorage
   [junit4]   2> 20070 T28 oasrsa.ManagedWordSetResource.onManagedDataLoadedFromStorage Loaded 0 words for /schema/analysis/stopwords/english
   [junit4]   2> 20071 T28 oasr.ManagedResource.notifyObserversDuringInit Notified 1 observers of /schema/analysis/stopwords/english
   [junit4]   2> 20072 T28 oasr.ManagedResourceStorage.load Reading _schema_analysis_synonyms_english.json using InMemoryStorage
   [junit4]   2> 20072 T28 oasr.ManagedResource.reloadFromStorage WARN No stored data found for /schema/analysis/synonyms/english
   [junit4]   2> 20072 T28 oasrsa.ManagedSynonymFilterFactory$SynonymManager.onManagedDataLoadedFromStorage Loaded 0 synonym mappings for /schema/analysis/synonyms/english
   [junit4]   2> 20078 T28 oasr.ManagedResource.notifyObserversDuringInit Notified 1 observers of /schema/analysis/synonyms/english
   [junit4]   2> 20079 T28 oashc.SpellCheckComponent.inform Initializing spell checkers
   [junit4]   2> 20174 T28 oass.DirectSolrSpellChecker.init init: {name=default,field=text,classname=solr.DirectSolrSpellChecker,distanceMeasure=internal,accuracy=0.5,maxEdits=2,minPrefix=1,maxInspections=5,minQueryLength=4,maxQueryFrequency=0.01}
   [junit4]   2> 20261 T28 oashc.SpellCheckComponent.inform No queryConverter defined, using default converter
   [junit4]   2> 20269 T28 oashc.SuggestComponent.inform Initializing SuggestComponent
   [junit4]   2> 20290 T28 oasss.SolrSuggester.init init: {name=mySuggester,lookupImpl=FuzzyLookupFactory,dictionaryImpl=DocumentDictionaryFactory,field=cat,weightField=price,suggestAnalyzerFieldType=string}
   [junit4]   2> 20652 T28 oasss.SolrSuggester.init Dictionary loaded with params: {name=mySuggester,lookupImpl=FuzzyLookupFactory,dictionaryImpl=DocumentDictionaryFactory,field=cat,weightField=price,suggestAnalyzerFieldType=string}
   [junit4]   2> 20685 T28 oashc.QueryElevationComponent.inform Loading QueryElevation from: /usr/home/hudson/hudson-slave/workspace/Lucene-Solr-Tests-trunk-Java7/solr/example/solr/collection1/conf/elevate.xml
   [junit4]   2> 21100 T28 oash.ReplicationHandler.inform Commits will be reserved for  10000
   [junit4]   2> 21108 T29 oasc.QuerySenderListener.newSearcher QuerySenderListener sending requests to Searcher@3cab7269[collection1] main{UninvertingDirectoryReader()}
   [junit4]   2> 21109 T28 oasc.CoreContainer.registerCore registering core: collection1
   [junit4]   2> 21124 T16 oass.SolrDispatchFilter.init user.dir=/usr/home/hudson/hudson-slave/workspace/Lucene-Solr-Tests-trunk-Java7/solr/build/solr-solrj/test/J0
   [junit4]   2> 21125 T16 oass.SolrDispatchFilter.init SolrDispatchFilter.init() done
   [junit4]   2> 21125 T16 oas.SolrJettyTestBase.createJetty Jetty Assigned Port#34656
   [junit4]   2> 21142 T16 oas.SolrTestCaseJ4.setUp ###Starting testStreamingRequest
   [junit4]   2> ASYNC  NEW_CORE C0 name=collection1 org.apache.solr.core.SolrCore@a37f72b
   [junit4]   2> 21708 T29 C0 oasc.SolrCore.execute [collection1] webapp=null path=null params={distrib=false&event=firstSearcher&q=static+firstSearcher+warming+in+solrconfig.xml} hits=0 status=0 QTime=580 
   [junit4]   2> 21720 T29 oasc.QuerySenderListener.newSearcher QuerySenderListener done.
   [junit4]   2> 21721 T29 oashc.SpellCheckComponent$SpellCheckerListener.newSearcher Loading spell index for spellchecker: default
   [junit4]   2> 21721 T29 oashc.SpellCheckComponent$SpellCheckerListener.newSearcher Loading spell index for spellchecker: wordbreak
   [junit4]   2> 21722 T29 oashc.SuggestComponent$SuggesterListener.newSearcher Loading suggester index for: mySuggester
   [junit4]   2> 21722 T29 oasss.SolrSuggester.reload reload()
   [junit4]   2> 21723 T29 oasss.SolrSuggester.build build()
   [junit4]   2> 21889 T29 oasc.SolrCore.registerSearcher [collection1] Registered new searcher Searcher@3cab7269[collection1] main{UninvertingDirectoryReader()}
   [junit4]   2> 22739 T21 C0 oasu.LoggingInfoStream.message [DW][qtp452672217-21]: anyChanges? numDocsInRam=0 deletes=true hasTickets:false pendingChangesInFullFlush: false
   [junit4]   2> 22742 T21 C0 oasu.LoggingInfoStream.message [IW][qtp452672217-21]: nrtIsCurrent: infoVersion matches: true; DW changes: true; BD changes: false
   [junit4]   2> 22743 T21 C0 oasu.LoggingInfoStream.message [DW][qtp452672217-21]: anyChanges? numDocsInRam=0 deletes=true hasTickets:false pendingChangesInFullFlush: false
   [junit4]   2> 22745 T21 C0 oasu.LoggingInfoStream.message [IW][qtp452672217-21]: flush at getReader
   [junit4]   2> 22746 T21 C0 oasu.LoggingInfoStream.message [DW][qtp452672217-21]: startFullFlush
   [junit4]   2> 22748 T21 C0 oasu.LoggingInfoStream.message [DW][qtp452672217-21]: anyChanges? numDocsInRam=0 deletes=true hasTickets:false pendingChangesInFullFlush: false
   [junit4]   2> 22749 T21 C0 oasu.LoggingInfoStream.message [DW][qtp452672217-21]: qtp452672217-21: flush naked frozen global deletes
   [junit4]   2> ASYNC  NEW_CORE C1 name=collection1 org.apache.solr.core.SolrCore@a37f72b
   [junit4]   2> 22812 T21 C1 oasu.LoggingInfoStream.message [BD][qtp452672217-21]: push deletes  1 deleted queries bytesUsed=64 delGen=2 packetCount=1 totBytesUsed=64
   [junit4]   2> 22813 T21 C1 oasu.LoggingInfoStream.message [DW][qtp452672217-21]: flush: push buffered updates:  1 deleted queries bytesUsed=64
   [junit4]   2> 22814 T21 C1 oasu.LoggingInfoStream.message [IW][qtp452672217-21]: apply all deletes during flush
   [junit4]   2> 22815 T21 C1 oasu.LoggingInfoStream.message [BD][qtp452672217-21]: prune sis=segments_1:  minGen=9223372036854775807 packetCount=1
   [junit4]   2> 22815 T21 C1 oasu.LoggingInfoStream.message [BD][qtp452672217-21]: pruneDeletes: prune 1 packets; 0 packets remain
   [junit4]   2> 22816 T21 C1 oasu.LoggingInfoStream.message [IW][qtp452672217-21]: return reader version=1 reader=StandardDirectoryReader(segments_1:1:nrt)
   [junit4]   2> 22817 T21 C1 oasu.LoggingInfoStream.message [DW][qtp452672217-21]: qtp452672217-21 finishFullFlush success=true
   [junit4]   2> 22818 T21 C1 oasu.LoggingInfoStream.message [IW][qtp452672217-21]: getReader took 73 msec
   [junit4]   2> 22832 T21 C1 oasup.LogUpdateProcessor.finish [collection1] webapp=/solr path=/update params={version=2&wt=javabin} {deleteByQuery=*:* (-1474722220068569088)} 0 238
   [junit4]   2> 22994 T21 C1 oasu.DirectUpdateHandler2.commit start commit{,optimize=false,openSearcher=true,waitSearcher=true,expungeDeletes=false,softCommit=false,prepareCommit=false}
   [junit4]   2> 22995 T21 C1 oasu.LoggingInfoStream.message [DW][qtp452672217-21]: anyChanges? numDocsInRam=0 deletes=false hasTickets:false pendingChangesInFullFlush: false
   [junit4]   2> 22996 T21 C1 oasu.DirectUpdateHandler2.commit No uncommitted changes. Skipping IW.commit.
   [junit4]   2> 22997 T21 C1 oasu.LoggingInfoStream.message [DW][qtp452672217-21]: anyChanges? numDocsInRam=0 deletes=false hasTickets:false pendingChangesInFullFlush: false
   [junit4]   2> 22998 T21 C1 oasu.LoggingInfoStream.message [IW][qtp452672217-21]: nrtIsCurrent: infoVersion matches: true; DW changes: false; BD changes: false
   [junit4]   2> 22999 T21 C1 oasu.LoggingInfoStream.message [DW][qtp452672217-21]: anyChanges? numDocsInRam=0 deletes=false hasTickets:false pendingChangesInFullFlush: false
   [junit4]   2> 22999 T21 C1 oasc.SolrCore.openNewSearcher SolrIndexSearcher has not changed - not re-opening: org.apache.solr.search.SolrIndexSearcher
   [junit4]   2> 23000 T21 C1 oasu.DirectUpdateHandler2.commit end_commit_flush
   [junit4]   2> 23001 T21 C1 oasup.LogUpdateProcessor.finish [collection1] webapp=/solr path=/update params={softCommit=false&waitSearcher=true&version=2&commit=true&wt=javabin} {commit=} 0 7
   [junit4]   2> 23011 T21 C1 oasc.SolrCore.execute [collection1] webapp=/solr path=/select params={version=2&q=*:*&wt=javabin} hits=0 status=0 QTime=6 
   [junit4]   2> 23021 T16 oascsi.ConcurrentUpdateSolrServer.request blocking for commit/optimize
   [junit4]   2> 23358 T21 C1 oasu.DirectUpdateHandler2.commit start commit{,optimize=false,openSearcher=true,waitSearcher=true,expungeDeletes=false,softCommit=false,prepareCommit=false}
   [junit4]   2> 23359 T21 C1 oasu.LoggingInfoStream.message [IW][qtp452672217-21]: commit: start
   [junit4]   2> 23359 T21 C1 oasu.LoggingInfoStream.message [IW][qtp452672217-21]: commit: enter lock
   [junit4]   2> 23360 T21 C1 oasu.LoggingInfoStream.message [IW][qtp452672217-21]: commit: now prepare
   [junit4]   2> 23360 T21 C1 oasu.LoggingInfoStream.message [IW][qtp452672217-21]: prepareCommit: flush
   [junit4]   2> 23361 T21 C1 oasu.LoggingInfoStream.message [IW][qtp452672217-21]:   index before flush 
   [junit4]   2> 23361 T21 C1 oasu.LoggingInfoStream.message [DW][qtp452672217-21]: startFullFlush
   [junit4]   2> 23362 T21 C1 oasu.LoggingInfoStream.message [DW][qtp452672217-21]: anyChanges? numDocsInRam=10 deletes=true hasTickets:false pendingChangesInFullFlush: false
   [junit4]   2> 23362 T21 C1 oasu.LoggingInfoStream.message [DWFC][qtp452672217-21]: addFlushableState DocumentsWriterPerThread [pendingDeletes=gen=0 9 deleted terms (unique count=9) bytesUsed=1485, segment=_0, aborting=false, numDocsInRAM=10, deleteQueue=DWDQ: [ generation: 2 ]]
   [junit4]   2> 23373 T21 C1 oasu.LoggingInfoStream.message [DWPT][qtp452672217-21]: flush postings as segment _0 numDocs=10
   [junit4]   2> 23565 T21 C1 oasu.LoggingInfoStream.message [DWPT][qtp452672217-21]: new segment has 0 deleted docs
   [junit4]   2> 23566 T21 C1 oasu.LoggingInfoStream.message [DWPT][qtp452672217-21]: new segment has no vectors; norms; no docValues; prox; freqs
   [junit4]   2> 23567 T21 C1 oasu.LoggingInfoStream.message [DWPT][qtp452672217-21]: flushedFiles=[_0_Lucene41_0.tim, _0.nvd, _0_Lucene41_0.tip, _0_Lucene41_0.doc, _0.fnm, _0.fdt, _0.fdx, _0_Lucene41_0.pos, _0.nvm]
   [junit4]   2> 23567 T21 C1 oasu.LoggingInfoStream.message [DWPT][qtp452672217-21]: flushed codec=Lucene49
   [junit4]   2> 23569 T21 C1 oasu.LoggingInfoStream.message [DWPT][qtp452672217-21]: flushed: segment=_0 ramUsed=0.073 MB newFlushedSize(includes docstores)=0.001 MB docs/MB=7,138.026
   [junit4]   2> 23584 T21 C1 oasu.LoggingInfoStream.message [DW][qtp452672217-21]: publishFlushedSegment seg-private updates=null
   [junit4]   2> 23585 T21 C1 oasu.LoggingInfoStream.message [IW][qtp452672217-21]: publishFlushedSegment
   [junit4]   2> 23585 T21 C1 oasu.LoggingInfoStream.message [BD][qtp452672217-21]: push deletes  10 deleted terms (unique count=10) bytesUsed=1056 delGen=4 packetCount=1 totBytesUsed=1056
   [junit4]   2> 23586 T21 C1 oasu.LoggingInfoStream.message [IW][qtp452672217-21]: publish sets newSegment delGen=5 seg=_0(5.0):C10
   [junit4]   2> 23586 T21 C1 oasu.LoggingInfoStream.message [IFD][qtp452672217-21]: now checkpoint "_0(5.0):C10" [1 segments ; isCommit = false]
   [junit4]   2> 23587 T21 C1 oasu.LoggingInfoStream.message [IFD][qtp452672217-21]: 0 msec to checkpoint
   [junit4]   2> 23588 T21 C1 oasu.LoggingInfoStream.message [IW][qtp452672217-21]: apply all deletes during flush
   [junit4]   2> 23588 T21 C1 oasu.LoggingInfoStream.message [BD][qtp452672217-21]: applyDeletes: infos=[_0(5.0):C10] packetCount=1
   [junit4]   2> 23589 T21 C1 oasu.LoggingInfoStream.message [BD][qtp452672217-21]: applyDeletes took 1 msec
   [junit4]   2> 23589 T21 C1 oasu.LoggingInfoStream.message [BD][qtp452672217-21]: prune sis=segments_1: _0(5.0):C10 minGen=6 packetCount=1
   [junit4]   2> 23590 T21 C1 oasu.LoggingInfoStream.message [BD][qtp452672217-21]: pruneDeletes: prune 1 packets; 0 packets remain
   [junit4]   2> 23590 T21 C1 oasu.LoggingInfoStream.message [DW][qtp452672217-21]: qtp452672217-21 finishFullFlush success=true
   [junit4]   2> 23596 T21 C1 oasu.LoggingInfoStream.message [TMP][qtp452672217-21]: findMerges: 1 segments
   [junit4]   2> 23601 T21 C1 oasu.LoggingInfoStream.message [TMP][qtp452672217-21]:   seg=_0(5.0):C10 size=0.001 MB [floored]
   [junit4]   2> 23602 T21 C1 oasu.LoggingInfoStream.message [TMP][qtp452672217-21]:   allowedSegmentCount=1 vs count=1 (eligible count=1) tooBigCount=0
   [junit4]   2> 23602 T21 C1 oasu.LoggingInfoStream.message [CMS][qtp452672217-21]: now merge
   [junit4]   2> 23603 T21 C1 oasu.LoggingInfoStream.message [CMS][qtp452672217-21]:   index: _0(5.0):C10
   [junit4]   2> 23603 T21 C1 oasu.LoggingInfoStream.message [CMS][qtp452672217-21]:   no more merges pending; now return
   [junit4]   2> 23604 T21 C1 oasu.LoggingInfoStream.message [IW][qtp452672217-21]: startCommit(): start
   [junit4]   2> 23604 T21 C1 oasu.LoggingInfoStream.message [IW][qtp452672217-21]: startCommit index=_0(5.0):C10 changeCount=3
   [junit4]   2> 23605 T21 C1 oasu.LoggingInfoStream.message [IW][qtp452672217-21]: done all syncs: [_0.nvd, _0_Lucene41_0.tim, _0_Lucene41_0.doc, _0_Lucene41_0.tip, _0.si, _0.fdt, _0.fnm, _0.fdx, _0_Lucene41_0.pos, _0.nvm]
   [junit4]   2> 23606 T21 C1 oasu.LoggingInfoStream.message [IW][qtp452672217-21]: commit: pendingCommit != null
   [junit4]   2> 23607 T21 C1 oasu.LoggingInfoStream.message [IW][qtp452672217-21]: commit: wrote segments file "segments_2"
   [junit4]   2> 23607 T21 C1 oasu.LoggingInfoStream.message [IFD][qtp452672217-21]: now checkpoint "_0(5.0):C10" [1 segments ; isCommit = true]
   [junit4]   2> 23608 T21 C1 oasc.SolrDeletionPolicy.onCommit SolrDeletionPolicy.onCommit: commits: num=2
   [junit4]   2> 		commit{dir=MockDirectoryWrapper(RAMDirectory@10b9d0fd lockFactory=NativeFSLockFactory@/usr/home/hudson/hudson-slave/workspace/Lucene-Solr-Tests-trunk-Java7/solr/build/solr-solrj/test/J0/temp/solr.client.solrj.embedded.SolrExampleStreamingBinaryTest-58B9693DB651AE2E-001/tempDir-001/index),segFN=segments_1,generation=1}
   [junit4]   2> 		commit{dir=MockDirectoryWrapper(RAMDirectory@10b9d0fd lockFactory=NativeFSLockFactory@/usr/home/hudson/hudson-slave/workspace/Lucene-Solr-Tests-trunk-Java7/solr/build/solr-solrj/test/J0/temp/solr.client.solrj.embedded.SolrExampleStreamingBinaryTest-58B9693DB651AE2E-001/tempDir-001/index),segFN=segments_2,generation=2}
   [junit4]   2> 23608 T21 C1 oasc.SolrDeletionPolicy.updateCommits newest commit generation = 2
   [junit4]   2> 23609 T21 C1 oasu.LoggingInfoStream.message [IFD][qtp452672217-21]: deleteCommits: now decRef commit "segments_1"
   [junit4]   2> 23609 T21 C1 oasu.LoggingInfoStream.message [IFD][qtp452672217-21]: delete "segments_1"
   [junit4]   2> 23610 T21 C1 oasu.LoggingInfoStream.message [IFD][qtp452672217-21]: 2 msec to checkpoint
   [junit4]   2> 23611 T21 C1 oasu.LoggingInfoStream.message [IW][qtp452672217-21]: commit: took 250.3 msec
   [junit4]   2> 23611 T21 C1 oasu.LoggingInfoStream.message [IW][qtp452672217-21]: commit: done
   [junit4]   2> 23612 T21 C1 oasu.LoggingInfoStream.message [DW][qtp452672217-21]: anyChanges? numDocsInRam=0 deletes=false hasTickets:false pendingChangesInFullFlush: false
   [junit4]   2> 23612 T21 C1 oasu.LoggingInfoStream.message [IW][qtp452672217-21]: nrtIsCurrent: infoVersion matches: false; DW changes: false; BD ch

[...truncated too long message...]

3}
   [junit4]   2> 166353 T535 oasu.SolrCoreState.decrefSolrCoreState Closing SolrCoreState
   [junit4]   2> 166353 T535 oasu.DefaultSolrCoreState.closeIndexWriter SolrCoreState ref count has reached 0 - closing IndexWriter
   [junit4]   2> 166353 T535 oasu.DefaultSolrCoreState.closeIndexWriter closing IndexWriter with IndexWriterCloser
   [junit4]   2> 166358 T535 oasc.SolrCore.closeSearcher [core0] Closing main searcher on request.
   [junit4]   2> 166359 T535 oasc.CachingDirectoryFactory.close Closing StandardDirectoryFactory - 2 directories currently being tracked
   [junit4]   2> 166359 T535 oasc.CachingDirectoryFactory.closeCacheValue looking to close /usr/home/hudson/hudson-slave/workspace/Lucene-Solr-Tests-trunk-Java7/solr/build/solr-solrj/test/J0/temp/solr.client.solrj.embedded.MultiCoreEmbeddedTest-58B9693DB651AE2E-001/tempDir-001 [CachedDir<<refCount=0;path=/usr/home/hudson/hudson-slave/workspace/Lucene-Solr-Tests-trunk-Java7/solr/build/solr-solrj/test/J0/temp/solr.client.solrj.embedded.MultiCoreEmbeddedTest-58B9693DB651AE2E-001/tempDir-001;done=false>>]
   [junit4]   2> 166360 T535 oasc.CachingDirectoryFactory.close Closing directory: /usr/home/hudson/hudson-slave/workspace/Lucene-Solr-Tests-trunk-Java7/solr/build/solr-solrj/test/J0/temp/solr.client.solrj.embedded.MultiCoreEmbeddedTest-58B9693DB651AE2E-001/tempDir-001
   [junit4]   2> 166360 T535 oasc.CachingDirectoryFactory.closeCacheValue looking to close /usr/home/hudson/hudson-slave/workspace/Lucene-Solr-Tests-trunk-Java7/solr/build/solr-solrj/test/J0/temp/solr.client.solrj.embedded.MultiCoreEmbeddedTest-58B9693DB651AE2E-001/tempDir-001/index [CachedDir<<refCount=0;path=/usr/home/hudson/hudson-slave/workspace/Lucene-Solr-Tests-trunk-Java7/solr/build/solr-solrj/test/J0/temp/solr.client.solrj.embedded.MultiCoreEmbeddedTest-58B9693DB651AE2E-001/tempDir-001/index;done=false>>]
   [junit4]   2> 166360 T535 oasc.CachingDirectoryFactory.close Closing directory: /usr/home/hudson/hudson-slave/workspace/Lucene-Solr-Tests-trunk-Java7/solr/build/solr-solrj/test/J0/temp/solr.client.solrj.embedded.MultiCoreEmbeddedTest-58B9693DB651AE2E-001/tempDir-001/index
   [junit4]   2> 166361 T535 oasc.SolrCore.close [corefoo]  CLOSING SolrCore org.apache.solr.core.SolrCore@52f558bf
   [junit4]   2> 166362 T535 oasu.DirectUpdateHandler2.close closing DirectUpdateHandler2{commits=2,autocommits=0,soft autocommits=0,optimizes=0,rollbacks=0,expungeDeletes=0,docsPending=0,adds=0,deletesById=0,deletesByQuery=0,errors=1,cumulative_adds=2,cumulative_deletesById=0,cumulative_deletesByQuery=1,cumulative_errors=1,transaction_logs_total_size=198,transaction_logs_total_number=2}
   [junit4]   2> 166362 T535 oasu.SolrCoreState.decrefSolrCoreState Closing SolrCoreState
   [junit4]   2> 166362 T535 oasu.DefaultSolrCoreState.closeIndexWriter SolrCoreState ref count has reached 0 - closing IndexWriter
   [junit4]   2> 166363 T535 oasu.DefaultSolrCoreState.closeIndexWriter closing IndexWriter with IndexWriterCloser
   [junit4]   2> 166370 T535 oasc.SolrCore.closeSearcher [corefoo] Closing main searcher on request.
   [junit4]   2> 166371 T535 oasc.CachingDirectoryFactory.close Closing StandardDirectoryFactory - 2 directories currently being tracked
   [junit4]   2> 166371 T535 oasc.CachingDirectoryFactory.closeCacheValue looking to close /usr/home/hudson/hudson-slave/workspace/Lucene-Solr-Tests-trunk-Java7/solr/build/solr-solrj/test/J0/temp/solr.client.solrj.embedded.MultiCoreEmbeddedTest-58B9693DB651AE2E-001/tempDir-002/index [CachedDir<<refCount=0;path=/usr/home/hudson/hudson-slave/workspace/Lucene-Solr-Tests-trunk-Java7/solr/build/solr-solrj/test/J0/temp/solr.client.solrj.embedded.MultiCoreEmbeddedTest-58B9693DB651AE2E-001/tempDir-002/index;done=false>>]
   [junit4]   2> 166371 T535 oasc.CachingDirectoryFactory.close Closing directory: /usr/home/hudson/hudson-slave/workspace/Lucene-Solr-Tests-trunk-Java7/solr/build/solr-solrj/test/J0/temp/solr.client.solrj.embedded.MultiCoreEmbeddedTest-58B9693DB651AE2E-001/tempDir-002/index
   [junit4]   2> 166372 T535 oasc.CachingDirectoryFactory.closeCacheValue looking to close /usr/home/hudson/hudson-slave/workspace/Lucene-Solr-Tests-trunk-Java7/solr/build/solr-solrj/test/J0/temp/solr.client.solrj.embedded.MultiCoreEmbeddedTest-58B9693DB651AE2E-001/tempDir-002 [CachedDir<<refCount=0;path=/usr/home/hudson/hudson-slave/workspace/Lucene-Solr-Tests-trunk-Java7/solr/build/solr-solrj/test/J0/temp/solr.client.solrj.embedded.MultiCoreEmbeddedTest-58B9693DB651AE2E-001/tempDir-002;done=false>>]
   [junit4]   2> 166372 T535 oasc.CachingDirectoryFactory.close Closing directory: /usr/home/hudson/hudson-slave/workspace/Lucene-Solr-Tests-trunk-Java7/solr/build/solr-solrj/test/J0/temp/solr.client.solrj.embedded.MultiCoreEmbeddedTest-58B9693DB651AE2E-001/tempDir-002
   [junit4]   2> 166373 T535 oas.SolrTestCaseJ4.tearDown ###Ending testMultiCore
   [junit4]   2> 166373 T535 oasc.CoreContainer.shutdown Shutting down CoreContainer instance=792342813
   [junit4]   2> 166373 T535 oasc.CoreContainer.shutdown Shutting down CoreContainer instance=792342813
   [junit4]   2> 166374 T535 oasc.CoreContainer.shutdown Shutting down CoreContainer instance=792342813
   [junit4]   2> 166374 T535 oasc.CoreContainer.shutdown Shutting down CoreContainer instance=792342813
   [junit4]   2> 166374 T535 oasc.CoreContainer.shutdown Shutting down CoreContainer instance=792342813
   [junit4]   2> NOTE: reproduce with: ant test  -Dtestcase=MultiCoreEmbeddedTest -Dtests.method=testMultiCore -Dtests.seed=58B9693DB651AE2E -Dtests.multiplier=3 -Dtests.slow=true -Dtests.locale=de_AT -Dtests.timezone=AGT -Dtests.file.encoding=ISO-8859-1
   [junit4] ERROR   1.38s J0 | MultiCoreEmbeddedTest.testMultiCore <<<
   [junit4]    > Throwable #1: java.lang.NoClassDefFoundError: Could not initialize class java.lang.UNIXProcess
   [junit4]    > 	at __randomizedtesting.SeedInfo.seed([58B9693DB651AE2E:DC9172CE7982A31B]:0)
   [junit4]    > 	at java.lang.ProcessImpl.start(ProcessImpl.java:130)
   [junit4]    > 	at java.lang.ProcessBuilder.start(ProcessBuilder.java:1022)
   [junit4]    > 	at java.lang.Runtime.exec(Runtime.java:617)
   [junit4]    > 	at java.lang.Runtime.exec(Runtime.java:450)
   [junit4]    > 	at java.lang.Runtime.exec(Runtime.java:347)
   [junit4]    > 	at org.apache.solr.handler.admin.SystemInfoHandler.execute(SystemInfoHandler.java:220)
   [junit4]    > 	at org.apache.solr.handler.admin.SystemInfoHandler.getSystemInfo(SystemInfoHandler.java:176)
   [junit4]    > 	at org.apache.solr.handler.admin.SystemInfoHandler.handleRequestBody(SystemInfoHandler.java:97)
   [junit4]    > 	at org.apache.solr.handler.RequestHandlerBase.handleRequest(RequestHandlerBase.java:135)
   [junit4]    > 	at org.apache.solr.core.SolrCore.execute(SolrCore.java:1981)
   [junit4]    > 	at org.apache.solr.client.solrj.embedded.EmbeddedSolrServer.request(EmbeddedSolrServer.java:150)
   [junit4]    > 	at org.apache.solr.client.solrj.request.QueryRequest.process(QueryRequest.java:91)
   [junit4]    > 	at org.apache.solr.client.solrj.SolrServer.query(SolrServer.java:301)
   [junit4]    > 	at org.apache.solr.client.solrj.MultiCoreExampleTestBase.testMultiCore(MultiCoreExampleTestBase.java:239)
   [junit4]    > 	at java.lang.Thread.run(Thread.java:745)
   [junit4]   2> 166386 T535 oas.SolrTestCaseJ4.deleteCore ###deleteCore
   [junit4]   2> NOTE: leaving temporary files on disk at: /usr/home/hudson/hudson-slave/workspace/Lucene-Solr-Tests-trunk-Java7/solr/build/solr-solrj/test/J0/./temp/solr.client.solrj.embedded.MultiCoreEmbeddedTest-58B9693DB651AE2E-001
   [junit4]   2> NOTE: test params are: codec=Lucene45, sim=DefaultSimilarity, locale=de_AT, timezone=AGT
   [junit4]   2> NOTE: FreeBSD 9.1-RELEASE-p3 amd64/Oracle Corporation 1.7.0_60 (64-bit)/cpus=16,threads=1,free=118756568,total=183500800
   [junit4]   2> NOTE: All tests run in this JVM: [TestRetryUtil, TestDocumentObjectBinder, SolrExampleStreamingBinaryTest, SolrParamTest, TestCoreAdmin, SolrExceptionTest, TestJavaBinCodec, ClientUtilsTest, LargeVolumeJettyTest, DocumentAnalysisResponseTest, ContentStreamTest, SolrExampleEmbeddedTest, CloudSolrServerTest, SolrExampleXMLTest, BasicHttpSolrServerTest, LargeVolumeBinaryJettyTest, TestBatchUpdate, JettyWebappTest, LargeVolumeEmbeddedTest, TestSolrProperties, MultiCoreEmbeddedTest]
   [junit4] Completed on J0 in 1.42s, 1 test, 1 error <<< FAILURES!

[...truncated 60 lines...]
BUILD FAILED
/usr/home/hudson/hudson-slave/workspace/Lucene-Solr-Tests-trunk-Java7/build.xml:467: The following error occurred while executing this line:
/usr/home/hudson/hudson-slave/workspace/Lucene-Solr-Tests-trunk-Java7/build.xml:447: The following error occurred while executing this line:
/usr/home/hudson/hudson-slave/workspace/Lucene-Solr-Tests-trunk-Java7/build.xml:45: The following error occurred while executing this line:
/usr/home/hudson/hudson-slave/workspace/Lucene-Solr-Tests-trunk-Java7/extra-targets.xml:37: The following error occurred while executing this line:
/usr/home/hudson/hudson-slave/workspace/Lucene-Solr-Tests-trunk-Java7/solr/build.xml:202: The following error occurred while executing this line:
/usr/home/hudson/hudson-slave/workspace/Lucene-Solr-Tests-trunk-Java7/solr/common-build.xml:496: The following error occurred while executing this line:
/usr/home/hudson/hudson-slave/workspace/Lucene-Solr-Tests-trunk-Java7/lucene/common-build.xml:1298: The following error occurred while executing this line:
/usr/home/hudson/hudson-slave/workspace/Lucene-Solr-Tests-trunk-Java7/lucene/common-build.xml:922: There were test failures: 51 suites, 297 tests, 3 errors

Total time: 115 minutes 57 seconds
Build step 'Invoke Ant' marked build as failure
Archiving artifacts
Sending artifact delta relative to Lucene-Solr-Tests-trunk-Java7 #4781
Archived 3 artifacts
Archive block size is 32768
Received 0 blocks and 11071237 bytes
Compression is 0.0%
Took 3 sec
Recording test results
Email was triggered for: Failure
Sending email for trigger: Failure



Mime
View raw message