lucene-dev mailing list archives

Site index · List index
Message view « Date » · « Thread »
Top « Date » · « Thread »
From Apache Jenkins Server <jenk...@builds.apache.org>
Subject [JENKINS] Lucene-Solr-Tests-trunk-Java7 - Build # 4758 - Still Failing
Date Tue, 01 Jul 2014 16:57:06 GMT
Build: https://builds.apache.org/job/Lucene-Solr-Tests-trunk-Java7/4758/

425 tests failed.
REGRESSION:  org.apache.solr.CursorPagingTest.testRandomSortsOnLargeIndex

Error Message:
SolrCore 'collection1' is not available due to init failure: Internal Server Error

Stack Trace:
org.apache.solr.common.SolrException: SolrCore 'collection1' is not available due to init failure: Internal Server Error
	at org.apache.solr.core.CoreContainer.getCore(CoreContainer.java:675)
	at org.apache.solr.util.TestHarness.getCore(TestHarness.java:209)
	at org.apache.solr.CursorPagingTest.getAllSortFieldNames(CursorPagingTest.java:632)
	at org.apache.solr.CursorPagingTest.testRandomSortsOnLargeIndex(CursorPagingTest.java:561)
	at sun.reflect.NativeMethodAccessorImpl.invoke0(Native Method)
	at sun.reflect.NativeMethodAccessorImpl.invoke(NativeMethodAccessorImpl.java:57)
	at sun.reflect.DelegatingMethodAccessorImpl.invoke(DelegatingMethodAccessorImpl.java:43)
	at java.lang.reflect.Method.invoke(Method.java:606)
	at com.carrotsearch.randomizedtesting.RandomizedRunner.invoke(RandomizedRunner.java:1618)
	at com.carrotsearch.randomizedtesting.RandomizedRunner$6.evaluate(RandomizedRunner.java:827)
	at com.carrotsearch.randomizedtesting.RandomizedRunner$7.evaluate(RandomizedRunner.java:863)
	at com.carrotsearch.randomizedtesting.RandomizedRunner$8.evaluate(RandomizedRunner.java:877)
	at com.carrotsearch.randomizedtesting.rules.SystemPropertiesRestoreRule$1.evaluate(SystemPropertiesRestoreRule.java:53)
	at org.apache.lucene.util.TestRuleSetupTeardownChained$1.evaluate(TestRuleSetupTeardownChained.java:50)
	at org.apache.lucene.util.AbstractBeforeAfterRule$1.evaluate(AbstractBeforeAfterRule.java:46)
	at com.carrotsearch.randomizedtesting.rules.SystemPropertiesInvariantRule$1.evaluate(SystemPropertiesInvariantRule.java:55)
	at org.apache.lucene.util.TestRuleThreadAndTestName$1.evaluate(TestRuleThreadAndTestName.java:49)
	at org.apache.lucene.util.TestRuleIgnoreAfterMaxFailures$1.evaluate(TestRuleIgnoreAfterMaxFailures.java:65)
	at org.apache.lucene.util.TestRuleMarkFailure$1.evaluate(TestRuleMarkFailure.java:48)
	at com.carrotsearch.randomizedtesting.rules.StatementAdapter.evaluate(StatementAdapter.java:36)
	at com.carrotsearch.randomizedtesting.ThreadLeakControl$StatementRunner.run(ThreadLeakControl.java:365)
	at com.carrotsearch.randomizedtesting.ThreadLeakControl.forkTimeoutingTask(ThreadLeakControl.java:798)
	at com.carrotsearch.randomizedtesting.ThreadLeakControl$3.evaluate(ThreadLeakControl.java:458)
	at com.carrotsearch.randomizedtesting.RandomizedRunner.runSingleTest(RandomizedRunner.java:836)
	at com.carrotsearch.randomizedtesting.RandomizedRunner$3.evaluate(RandomizedRunner.java:738)
	at com.carrotsearch.randomizedtesting.RandomizedRunner$4.evaluate(RandomizedRunner.java:772)
	at com.carrotsearch.randomizedtesting.RandomizedRunner$5.evaluate(RandomizedRunner.java:783)
	at com.carrotsearch.randomizedtesting.rules.StatementAdapter.evaluate(StatementAdapter.java:36)
	at com.carrotsearch.randomizedtesting.rules.SystemPropertiesRestoreRule$1.evaluate(SystemPropertiesRestoreRule.java:53)
	at org.apache.lucene.util.AbstractBeforeAfterRule$1.evaluate(AbstractBeforeAfterRule.java:46)
	at org.apache.lucene.util.TestRuleStoreClassName$1.evaluate(TestRuleStoreClassName.java:42)
	at com.carrotsearch.randomizedtesting.rules.SystemPropertiesInvariantRule$1.evaluate(SystemPropertiesInvariantRule.java:55)
	at com.carrotsearch.randomizedtesting.rules.NoShadowingOrOverridesOnMethodsRule$1.evaluate(NoShadowingOrOverridesOnMethodsRule.java:39)
	at com.carrotsearch.randomizedtesting.rules.NoShadowingOrOverridesOnMethodsRule$1.evaluate(NoShadowingOrOverridesOnMethodsRule.java:39)
	at com.carrotsearch.randomizedtesting.rules.StatementAdapter.evaluate(StatementAdapter.java:36)
	at com.carrotsearch.randomizedtesting.rules.StatementAdapter.evaluate(StatementAdapter.java:36)
	at com.carrotsearch.randomizedtesting.rules.StatementAdapter.evaluate(StatementAdapter.java:36)
	at org.apache.lucene.util.TestRuleAssertionsRequired$1.evaluate(TestRuleAssertionsRequired.java:43)
	at org.apache.lucene.util.TestRuleMarkFailure$1.evaluate(TestRuleMarkFailure.java:48)
	at org.apache.lucene.util.TestRuleIgnoreAfterMaxFailures$1.evaluate(TestRuleIgnoreAfterMaxFailures.java:65)
	at org.apache.lucene.util.TestRuleIgnoreTestSuites$1.evaluate(TestRuleIgnoreTestSuites.java:55)
	at com.carrotsearch.randomizedtesting.rules.StatementAdapter.evaluate(StatementAdapter.java:36)
	at com.carrotsearch.randomizedtesting.ThreadLeakControl$StatementRunner.run(ThreadLeakControl.java:365)
	at java.lang.Thread.run(Thread.java:745)
Caused by: org.apache.solr.common.SolrException: Internal Server Error
	at org.apache.solr.core.SolrCore.<init>(SolrCore.java:885)
	at org.apache.solr.core.SolrCore.<init>(SolrCore.java:649)
	at org.apache.solr.core.CoreContainer.create(CoreContainer.java:478)
	at org.apache.solr.core.CoreContainer$1.call(CoreContainer.java:240)
	at org.apache.solr.core.CoreContainer$1.call(CoreContainer.java:237)
	at java.util.concurrent.FutureTask.run(FutureTask.java:262)
	at java.util.concurrent.ThreadPoolExecutor.runWorker(ThreadPoolExecutor.java:1145)
	at java.util.concurrent.ThreadPoolExecutor$Worker.run(ThreadPoolExecutor.java:615)
	... 1 more
Caused by: Internal Server Error (500) - Failed to store data for /rest/managed due to: java.security.AccessControlException: access denied ("java.io.FilePermission" "/usr/home/hudson/hudson-slave/workspace/Lucene-Solr-Tests-trunk-Java7/solr/core/src/test-files/solr/collection1/conf/_rest_managed.json" "write")
	at org.apache.solr.rest.ManagedResource.storeManagedData(ManagedResource.java:270)
	at org.apache.solr.rest.RestManager$RestManagerManagedResource.onManagedDataLoadedFromStorage(RestManager.java:458)
	at org.apache.solr.rest.ManagedResource.reloadFromStorage(ManagedResource.java:229)
	at org.apache.solr.rest.ManagedResource.loadManagedDataAndNotify(ManagedResource.java:87)
	at org.apache.solr.rest.RestManager.init(RestManager.java:593)
	at org.apache.solr.core.SolrCore.initRestManager(SolrCore.java:2369)
	at org.apache.solr.core.SolrCore.<init>(SolrCore.java:864)
	... 8 more
Caused by: java.security.AccessControlException: access denied ("java.io.FilePermission" "/usr/home/hudson/hudson-slave/workspace/Lucene-Solr-Tests-trunk-Java7/solr/core/src/test-files/solr/collection1/conf/_rest_managed.json" "write")
	at java.security.AccessControlContext.checkPermission(AccessControlContext.java:372)
	at java.security.AccessController.checkPermission(AccessController.java:559)
	at java.lang.SecurityManager.checkPermission(SecurityManager.java:549)
	at java.lang.SecurityManager.checkWrite(SecurityManager.java:979)
	at java.io.FileOutputStream.<init>(FileOutputStream.java:209)
	at java.io.FileOutputStream.<init>(FileOutputStream.java:110)
	at org.apache.solr.rest.ManagedResourceStorage$FileStorageIO.openOutputStream(ManagedResourceStorage.java:164)
	at org.apache.solr.rest.ManagedResourceStorage$JsonStorage.store(ManagedResourceStorage.java:407)
	at org.apache.solr.rest.ManagedResource.storeManagedData(ManagedResource.java:247)
	... 14 more


REGRESSION:  org.apache.solr.CursorPagingTest.testCacheImpacts

Error Message:
SolrCore 'collection1' is not available due to init failure: Internal Server Error

Stack Trace:
org.apache.solr.common.SolrException: SolrCore 'collection1' is not available due to init failure: Internal Server Error
	at org.apache.solr.core.CoreContainer.getCore(CoreContainer.java:675)
	at org.apache.solr.util.TestHarness.getCoreInc(TestHarness.java:219)
	at org.apache.solr.util.TestHarness.update(TestHarness.java:235)
	at org.apache.solr.util.BaseTestHarness.checkUpdateStatus(BaseTestHarness.java:282)
	at org.apache.solr.util.BaseTestHarness.validateUpdate(BaseTestHarness.java:252)
	at org.apache.solr.SolrTestCaseJ4.checkUpdateU(SolrTestCaseJ4.java:673)
	at org.apache.solr.SolrTestCaseJ4.assertU(SolrTestCaseJ4.java:652)
	at org.apache.solr.SolrTestCaseJ4.assertU(SolrTestCaseJ4.java:646)
	at org.apache.solr.CursorPagingTest.testCacheImpacts(CursorPagingTest.java:512)
	at sun.reflect.NativeMethodAccessorImpl.invoke0(Native Method)
	at sun.reflect.NativeMethodAccessorImpl.invoke(NativeMethodAccessorImpl.java:57)
	at sun.reflect.DelegatingMethodAccessorImpl.invoke(DelegatingMethodAccessorImpl.java:43)
	at java.lang.reflect.Method.invoke(Method.java:606)
	at com.carrotsearch.randomizedtesting.RandomizedRunner.invoke(RandomizedRunner.java:1618)
	at com.carrotsearch.randomizedtesting.RandomizedRunner$6.evaluate(RandomizedRunner.java:827)
	at com.carrotsearch.randomizedtesting.RandomizedRunner$7.evaluate(RandomizedRunner.java:863)
	at com.carrotsearch.randomizedtesting.RandomizedRunner$8.evaluate(RandomizedRunner.java:877)
	at com.carrotsearch.randomizedtesting.rules.SystemPropertiesRestoreRule$1.evaluate(SystemPropertiesRestoreRule.java:53)
	at org.apache.lucene.util.TestRuleSetupTeardownChained$1.evaluate(TestRuleSetupTeardownChained.java:50)
	at org.apache.lucene.util.AbstractBeforeAfterRule$1.evaluate(AbstractBeforeAfterRule.java:46)
	at com.carrotsearch.randomizedtesting.rules.SystemPropertiesInvariantRule$1.evaluate(SystemPropertiesInvariantRule.java:55)
	at org.apache.lucene.util.TestRuleThreadAndTestName$1.evaluate(TestRuleThreadAndTestName.java:49)
	at org.apache.lucene.util.TestRuleIgnoreAfterMaxFailures$1.evaluate(TestRuleIgnoreAfterMaxFailures.java:65)
	at org.apache.lucene.util.TestRuleMarkFailure$1.evaluate(TestRuleMarkFailure.java:48)
	at com.carrotsearch.randomizedtesting.rules.StatementAdapter.evaluate(StatementAdapter.java:36)
	at com.carrotsearch.randomizedtesting.ThreadLeakControl$StatementRunner.run(ThreadLeakControl.java:365)
	at com.carrotsearch.randomizedtesting.ThreadLeakControl.forkTimeoutingTask(ThreadLeakControl.java:798)
	at com.carrotsearch.randomizedtesting.ThreadLeakControl$3.evaluate(ThreadLeakControl.java:458)
	at com.carrotsearch.randomizedtesting.RandomizedRunner.runSingleTest(RandomizedRunner.java:836)
	at com.carrotsearch.randomizedtesting.RandomizedRunner$3.evaluate(RandomizedRunner.java:738)
	at com.carrotsearch.randomizedtesting.RandomizedRunner$4.evaluate(RandomizedRunner.java:772)
	at com.carrotsearch.randomizedtesting.RandomizedRunner$5.evaluate(RandomizedRunner.java:783)
	at com.carrotsearch.randomizedtesting.rules.StatementAdapter.evaluate(StatementAdapter.java:36)
	at com.carrotsearch.randomizedtesting.rules.SystemPropertiesRestoreRule$1.evaluate(SystemPropertiesRestoreRule.java:53)
	at org.apache.lucene.util.AbstractBeforeAfterRule$1.evaluate(AbstractBeforeAfterRule.java:46)
	at org.apache.lucene.util.TestRuleStoreClassName$1.evaluate(TestRuleStoreClassName.java:42)
	at com.carrotsearch.randomizedtesting.rules.SystemPropertiesInvariantRule$1.evaluate(SystemPropertiesInvariantRule.java:55)
	at com.carrotsearch.randomizedtesting.rules.NoShadowingOrOverridesOnMethodsRule$1.evaluate(NoShadowingOrOverridesOnMethodsRule.java:39)
	at com.carrotsearch.randomizedtesting.rules.NoShadowingOrOverridesOnMethodsRule$1.evaluate(NoShadowingOrOverridesOnMethodsRule.java:39)
	at com.carrotsearch.randomizedtesting.rules.StatementAdapter.evaluate(StatementAdapter.java:36)
	at com.carrotsearch.randomizedtesting.rules.StatementAdapter.evaluate(StatementAdapter.java:36)
	at com.carrotsearch.randomizedtesting.rules.StatementAdapter.evaluate(StatementAdapter.java:36)
	at org.apache.lucene.util.TestRuleAssertionsRequired$1.evaluate(TestRuleAssertionsRequired.java:43)
	at org.apache.lucene.util.TestRuleMarkFailure$1.evaluate(TestRuleMarkFailure.java:48)
	at org.apache.lucene.util.TestRuleIgnoreAfterMaxFailures$1.evaluate(TestRuleIgnoreAfterMaxFailures.java:65)
	at org.apache.lucene.util.TestRuleIgnoreTestSuites$1.evaluate(TestRuleIgnoreTestSuites.java:55)
	at com.carrotsearch.randomizedtesting.rules.StatementAdapter.evaluate(StatementAdapter.java:36)
	at com.carrotsearch.randomizedtesting.ThreadLeakControl$StatementRunner.run(ThreadLeakControl.java:365)
	at java.lang.Thread.run(Thread.java:745)
Caused by: org.apache.solr.common.SolrException: Internal Server Error
	at org.apache.solr.core.SolrCore.<init>(SolrCore.java:885)
	at org.apache.solr.core.SolrCore.<init>(SolrCore.java:649)
	at org.apache.solr.core.CoreContainer.create(CoreContainer.java:478)
	at org.apache.solr.core.CoreContainer$1.call(CoreContainer.java:240)
	at org.apache.solr.core.CoreContainer$1.call(CoreContainer.java:237)
	at java.util.concurrent.FutureTask.run(FutureTask.java:262)
	at java.util.concurrent.ThreadPoolExecutor.runWorker(ThreadPoolExecutor.java:1145)
	at java.util.concurrent.ThreadPoolExecutor$Worker.run(ThreadPoolExecutor.java:615)
	... 1 more
Caused by: Internal Server Error (500) - Failed to store data for /rest/managed due to: java.security.AccessControlException: access denied ("java.io.FilePermission" "/usr/home/hudson/hudson-slave/workspace/Lucene-Solr-Tests-trunk-Java7/solr/core/src/test-files/solr/collection1/conf/_rest_managed.json" "write")
	at org.apache.solr.rest.ManagedResource.storeManagedData(ManagedResource.java:270)
	at org.apache.solr.rest.RestManager$RestManagerManagedResource.onManagedDataLoadedFromStorage(RestManager.java:458)
	at org.apache.solr.rest.ManagedResource.reloadFromStorage(ManagedResource.java:229)
	at org.apache.solr.rest.ManagedResource.loadManagedDataAndNotify(ManagedResource.java:87)
	at org.apache.solr.rest.RestManager.init(RestManager.java:593)
	at org.apache.solr.core.SolrCore.initRestManager(SolrCore.java:2369)
	at org.apache.solr.core.SolrCore.<init>(SolrCore.java:864)
	... 8 more
Caused by: java.security.AccessControlException: access denied ("java.io.FilePermission" "/usr/home/hudson/hudson-slave/workspace/Lucene-Solr-Tests-trunk-Java7/solr/core/src/test-files/solr/collection1/conf/_rest_managed.json" "write")
	at java.security.AccessControlContext.checkPermission(AccessControlContext.java:372)
	at java.security.AccessController.checkPermission(AccessController.java:559)
	at java.lang.SecurityManager.checkPermission(SecurityManager.java:549)
	at java.lang.SecurityManager.checkWrite(SecurityManager.java:979)
	at java.io.FileOutputStream.<init>(FileOutputStream.java:209)
	at java.io.FileOutputStream.<init>(FileOutputStream.java:110)
	at org.apache.solr.rest.ManagedResourceStorage$FileStorageIO.openOutputStream(ManagedResourceStorage.java:164)
	at org.apache.solr.rest.ManagedResourceStorage$JsonStorage.store(ManagedResourceStorage.java:407)
	at org.apache.solr.rest.ManagedResource.storeManagedData(ManagedResource.java:247)
	... 14 more


REGRESSION:  org.apache.solr.CursorPagingTest.testBadInputs

Error Message:
SolrCore 'collection1' is not available due to init failure: Internal Server Error

Stack Trace:
org.apache.solr.common.SolrException: SolrCore 'collection1' is not available due to init failure: Internal Server Error
	at org.apache.solr.core.CoreContainer.getCore(CoreContainer.java:675)
	at org.apache.solr.util.TestHarness.getCoreInc(TestHarness.java:219)
	at org.apache.solr.util.TestHarness.update(TestHarness.java:235)
	at org.apache.solr.util.BaseTestHarness.checkUpdateStatus(BaseTestHarness.java:282)
	at org.apache.solr.util.BaseTestHarness.validateUpdate(BaseTestHarness.java:252)
	at org.apache.solr.SolrTestCaseJ4.checkUpdateU(SolrTestCaseJ4.java:673)
	at org.apache.solr.SolrTestCaseJ4.assertU(SolrTestCaseJ4.java:652)
	at org.apache.solr.SolrTestCaseJ4.assertU(SolrTestCaseJ4.java:646)
	at org.apache.solr.CursorPagingTest.testBadInputs(CursorPagingTest.java:82)
	at sun.reflect.NativeMethodAccessorImpl.invoke0(Native Method)
	at sun.reflect.NativeMethodAccessorImpl.invoke(NativeMethodAccessorImpl.java:57)
	at sun.reflect.DelegatingMethodAccessorImpl.invoke(DelegatingMethodAccessorImpl.java:43)
	at java.lang.reflect.Method.invoke(Method.java:606)
	at com.carrotsearch.randomizedtesting.RandomizedRunner.invoke(RandomizedRunner.java:1618)
	at com.carrotsearch.randomizedtesting.RandomizedRunner$6.evaluate(RandomizedRunner.java:827)
	at com.carrotsearch.randomizedtesting.RandomizedRunner$7.evaluate(RandomizedRunner.java:863)
	at com.carrotsearch.randomizedtesting.RandomizedRunner$8.evaluate(RandomizedRunner.java:877)
	at com.carrotsearch.randomizedtesting.rules.SystemPropertiesRestoreRule$1.evaluate(SystemPropertiesRestoreRule.java:53)
	at org.apache.lucene.util.TestRuleSetupTeardownChained$1.evaluate(TestRuleSetupTeardownChained.java:50)
	at org.apache.lucene.util.AbstractBeforeAfterRule$1.evaluate(AbstractBeforeAfterRule.java:46)
	at com.carrotsearch.randomizedtesting.rules.SystemPropertiesInvariantRule$1.evaluate(SystemPropertiesInvariantRule.java:55)
	at org.apache.lucene.util.TestRuleThreadAndTestName$1.evaluate(TestRuleThreadAndTestName.java:49)
	at org.apache.lucene.util.TestRuleIgnoreAfterMaxFailures$1.evaluate(TestRuleIgnoreAfterMaxFailures.java:65)
	at org.apache.lucene.util.TestRuleMarkFailure$1.evaluate(TestRuleMarkFailure.java:48)
	at com.carrotsearch.randomizedtesting.rules.StatementAdapter.evaluate(StatementAdapter.java:36)
	at com.carrotsearch.randomizedtesting.ThreadLeakControl$StatementRunner.run(ThreadLeakControl.java:365)
	at com.carrotsearch.randomizedtesting.ThreadLeakControl.forkTimeoutingTask(ThreadLeakControl.java:798)
	at com.carrotsearch.randomizedtesting.ThreadLeakControl$3.evaluate(ThreadLeakControl.java:458)
	at com.carrotsearch.randomizedtesting.RandomizedRunner.runSingleTest(RandomizedRunner.java:836)
	at com.carrotsearch.randomizedtesting.RandomizedRunner$3.evaluate(RandomizedRunner.java:738)
	at com.carrotsearch.randomizedtesting.RandomizedRunner$4.evaluate(RandomizedRunner.java:772)
	at com.carrotsearch.randomizedtesting.RandomizedRunner$5.evaluate(RandomizedRunner.java:783)
	at com.carrotsearch.randomizedtesting.rules.StatementAdapter.evaluate(StatementAdapter.java:36)
	at com.carrotsearch.randomizedtesting.rules.SystemPropertiesRestoreRule$1.evaluate(SystemPropertiesRestoreRule.java:53)
	at org.apache.lucene.util.AbstractBeforeAfterRule$1.evaluate(AbstractBeforeAfterRule.java:46)
	at org.apache.lucene.util.TestRuleStoreClassName$1.evaluate(TestRuleStoreClassName.java:42)
	at com.carrotsearch.randomizedtesting.rules.SystemPropertiesInvariantRule$1.evaluate(SystemPropertiesInvariantRule.java:55)
	at com.carrotsearch.randomizedtesting.rules.NoShadowingOrOverridesOnMethodsRule$1.evaluate(NoShadowingOrOverridesOnMethodsRule.java:39)
	at com.carrotsearch.randomizedtesting.rules.NoShadowingOrOverridesOnMethodsRule$1.evaluate(NoShadowingOrOverridesOnMethodsRule.java:39)
	at com.carrotsearch.randomizedtesting.rules.StatementAdapter.evaluate(StatementAdapter.java:36)
	at com.carrotsearch.randomizedtesting.rules.StatementAdapter.evaluate(StatementAdapter.java:36)
	at com.carrotsearch.randomizedtesting.rules.StatementAdapter.evaluate(StatementAdapter.java:36)
	at org.apache.lucene.util.TestRuleAssertionsRequired$1.evaluate(TestRuleAssertionsRequired.java:43)
	at org.apache.lucene.util.TestRuleMarkFailure$1.evaluate(TestRuleMarkFailure.java:48)
	at org.apache.lucene.util.TestRuleIgnoreAfterMaxFailures$1.evaluate(TestRuleIgnoreAfterMaxFailures.java:65)
	at org.apache.lucene.util.TestRuleIgnoreTestSuites$1.evaluate(TestRuleIgnoreTestSuites.java:55)
	at com.carrotsearch.randomizedtesting.rules.StatementAdapter.evaluate(StatementAdapter.java:36)
	at com.carrotsearch.randomizedtesting.ThreadLeakControl$StatementRunner.run(ThreadLeakControl.java:365)
	at java.lang.Thread.run(Thread.java:745)
Caused by: org.apache.solr.common.SolrException: Internal Server Error
	at org.apache.solr.core.SolrCore.<init>(SolrCore.java:885)
	at org.apache.solr.core.SolrCore.<init>(SolrCore.java:649)
	at org.apache.solr.core.CoreContainer.create(CoreContainer.java:478)
	at org.apache.solr.core.CoreContainer$1.call(CoreContainer.java:240)
	at org.apache.solr.core.CoreContainer$1.call(CoreContainer.java:237)
	at java.util.concurrent.FutureTask.run(FutureTask.java:262)
	at java.util.concurrent.ThreadPoolExecutor.runWorker(ThreadPoolExecutor.java:1145)
	at java.util.concurrent.ThreadPoolExecutor$Worker.run(ThreadPoolExecutor.java:615)
	... 1 more
Caused by: Internal Server Error (500) - Failed to store data for /rest/managed due to: java.security.AccessControlException: access denied ("java.io.FilePermission" "/usr/home/hudson/hudson-slave/workspace/Lucene-Solr-Tests-trunk-Java7/solr/core/src/test-files/solr/collection1/conf/_rest_managed.json" "write")
	at org.apache.solr.rest.ManagedResource.storeManagedData(ManagedResource.java:270)
	at org.apache.solr.rest.RestManager$RestManagerManagedResource.onManagedDataLoadedFromStorage(RestManager.java:458)
	at org.apache.solr.rest.ManagedResource.reloadFromStorage(ManagedResource.java:229)
	at org.apache.solr.rest.ManagedResource.loadManagedDataAndNotify(ManagedResource.java:87)
	at org.apache.solr.rest.RestManager.init(RestManager.java:593)
	at org.apache.solr.core.SolrCore.initRestManager(SolrCore.java:2369)
	at org.apache.solr.core.SolrCore.<init>(SolrCore.java:864)
	... 8 more
Caused by: java.security.AccessControlException: access denied ("java.io.FilePermission" "/usr/home/hudson/hudson-slave/workspace/Lucene-Solr-Tests-trunk-Java7/solr/core/src/test-files/solr/collection1/conf/_rest_managed.json" "write")
	at java.security.AccessControlContext.checkPermission(AccessControlContext.java:372)
	at java.security.AccessController.checkPermission(AccessController.java:559)
	at java.lang.SecurityManager.checkPermission(SecurityManager.java:549)
	at java.lang.SecurityManager.checkWrite(SecurityManager.java:979)
	at java.io.FileOutputStream.<init>(FileOutputStream.java:209)
	at java.io.FileOutputStream.<init>(FileOutputStream.java:110)
	at org.apache.solr.rest.ManagedResourceStorage$FileStorageIO.openOutputStream(ManagedResourceStorage.java:164)
	at org.apache.solr.rest.ManagedResourceStorage$JsonStorage.store(ManagedResourceStorage.java:407)
	at org.apache.solr.rest.ManagedResource.storeManagedData(ManagedResource.java:247)
	... 14 more


REGRESSION:  org.apache.solr.CursorPagingTest.testSimple

Error Message:
SolrCore 'collection1' is not available due to init failure: Internal Server Error

Stack Trace:
org.apache.solr.common.SolrException: SolrCore 'collection1' is not available due to init failure: Internal Server Error
	at org.apache.solr.core.CoreContainer.getCore(CoreContainer.java:675)
	at org.apache.solr.util.TestHarness.getCore(TestHarness.java:209)
	at org.apache.solr.SolrTestCaseJ4.req(SolrTestCaseJ4.java:1005)
	at org.apache.solr.CursorPagingTest.testSimple(CursorPagingTest.java:139)
	at sun.reflect.NativeMethodAccessorImpl.invoke0(Native Method)
	at sun.reflect.NativeMethodAccessorImpl.invoke(NativeMethodAccessorImpl.java:57)
	at sun.reflect.DelegatingMethodAccessorImpl.invoke(DelegatingMethodAccessorImpl.java:43)
	at java.lang.reflect.Method.invoke(Method.java:606)
	at com.carrotsearch.randomizedtesting.RandomizedRunner.invoke(RandomizedRunner.java:1618)
	at com.carrotsearch.randomizedtesting.RandomizedRunner$6.evaluate(RandomizedRunner.java:827)
	at com.carrotsearch.randomizedtesting.RandomizedRunner$7.evaluate(RandomizedRunner.java:863)
	at com.carrotsearch.randomizedtesting.RandomizedRunner$8.evaluate(RandomizedRunner.java:877)
	at com.carrotsearch.randomizedtesting.rules.SystemPropertiesRestoreRule$1.evaluate(SystemPropertiesRestoreRule.java:53)
	at org.apache.lucene.util.TestRuleSetupTeardownChained$1.evaluate(TestRuleSetupTeardownChained.java:50)
	at org.apache.lucene.util.AbstractBeforeAfterRule$1.evaluate(AbstractBeforeAfterRule.java:46)
	at com.carrotsearch.randomizedtesting.rules.SystemPropertiesInvariantRule$1.evaluate(SystemPropertiesInvariantRule.java:55)
	at org.apache.lucene.util.TestRuleThreadAndTestName$1.evaluate(TestRuleThreadAndTestName.java:49)
	at org.apache.lucene.util.TestRuleIgnoreAfterMaxFailures$1.evaluate(TestRuleIgnoreAfterMaxFailures.java:65)
	at org.apache.lucene.util.TestRuleMarkFailure$1.evaluate(TestRuleMarkFailure.java:48)
	at com.carrotsearch.randomizedtesting.rules.StatementAdapter.evaluate(StatementAdapter.java:36)
	at com.carrotsearch.randomizedtesting.ThreadLeakControl$StatementRunner.run(ThreadLeakControl.java:365)
	at com.carrotsearch.randomizedtesting.ThreadLeakControl.forkTimeoutingTask(ThreadLeakControl.java:798)
	at com.carrotsearch.randomizedtesting.ThreadLeakControl$3.evaluate(ThreadLeakControl.java:458)
	at com.carrotsearch.randomizedtesting.RandomizedRunner.runSingleTest(RandomizedRunner.java:836)
	at com.carrotsearch.randomizedtesting.RandomizedRunner$3.evaluate(RandomizedRunner.java:738)
	at com.carrotsearch.randomizedtesting.RandomizedRunner$4.evaluate(RandomizedRunner.java:772)
	at com.carrotsearch.randomizedtesting.RandomizedRunner$5.evaluate(RandomizedRunner.java:783)
	at com.carrotsearch.randomizedtesting.rules.StatementAdapter.evaluate(StatementAdapter.java:36)
	at com.carrotsearch.randomizedtesting.rules.SystemPropertiesRestoreRule$1.evaluate(SystemPropertiesRestoreRule.java:53)
	at org.apache.lucene.util.AbstractBeforeAfterRule$1.evaluate(AbstractBeforeAfterRule.java:46)
	at org.apache.lucene.util.TestRuleStoreClassName$1.evaluate(TestRuleStoreClassName.java:42)
	at com.carrotsearch.randomizedtesting.rules.SystemPropertiesInvariantRule$1.evaluate(SystemPropertiesInvariantRule.java:55)
	at com.carrotsearch.randomizedtesting.rules.NoShadowingOrOverridesOnMethodsRule$1.evaluate(NoShadowingOrOverridesOnMethodsRule.java:39)
	at com.carrotsearch.randomizedtesting.rules.NoShadowingOrOverridesOnMethodsRule$1.evaluate(NoShadowingOrOverridesOnMethodsRule.java:39)
	at com.carrotsearch.randomizedtesting.rules.StatementAdapter.evaluate(StatementAdapter.java:36)
	at com.carrotsearch.randomizedtesting.rules.StatementAdapter.evaluate(StatementAdapter.java:36)
	at com.carrotsearch.randomizedtesting.rules.StatementAdapter.evaluate(StatementAdapter.java:36)
	at org.apache.lucene.util.TestRuleAssertionsRequired$1.evaluate(TestRuleAssertionsRequired.java:43)
	at org.apache.lucene.util.TestRuleMarkFailure$1.evaluate(TestRuleMarkFailure.java:48)
	at org.apache.lucene.util.TestRuleIgnoreAfterMaxFailures$1.evaluate(TestRuleIgnoreAfterMaxFailures.java:65)
	at org.apache.lucene.util.TestRuleIgnoreTestSuites$1.evaluate(TestRuleIgnoreTestSuites.java:55)
	at com.carrotsearch.randomizedtesting.rules.StatementAdapter.evaluate(StatementAdapter.java:36)
	at com.carrotsearch.randomizedtesting.ThreadLeakControl$StatementRunner.run(ThreadLeakControl.java:365)
	at java.lang.Thread.run(Thread.java:745)
Caused by: org.apache.solr.common.SolrException: Internal Server Error
	at org.apache.solr.core.SolrCore.<init>(SolrCore.java:885)
	at org.apache.solr.core.SolrCore.<init>(SolrCore.java:649)
	at org.apache.solr.core.CoreContainer.create(CoreContainer.java:478)
	at org.apache.solr.core.CoreContainer$1.call(CoreContainer.java:240)
	at org.apache.solr.core.CoreContainer$1.call(CoreContainer.java:237)
	at java.util.concurrent.FutureTask.run(FutureTask.java:262)
	at java.util.concurrent.ThreadPoolExecutor.runWorker(ThreadPoolExecutor.java:1145)
	at java.util.concurrent.ThreadPoolExecutor$Worker.run(ThreadPoolExecutor.java:615)
	... 1 more
Caused by: Internal Server Error (500) - Failed to store data for /rest/managed due to: java.security.AccessControlException: access denied ("java.io.FilePermission" "/usr/home/hudson/hudson-slave/workspace/Lucene-Solr-Tests-trunk-Java7/solr/core/src/test-files/solr/collection1/conf/_rest_managed.json" "write")
	at org.apache.solr.rest.ManagedResource.storeManagedData(ManagedResource.java:270)
	at org.apache.solr.rest.RestManager$RestManagerManagedResource.onManagedDataLoadedFromStorage(RestManager.java:458)
	at org.apache.solr.rest.ManagedResource.reloadFromStorage(ManagedResource.java:229)
	at org.apache.solr.rest.ManagedResource.loadManagedDataAndNotify(ManagedResource.java:87)
	at org.apache.solr.rest.RestManager.init(RestManager.java:593)
	at org.apache.solr.core.SolrCore.initRestManager(SolrCore.java:2369)
	at org.apache.solr.core.SolrCore.<init>(SolrCore.java:864)
	... 8 more
Caused by: java.security.AccessControlException: access denied ("java.io.FilePermission" "/usr/home/hudson/hudson-slave/workspace/Lucene-Solr-Tests-trunk-Java7/solr/core/src/test-files/solr/collection1/conf/_rest_managed.json" "write")
	at java.security.AccessControlContext.checkPermission(AccessControlContext.java:372)
	at java.security.AccessController.checkPermission(AccessController.java:559)
	at java.lang.SecurityManager.checkPermission(SecurityManager.java:549)
	at java.lang.SecurityManager.checkWrite(SecurityManager.java:979)
	at java.io.FileOutputStream.<init>(FileOutputStream.java:209)
	at java.io.FileOutputStream.<init>(FileOutputStream.java:110)
	at org.apache.solr.rest.ManagedResourceStorage$FileStorageIO.openOutputStream(ManagedResourceStorage.java:164)
	at org.apache.solr.rest.ManagedResourceStorage$JsonStorage.store(ManagedResourceStorage.java:407)
	at org.apache.solr.rest.ManagedResource.storeManagedData(ManagedResource.java:247)
	... 14 more


REGRESSION:  org.apache.solr.CursorPagingTest.testFacetingWithRandomSorts

Error Message:
SolrCore 'collection1' is not available due to init failure: Internal Server Error

Stack Trace:
org.apache.solr.common.SolrException: SolrCore 'collection1' is not available due to init failure: Internal Server Error
	at org.apache.solr.core.CoreContainer.getCore(CoreContainer.java:675)
	at org.apache.solr.util.TestHarness.getCoreInc(TestHarness.java:219)
	at org.apache.solr.util.TestHarness.update(TestHarness.java:235)
	at org.apache.solr.util.BaseTestHarness.checkUpdateStatus(BaseTestHarness.java:282)
	at org.apache.solr.util.BaseTestHarness.validateUpdate(BaseTestHarness.java:252)
	at org.apache.solr.SolrTestCaseJ4.checkUpdateU(SolrTestCaseJ4.java:673)
	at org.apache.solr.SolrTestCaseJ4.assertU(SolrTestCaseJ4.java:652)
	at org.apache.solr.SolrTestCaseJ4.assertU(SolrTestCaseJ4.java:646)
	at org.apache.solr.CursorPagingTest.testFacetingWithRandomSorts(CursorPagingTest.java:726)
	at sun.reflect.NativeMethodAccessorImpl.invoke0(Native Method)
	at sun.reflect.NativeMethodAccessorImpl.invoke(NativeMethodAccessorImpl.java:57)
	at sun.reflect.DelegatingMethodAccessorImpl.invoke(DelegatingMethodAccessorImpl.java:43)
	at java.lang.reflect.Method.invoke(Method.java:606)
	at com.carrotsearch.randomizedtesting.RandomizedRunner.invoke(RandomizedRunner.java:1618)
	at com.carrotsearch.randomizedtesting.RandomizedRunner$6.evaluate(RandomizedRunner.java:827)
	at com.carrotsearch.randomizedtesting.RandomizedRunner$7.evaluate(RandomizedRunner.java:863)
	at com.carrotsearch.randomizedtesting.RandomizedRunner$8.evaluate(RandomizedRunner.java:877)
	at com.carrotsearch.randomizedtesting.rules.SystemPropertiesRestoreRule$1.evaluate(SystemPropertiesRestoreRule.java:53)
	at org.apache.lucene.util.TestRuleSetupTeardownChained$1.evaluate(TestRuleSetupTeardownChained.java:50)
	at org.apache.lucene.util.AbstractBeforeAfterRule$1.evaluate(AbstractBeforeAfterRule.java:46)
	at com.carrotsearch.randomizedtesting.rules.SystemPropertiesInvariantRule$1.evaluate(SystemPropertiesInvariantRule.java:55)
	at org.apache.lucene.util.TestRuleThreadAndTestName$1.evaluate(TestRuleThreadAndTestName.java:49)
	at org.apache.lucene.util.TestRuleIgnoreAfterMaxFailures$1.evaluate(TestRuleIgnoreAfterMaxFailures.java:65)
	at org.apache.lucene.util.TestRuleMarkFailure$1.evaluate(TestRuleMarkFailure.java:48)
	at com.carrotsearch.randomizedtesting.rules.StatementAdapter.evaluate(StatementAdapter.java:36)
	at com.carrotsearch.randomizedtesting.ThreadLeakControl$StatementRunner.run(ThreadLeakControl.java:365)
	at com.carrotsearch.randomizedtesting.ThreadLeakControl.forkTimeoutingTask(ThreadLeakControl.java:798)
	at com.carrotsearch.randomizedtesting.ThreadLeakControl$3.evaluate(ThreadLeakControl.java:458)
	at com.carrotsearch.randomizedtesting.RandomizedRunner.runSingleTest(RandomizedRunner.java:836)
	at com.carrotsearch.randomizedtesting.RandomizedRunner$3.evaluate(RandomizedRunner.java:738)
	at com.carrotsearch.randomizedtesting.RandomizedRunner$4.evaluate(RandomizedRunner.java:772)
	at com.carrotsearch.randomizedtesting.RandomizedRunner$5.evaluate(RandomizedRunner.java:783)
	at com.carrotsearch.randomizedtesting.rules.StatementAdapter.evaluate(StatementAdapter.java:36)
	at com.carrotsearch.randomizedtesting.rules.SystemPropertiesRestoreRule$1.evaluate(SystemPropertiesRestoreRule.java:53)
	at org.apache.lucene.util.AbstractBeforeAfterRule$1.evaluate(AbstractBeforeAfterRule.java:46)
	at org.apache.lucene.util.TestRuleStoreClassName$1.evaluate(TestRuleStoreClassName.java:42)
	at com.carrotsearch.randomizedtesting.rules.SystemPropertiesInvariantRule$1.evaluate(SystemPropertiesInvariantRule.java:55)
	at com.carrotsearch.randomizedtesting.rules.NoShadowingOrOverridesOnMethodsRule$1.evaluate(NoShadowingOrOverridesOnMethodsRule.java:39)
	at com.carrotsearch.randomizedtesting.rules.NoShadowingOrOverridesOnMethodsRule$1.evaluate(NoShadowingOrOverridesOnMethodsRule.java:39)
	at com.carrotsearch.randomizedtesting.rules.StatementAdapter.evaluate(StatementAdapter.java:36)
	at com.carrotsearch.randomizedtesting.rules.StatementAdapter.evaluate(StatementAdapter.java:36)
	at com.carrotsearch.randomizedtesting.rules.StatementAdapter.evaluate(StatementAdapter.java:36)
	at org.apache.lucene.util.TestRuleAssertionsRequired$1.evaluate(TestRuleAssertionsRequired.java:43)
	at org.apache.lucene.util.TestRuleMarkFailure$1.evaluate(TestRuleMarkFailure.java:48)
	at org.apache.lucene.util.TestRuleIgnoreAfterMaxFailures$1.evaluate(TestRuleIgnoreAfterMaxFailures.java:65)
	at org.apache.lucene.util.TestRuleIgnoreTestSuites$1.evaluate(TestRuleIgnoreTestSuites.java:55)
	at com.carrotsearch.randomizedtesting.rules.StatementAdapter.evaluate(StatementAdapter.java:36)
	at com.carrotsearch.randomizedtesting.ThreadLeakControl$StatementRunner.run(ThreadLeakControl.java:365)
	at java.lang.Thread.run(Thread.java:745)
Caused by: org.apache.solr.common.SolrException: Internal Server Error
	at org.apache.solr.core.SolrCore.<init>(SolrCore.java:885)
	at org.apache.solr.core.SolrCore.<init>(SolrCore.java:649)
	at org.apache.solr.core.CoreContainer.create(CoreContainer.java:478)
	at org.apache.solr.core.CoreContainer$1.call(CoreContainer.java:240)
	at org.apache.solr.core.CoreContainer$1.call(CoreContainer.java:237)
	at java.util.concurrent.FutureTask.run(FutureTask.java:262)
	at java.util.concurrent.ThreadPoolExecutor.runWorker(ThreadPoolExecutor.java:1145)
	at java.util.concurrent.ThreadPoolExecutor$Worker.run(ThreadPoolExecutor.java:615)
	... 1 more
Caused by: Internal Server Error (500) - Failed to store data for /rest/managed due to: java.security.AccessControlException: access denied ("java.io.FilePermission" "/usr/home/hudson/hudson-slave/workspace/Lucene-Solr-Tests-trunk-Java7/solr/core/src/test-files/solr/collection1/conf/_rest_managed.json" "write")
	at org.apache.solr.rest.ManagedResource.storeManagedData(ManagedResource.java:270)
	at org.apache.solr.rest.RestManager$RestManagerManagedResource.onManagedDataLoadedFromStorage(RestManager.java:458)
	at org.apache.solr.rest.ManagedResource.reloadFromStorage(ManagedResource.java:229)
	at org.apache.solr.rest.ManagedResource.loadManagedDataAndNotify(ManagedResource.java:87)
	at org.apache.solr.rest.RestManager.init(RestManager.java:593)
	at org.apache.solr.core.SolrCore.initRestManager(SolrCore.java:2369)
	at org.apache.solr.core.SolrCore.<init>(SolrCore.java:864)
	... 8 more
Caused by: java.security.AccessControlException: access denied ("java.io.FilePermission" "/usr/home/hudson/hudson-slave/workspace/Lucene-Solr-Tests-trunk-Java7/solr/core/src/test-files/solr/collection1/conf/_rest_managed.json" "write")
	at java.security.AccessControlContext.checkPermission(AccessControlContext.java:372)
	at java.security.AccessController.checkPermission(AccessController.java:559)
	at java.lang.SecurityManager.checkPermission(SecurityManager.java:549)
	at java.lang.SecurityManager.checkWrite(SecurityManager.java:979)
	at java.io.FileOutputStream.<init>(FileOutputStream.java:209)
	at java.io.FileOutputStream.<init>(FileOutputStream.java:110)
	at org.apache.solr.rest.ManagedResourceStorage$FileStorageIO.openOutputStream(ManagedResourceStorage.java:164)
	at org.apache.solr.rest.ManagedResourceStorage$JsonStorage.store(ManagedResourceStorage.java:407)
	at org.apache.solr.rest.ManagedResource.storeManagedData(ManagedResource.java:247)
	... 14 more


REGRESSION:  org.apache.solr.EchoParamsTest.test

Error Message:
SolrCore 'collection1' is not available due to init failure: Internal Server Error

Stack Trace:
org.apache.solr.common.SolrException: SolrCore 'collection1' is not available due to init failure: Internal Server Error
	at __randomizedtesting.SeedInfo.seed([DE06BBC73D5C2F70:5652841D93A04288]:0)
	at org.apache.solr.core.CoreContainer.getCore(CoreContainer.java:675)
	at org.apache.solr.util.TestHarness.getCore(TestHarness.java:209)
	at org.apache.solr.util.TestHarness$LocalRequestFactory.makeRequest(TestHarness.java:410)
	at org.apache.solr.SolrTestCaseJ4.req(SolrTestCaseJ4.java:978)
	at org.apache.solr.EchoParamsTest.defaultEchoParams(EchoParamsTest.java:48)
	at org.apache.solr.EchoParamsTest.test(EchoParamsTest.java:37)
	at sun.reflect.NativeMethodAccessorImpl.invoke0(Native Method)
	at sun.reflect.NativeMethodAccessorImpl.invoke(NativeMethodAccessorImpl.java:57)
	at sun.reflect.DelegatingMethodAccessorImpl.invoke(DelegatingMethodAccessorImpl.java:43)
	at java.lang.reflect.Method.invoke(Method.java:606)
	at com.carrotsearch.randomizedtesting.RandomizedRunner.invoke(RandomizedRunner.java:1618)
	at com.carrotsearch.randomizedtesting.RandomizedRunner$6.evaluate(RandomizedRunner.java:827)
	at com.carrotsearch.randomizedtesting.RandomizedRunner$7.evaluate(RandomizedRunner.java:863)
	at com.carrotsearch.randomizedtesting.RandomizedRunner$8.evaluate(RandomizedRunner.java:877)
	at com.carrotsearch.randomizedtesting.rules.SystemPropertiesRestoreRule$1.evaluate(SystemPropertiesRestoreRule.java:53)
	at org.apache.lucene.util.TestRuleSetupTeardownChained$1.evaluate(TestRuleSetupTeardownChained.java:50)
	at org.apache.lucene.util.AbstractBeforeAfterRule$1.evaluate(AbstractBeforeAfterRule.java:46)
	at com.carrotsearch.randomizedtesting.rules.SystemPropertiesInvariantRule$1.evaluate(SystemPropertiesInvariantRule.java:55)
	at org.apache.lucene.util.TestRuleThreadAndTestName$1.evaluate(TestRuleThreadAndTestName.java:49)
	at org.apache.lucene.util.TestRuleIgnoreAfterMaxFailures$1.evaluate(TestRuleIgnoreAfterMaxFailures.java:65)
	at org.apache.lucene.util.TestRuleMarkFailure$1.evaluate(TestRuleMarkFailure.java:48)
	at com.carrotsearch.randomizedtesting.rules.StatementAdapter.evaluate(StatementAdapter.java:36)
	at com.carrotsearch.randomizedtesting.ThreadLeakControl$StatementRunner.run(ThreadLeakControl.java:365)
	at com.carrotsearch.randomizedtesting.ThreadLeakControl.forkTimeoutingTask(ThreadLeakControl.java:798)
	at com.carrotsearch.randomizedtesting.ThreadLeakControl$3.evaluate(ThreadLeakControl.java:458)
	at com.carrotsearch.randomizedtesting.RandomizedRunner.runSingleTest(RandomizedRunner.java:836)
	at com.carrotsearch.randomizedtesting.RandomizedRunner$3.evaluate(RandomizedRunner.java:738)
	at com.carrotsearch.randomizedtesting.RandomizedRunner$4.evaluate(RandomizedRunner.java:772)
	at com.carrotsearch.randomizedtesting.RandomizedRunner$5.evaluate(RandomizedRunner.java:783)
	at com.carrotsearch.randomizedtesting.rules.StatementAdapter.evaluate(StatementAdapter.java:36)
	at com.carrotsearch.randomizedtesting.rules.SystemPropertiesRestoreRule$1.evaluate(SystemPropertiesRestoreRule.java:53)
	at org.apache.lucene.util.AbstractBeforeAfterRule$1.evaluate(AbstractBeforeAfterRule.java:46)
	at org.apache.lucene.util.TestRuleStoreClassName$1.evaluate(TestRuleStoreClassName.java:42)
	at com.carrotsearch.randomizedtesting.rules.SystemPropertiesInvariantRule$1.evaluate(SystemPropertiesInvariantRule.java:55)
	at com.carrotsearch.randomizedtesting.rules.NoShadowingOrOverridesOnMethodsRule$1.evaluate(NoShadowingOrOverridesOnMethodsRule.java:39)
	at com.carrotsearch.randomizedtesting.rules.NoShadowingOrOverridesOnMethodsRule$1.evaluate(NoShadowingOrOverridesOnMethodsRule.java:39)
	at com.carrotsearch.randomizedtesting.rules.StatementAdapter.evaluate(StatementAdapter.java:36)
	at com.carrotsearch.randomizedtesting.rules.StatementAdapter.evaluate(StatementAdapter.java:36)
	at com.carrotsearch.randomizedtesting.rules.StatementAdapter.evaluate(StatementAdapter.java:36)
	at org.apache.lucene.util.TestRuleAssertionsRequired$1.evaluate(TestRuleAssertionsRequired.java:43)
	at org.apache.lucene.util.TestRuleMarkFailure$1.evaluate(TestRuleMarkFailure.java:48)
	at org.apache.lucene.util.TestRuleIgnoreAfterMaxFailures$1.evaluate(TestRuleIgnoreAfterMaxFailures.java:65)
	at org.apache.lucene.util.TestRuleIgnoreTestSuites$1.evaluate(TestRuleIgnoreTestSuites.java:55)
	at com.carrotsearch.randomizedtesting.rules.StatementAdapter.evaluate(StatementAdapter.java:36)
	at com.carrotsearch.randomizedtesting.ThreadLeakControl$StatementRunner.run(ThreadLeakControl.java:365)
	at java.lang.Thread.run(Thread.java:745)
Caused by: org.apache.solr.common.SolrException: Internal Server Error
	at org.apache.solr.core.SolrCore.<init>(SolrCore.java:885)
	at org.apache.solr.core.SolrCore.<init>(SolrCore.java:649)
	at org.apache.solr.core.CoreContainer.create(CoreContainer.java:478)
	at org.apache.solr.core.CoreContainer$1.call(CoreContainer.java:240)
	at org.apache.solr.core.CoreContainer$1.call(CoreContainer.java:237)
	at java.util.concurrent.FutureTask.run(FutureTask.java:262)
	at java.util.concurrent.ThreadPoolExecutor.runWorker(ThreadPoolExecutor.java:1145)
	at java.util.concurrent.ThreadPoolExecutor$Worker.run(ThreadPoolExecutor.java:615)
	... 1 more
Caused by: Internal Server Error (500) - Failed to store data for /rest/managed due to: java.security.AccessControlException: access denied ("java.io.FilePermission" "/usr/home/hudson/hudson-slave/workspace/Lucene-Solr-Tests-trunk-Java7/solr/core/src/test-files/solr/collection1/conf/_rest_managed.json" "write")
	at org.apache.solr.rest.ManagedResource.storeManagedData(ManagedResource.java:270)
	at org.apache.solr.rest.RestManager$RestManagerManagedResource.onManagedDataLoadedFromStorage(RestManager.java:458)
	at org.apache.solr.rest.ManagedResource.reloadFromStorage(ManagedResource.java:229)
	at org.apache.solr.rest.ManagedResource.loadManagedDataAndNotify(ManagedResource.java:87)
	at org.apache.solr.rest.RestManager.init(RestManager.java:593)
	at org.apache.solr.core.SolrCore.initRestManager(SolrCore.java:2369)
	at org.apache.solr.core.SolrCore.<init>(SolrCore.java:864)
	... 8 more
Caused by: java.security.AccessControlException: access denied ("java.io.FilePermission" "/usr/home/hudson/hudson-slave/workspace/Lucene-Solr-Tests-trunk-Java7/solr/core/src/test-files/solr/collection1/conf/_rest_managed.json" "write")
	at java.security.AccessControlContext.checkPermission(AccessControlContext.java:372)
	at java.security.AccessController.checkPermission(AccessController.java:559)
	at java.lang.SecurityManager.checkPermission(SecurityManager.java:549)
	at java.lang.SecurityManager.checkWrite(SecurityManager.java:979)
	at java.io.FileOutputStream.<init>(FileOutputStream.java:209)
	at java.io.FileOutputStream.<init>(FileOutputStream.java:110)
	at org.apache.solr.rest.ManagedResourceStorage$FileStorageIO.openOutputStream(ManagedResourceStorage.java:164)
	at org.apache.solr.rest.ManagedResourceStorage$JsonStorage.store(ManagedResourceStorage.java:407)
	at org.apache.solr.rest.ManagedResource.storeManagedData(ManagedResource.java:247)
	... 14 more


REGRESSION:  org.apache.solr.OutputWriterTest.testTrivialXsltWriterInclude

Error Message:
SolrCore 'collection1' is not available due to init failure: Internal Server Error

Stack Trace:
org.apache.solr.common.SolrException: SolrCore 'collection1' is not available due to init failure: Internal Server Error
	at __randomizedtesting.SeedInfo.seed([DE06BBC73D5C2F70:479B726C116549EB]:0)
	at org.apache.solr.core.CoreContainer.getCore(CoreContainer.java:675)
	at org.apache.solr.util.TestHarness.getCore(TestHarness.java:209)
	at org.apache.solr.util.TestHarness$LocalRequestFactory.makeRequest(TestHarness.java:410)
	at org.apache.solr.SolrTestCaseJ4.req(SolrTestCaseJ4.java:978)
	at org.apache.solr.OutputWriterTest.testTrivialXsltWriterInclude(OutputWriterTest.java:91)
	at sun.reflect.NativeMethodAccessorImpl.invoke0(Native Method)
	at sun.reflect.NativeMethodAccessorImpl.invoke(NativeMethodAccessorImpl.java:57)
	at sun.reflect.DelegatingMethodAccessorImpl.invoke(DelegatingMethodAccessorImpl.java:43)
	at java.lang.reflect.Method.invoke(Method.java:606)
	at com.carrotsearch.randomizedtesting.RandomizedRunner.invoke(RandomizedRunner.java:1618)
	at com.carrotsearch.randomizedtesting.RandomizedRunner$6.evaluate(RandomizedRunner.java:827)
	at com.carrotsearch.randomizedtesting.RandomizedRunner$7.evaluate(RandomizedRunner.java:863)
	at com.carrotsearch.randomizedtesting.RandomizedRunner$8.evaluate(RandomizedRunner.java:877)
	at com.carrotsearch.randomizedtesting.rules.SystemPropertiesRestoreRule$1.evaluate(SystemPropertiesRestoreRule.java:53)
	at org.apache.lucene.util.TestRuleSetupTeardownChained$1.evaluate(TestRuleSetupTeardownChained.java:50)
	at org.apache.lucene.util.AbstractBeforeAfterRule$1.evaluate(AbstractBeforeAfterRule.java:46)
	at com.carrotsearch.randomizedtesting.rules.SystemPropertiesInvariantRule$1.evaluate(SystemPropertiesInvariantRule.java:55)
	at org.apache.lucene.util.TestRuleThreadAndTestName$1.evaluate(TestRuleThreadAndTestName.java:49)
	at org.apache.lucene.util.TestRuleIgnoreAfterMaxFailures$1.evaluate(TestRuleIgnoreAfterMaxFailures.java:65)
	at org.apache.lucene.util.TestRuleMarkFailure$1.evaluate(TestRuleMarkFailure.java:48)
	at com.carrotsearch.randomizedtesting.rules.StatementAdapter.evaluate(StatementAdapter.java:36)
	at com.carrotsearch.randomizedtesting.ThreadLeakControl$StatementRunner.run(ThreadLeakControl.java:365)
	at com.carrotsearch.randomizedtesting.ThreadLeakControl.forkTimeoutingTask(ThreadLeakControl.java:798)
	at com.carrotsearch.randomizedtesting.ThreadLeakControl$3.evaluate(ThreadLeakControl.java:458)
	at com.carrotsearch.randomizedtesting.RandomizedRunner.runSingleTest(RandomizedRunner.java:836)
	at com.carrotsearch.randomizedtesting.RandomizedRunner$3.evaluate(RandomizedRunner.java:738)
	at com.carrotsearch.randomizedtesting.RandomizedRunner$4.evaluate(RandomizedRunner.java:772)
	at com.carrotsearch.randomizedtesting.RandomizedRunner$5.evaluate(RandomizedRunner.java:783)
	at com.carrotsearch.randomizedtesting.rules.StatementAdapter.evaluate(StatementAdapter.java:36)
	at com.carrotsearch.randomizedtesting.rules.SystemPropertiesRestoreRule$1.evaluate(SystemPropertiesRestoreRule.java:53)
	at org.apache.lucene.util.AbstractBeforeAfterRule$1.evaluate(AbstractBeforeAfterRule.java:46)
	at org.apache.lucene.util.TestRuleStoreClassName$1.evaluate(TestRuleStoreClassName.java:42)
	at com.carrotsearch.randomizedtesting.rules.SystemPropertiesInvariantRule$1.evaluate(SystemPropertiesInvariantRule.java:55)
	at com.carrotsearch.randomizedtesting.rules.NoShadowingOrOverridesOnMethodsRule$1.evaluate(NoShadowingOrOverridesOnMethodsRule.java:39)
	at com.carrotsearch.randomizedtesting.rules.NoShadowingOrOverridesOnMethodsRule$1.evaluate(NoShadowingOrOverridesOnMethodsRule.java:39)
	at com.carrotsearch.randomizedtesting.rules.StatementAdapter.evaluate(StatementAdapter.java:36)
	at com.carrotsearch.randomizedtesting.rules.StatementAdapter.evaluate(StatementAdapter.java:36)
	at com.carrotsearch.randomizedtesting.rules.StatementAdapter.evaluate(StatementAdapter.java:36)
	at org.apache.lucene.util.TestRuleAssertionsRequired$1.evaluate(TestRuleAssertionsRequired.java:43)
	at org.apache.lucene.util.TestRuleMarkFailure$1.evaluate(TestRuleMarkFailure.java:48)
	at org.apache.lucene.util.TestRuleIgnoreAfterMaxFailures$1.evaluate(TestRuleIgnoreAfterMaxFailures.java:65)
	at org.apache.lucene.util.TestRuleIgnoreTestSuites$1.evaluate(TestRuleIgnoreTestSuites.java:55)
	at com.carrotsearch.randomizedtesting.rules.StatementAdapter.evaluate(StatementAdapter.java:36)
	at com.carrotsearch.randomizedtesting.ThreadLeakControl$StatementRunner.run(ThreadLeakControl.java:365)
	at java.lang.Thread.run(Thread.java:745)
Caused by: org.apache.solr.common.SolrException: Internal Server Error
	at org.apache.solr.core.SolrCore.<init>(SolrCore.java:885)
	at org.apache.solr.core.SolrCore.<init>(SolrCore.java:649)
	at org.apache.solr.core.CoreContainer.create(CoreContainer.java:478)
	at org.apache.solr.core.CoreContainer$1.call(CoreContainer.java:240)
	at org.apache.solr.core.CoreContainer$1.call(CoreContainer.java:237)
	at java.util.concurrent.FutureTask.run(FutureTask.java:262)
	at java.util.concurrent.ThreadPoolExecutor.runWorker(ThreadPoolExecutor.java:1145)
	at java.util.concurrent.ThreadPoolExecutor$Worker.run(ThreadPoolExecutor.java:615)
	... 1 more
Caused by: Internal Server Error (500) - Failed to store data for /rest/managed due to: java.security.AccessControlException: access denied ("java.io.FilePermission" "/usr/home/hudson/hudson-slave/workspace/Lucene-Solr-Tests-trunk-Java7/solr/core/src/test-files/solr/collection1/conf/_rest_managed.json" "write")
	at org.apache.solr.rest.ManagedResource.storeManagedData(ManagedResource.java:270)
	at org.apache.solr.rest.RestManager$RestManagerManagedResource.onManagedDataLoadedFromStorage(RestManager.java:458)
	at org.apache.solr.rest.ManagedResource.reloadFromStorage(ManagedResource.java:229)
	at org.apache.solr.rest.ManagedResource.loadManagedDataAndNotify(ManagedResource.java:87)
	at org.apache.solr.rest.RestManager.init(RestManager.java:593)
	at org.apache.solr.core.SolrCore.initRestManager(SolrCore.java:2369)
	at org.apache.solr.core.SolrCore.<init>(SolrCore.java:864)
	... 8 more
Caused by: java.security.AccessControlException: access denied ("java.io.FilePermission" "/usr/home/hudson/hudson-slave/workspace/Lucene-Solr-Tests-trunk-Java7/solr/core/src/test-files/solr/collection1/conf/_rest_managed.json" "write")
	at java.security.AccessControlContext.checkPermission(AccessControlContext.java:372)
	at java.security.AccessController.checkPermission(AccessController.java:559)
	at java.lang.SecurityManager.checkPermission(SecurityManager.java:549)
	at java.lang.SecurityManager.checkWrite(SecurityManager.java:979)
	at java.io.FileOutputStream.<init>(FileOutputStream.java:209)
	at java.io.FileOutputStream.<init>(FileOutputStream.java:110)
	at org.apache.solr.rest.ManagedResourceStorage$FileStorageIO.openOutputStream(ManagedResourceStorage.java:164)
	at org.apache.solr.rest.ManagedResourceStorage$JsonStorage.store(ManagedResourceStorage.java:407)
	at org.apache.solr.rest.ManagedResource.storeManagedData(ManagedResource.java:247)
	... 14 more


REGRESSION:  org.apache.solr.OutputWriterTest.testSOLR59responseHeaderVersions

Error Message:
SolrCore 'collection1' is not available due to init failure: Internal Server Error

Stack Trace:
org.apache.solr.common.SolrException: SolrCore 'collection1' is not available due to init failure: Internal Server Error
	at __randomizedtesting.SeedInfo.seed([DE06BBC73D5C2F70:733838910A1D8E8B]:0)
	at org.apache.solr.core.CoreContainer.getCore(CoreContainer.java:675)
	at org.apache.solr.util.TestHarness.getCore(TestHarness.java:209)
	at org.apache.solr.util.TestHarness$LocalRequestFactory.makeRequest(TestHarness.java:410)
	at org.apache.solr.SolrTestCaseJ4.req(SolrTestCaseJ4.java:978)
	at org.apache.solr.OutputWriterTest.testSOLR59responseHeaderVersions(OutputWriterTest.java:59)
	at sun.reflect.NativeMethodAccessorImpl.invoke0(Native Method)
	at sun.reflect.NativeMethodAccessorImpl.invoke(NativeMethodAccessorImpl.java:57)
	at sun.reflect.DelegatingMethodAccessorImpl.invoke(DelegatingMethodAccessorImpl.java:43)
	at java.lang.reflect.Method.invoke(Method.java:606)
	at com.carrotsearch.randomizedtesting.RandomizedRunner.invoke(RandomizedRunner.java:1618)
	at com.carrotsearch.randomizedtesting.RandomizedRunner$6.evaluate(RandomizedRunner.java:827)
	at com.carrotsearch.randomizedtesting.RandomizedRunner$7.evaluate(RandomizedRunner.java:863)
	at com.carrotsearch.randomizedtesting.RandomizedRunner$8.evaluate(RandomizedRunner.java:877)
	at com.carrotsearch.randomizedtesting.rules.SystemPropertiesRestoreRule$1.evaluate(SystemPropertiesRestoreRule.java:53)
	at org.apache.lucene.util.TestRuleSetupTeardownChained$1.evaluate(TestRuleSetupTeardownChained.java:50)
	at org.apache.lucene.util.AbstractBeforeAfterRule$1.evaluate(AbstractBeforeAfterRule.java:46)
	at com.carrotsearch.randomizedtesting.rules.SystemPropertiesInvariantRule$1.evaluate(SystemPropertiesInvariantRule.java:55)
	at org.apache.lucene.util.TestRuleThreadAndTestName$1.evaluate(TestRuleThreadAndTestName.java:49)
	at org.apache.lucene.util.TestRuleIgnoreAfterMaxFailures$1.evaluate(TestRuleIgnoreAfterMaxFailures.java:65)
	at org.apache.lucene.util.TestRuleMarkFailure$1.evaluate(TestRuleMarkFailure.java:48)
	at com.carrotsearch.randomizedtesting.rules.StatementAdapter.evaluate(StatementAdapter.java:36)
	at com.carrotsearch.randomizedtesting.ThreadLeakControl$StatementRunner.run(ThreadLeakControl.java:365)
	at com.carrotsearch.randomizedtesting.ThreadLeakControl.forkTimeoutingTask(ThreadLeakControl.java:798)
	at com.carrotsearch.randomizedtesting.ThreadLeakControl$3.evaluate(ThreadLeakControl.java:458)
	at com.carrotsearch.randomizedtesting.RandomizedRunner.runSingleTest(RandomizedRunner.java:836)
	at com.carrotsearch.randomizedtesting.RandomizedRunner$3.evaluate(RandomizedRunner.java:738)
	at com.carrotsearch.randomizedtesting.RandomizedRunner$4.evaluate(RandomizedRunner.java:772)
	at com.carrotsearch.randomizedtesting.RandomizedRunner$5.evaluate(RandomizedRunner.java:783)
	at com.carrotsearch.randomizedtesting.rules.StatementAdapter.evaluate(StatementAdapter.java:36)
	at com.carrotsearch.randomizedtesting.rules.SystemPropertiesRestoreRule$1.evaluate(SystemPropertiesRestoreRule.java:53)
	at org.apache.lucene.util.AbstractBeforeAfterRule$1.evaluate(AbstractBeforeAfterRule.java:46)
	at org.apache.lucene.util.TestRuleStoreClassName$1.evaluate(TestRuleStoreClassName.java:42)
	at com.carrotsearch.randomizedtesting.rules.SystemPropertiesInvariantRule$1.evaluate(SystemPropertiesInvariantRule.java:55)
	at com.carrotsearch.randomizedtesting.rules.NoShadowingOrOverridesOnMethodsRule$1.evaluate(NoShadowingOrOverridesOnMethodsRule.java:39)
	at com.carrotsearch.randomizedtesting.rules.NoShadowingOrOverridesOnMethodsRule$1.evaluate(NoShadowingOrOverridesOnMethodsRule.java:39)
	at com.carrotsearch.randomizedtesting.rules.StatementAdapter.evaluate(StatementAdapter.java:36)
	at com.carrotsearch.randomizedtesting.rules.StatementAdapter.evaluate(StatementAdapter.java:36)
	at com.carrotsearch.randomizedtesting.rules.StatementAdapter.evaluate(StatementAdapter.java:36)
	at org.apache.lucene.util.TestRuleAssertionsRequired$1.evaluate(TestRuleAssertionsRequired.java:43)
	at org.apache.lucene.util.TestRuleMarkFailure$1.evaluate(TestRuleMarkFailure.java:48)
	at org.apache.lucene.util.TestRuleIgnoreAfterMaxFailures$1.evaluate(TestRuleIgnoreAfterMaxFailures.java:65)
	at org.apache.lucene.util.TestRuleIgnoreTestSuites$1.evaluate(TestRuleIgnoreTestSuites.java:55)
	at com.carrotsearch.randomizedtesting.rules.StatementAdapter.evaluate(StatementAdapter.java:36)
	at com.carrotsearch.randomizedtesting.ThreadLeakControl$StatementRunner.run(ThreadLeakControl.java:365)
	at java.lang.Thread.run(Thread.java:745)
Caused by: org.apache.solr.common.SolrException: Internal Server Error
	at org.apache.solr.core.SolrCore.<init>(SolrCore.java:885)
	at org.apache.solr.core.SolrCore.<init>(SolrCore.java:649)
	at org.apache.solr.core.CoreContainer.create(CoreContainer.java:478)
	at org.apache.solr.core.CoreContainer$1.call(CoreContainer.java:240)
	at org.apache.solr.core.CoreContainer$1.call(CoreContainer.java:237)
	at java.util.concurrent.FutureTask.run(FutureTask.java:262)
	at java.util.concurrent.ThreadPoolExecutor.runWorker(ThreadPoolExecutor.java:1145)
	at java.util.concurrent.ThreadPoolExecutor$Worker.run(ThreadPoolExecutor.java:615)
	... 1 more
Caused by: Internal Server Error (500) - Failed to store data for /rest/managed due to: java.security.AccessControlException: access denied ("java.io.FilePermission" "/usr/home/hudson/hudson-slave/workspace/Lucene-Solr-Tests-trunk-Java7/solr/core/src/test-files/solr/collection1/conf/_rest_managed.json" "write")
	at org.apache.solr.rest.ManagedResource.storeManagedData(ManagedResource.java:270)
	at org.apache.solr.rest.RestManager$RestManagerManagedResource.onManagedDataLoadedFromStorage(RestManager.java:458)
	at org.apache.solr.rest.ManagedResource.reloadFromStorage(ManagedResource.java:229)
	at org.apache.solr.rest.ManagedResource.loadManagedDataAndNotify(ManagedResource.java:87)
	at org.apache.solr.rest.RestManager.init(RestManager.java:593)
	at org.apache.solr.core.SolrCore.initRestManager(SolrCore.java:2369)
	at org.apache.solr.core.SolrCore.<init>(SolrCore.java:864)
	... 8 more
Caused by: java.security.AccessControlException: access denied ("java.io.FilePermission" "/usr/home/hudson/hudson-slave/workspace/Lucene-Solr-Tests-trunk-Java7/solr/core/src/test-files/solr/collection1/conf/_rest_managed.json" "write")
	at java.security.AccessControlContext.checkPermission(AccessControlContext.java:372)
	at java.security.AccessController.checkPermission(AccessController.java:559)
	at java.lang.SecurityManager.checkPermission(SecurityManager.java:549)
	at java.lang.SecurityManager.checkWrite(SecurityManager.java:979)
	at java.io.FileOutputStream.<init>(FileOutputStream.java:209)
	at java.io.FileOutputStream.<init>(FileOutputStream.java:110)
	at org.apache.solr.rest.ManagedResourceStorage$FileStorageIO.openOutputStream(ManagedResourceStorage.java:164)
	at org.apache.solr.rest.ManagedResourceStorage$JsonStorage.store(ManagedResourceStorage.java:407)
	at org.apache.solr.rest.ManagedResource.storeManagedData(ManagedResource.java:247)
	... 14 more


REGRESSION:  org.apache.solr.OutputWriterTest.testLazy

Error Message:
SolrCore 'collection1' is not available due to init failure: Internal Server Error

Stack Trace:
org.apache.solr.common.SolrException: SolrCore 'collection1' is not available due to init failure: Internal Server Error
	at __randomizedtesting.SeedInfo.seed([DE06BBC73D5C2F70:EFDFB6958D00FBDB]:0)
	at org.apache.solr.core.CoreContainer.getCore(CoreContainer.java:675)
	at org.apache.solr.util.TestHarness.getCore(TestHarness.java:209)
	at org.apache.solr.OutputWriterTest.testLazy(OutputWriterTest.java:97)
	at sun.reflect.NativeMethodAccessorImpl.invoke0(Native Method)
	at sun.reflect.NativeMethodAccessorImpl.invoke(NativeMethodAccessorImpl.java:57)
	at sun.reflect.DelegatingMethodAccessorImpl.invoke(DelegatingMethodAccessorImpl.java:43)
	at java.lang.reflect.Method.invoke(Method.java:606)
	at com.carrotsearch.randomizedtesting.RandomizedRunner.invoke(RandomizedRunner.java:1618)
	at com.carrotsearch.randomizedtesting.RandomizedRunner$6.evaluate(RandomizedRunner.java:827)
	at com.carrotsearch.randomizedtesting.RandomizedRunner$7.evaluate(RandomizedRunner.java:863)
	at com.carrotsearch.randomizedtesting.RandomizedRunner$8.evaluate(RandomizedRunner.java:877)
	at com.carrotsearch.randomizedtesting.rules.SystemPropertiesRestoreRule$1.evaluate(SystemPropertiesRestoreRule.java:53)
	at org.apache.lucene.util.TestRuleSetupTeardownChained$1.evaluate(TestRuleSetupTeardownChained.java:50)
	at org.apache.lucene.util.AbstractBeforeAfterRule$1.evaluate(AbstractBeforeAfterRule.java:46)
	at com.carrotsearch.randomizedtesting.rules.SystemPropertiesInvariantRule$1.evaluate(SystemPropertiesInvariantRule.java:55)
	at org.apache.lucene.util.TestRuleThreadAndTestName$1.evaluate(TestRuleThreadAndTestName.java:49)
	at org.apache.lucene.util.TestRuleIgnoreAfterMaxFailures$1.evaluate(TestRuleIgnoreAfterMaxFailures.java:65)
	at org.apache.lucene.util.TestRuleMarkFailure$1.evaluate(TestRuleMarkFailure.java:48)
	at com.carrotsearch.randomizedtesting.rules.StatementAdapter.evaluate(StatementAdapter.java:36)
	at com.carrotsearch.randomizedtesting.ThreadLeakControl$StatementRunner.run(ThreadLeakControl.java:365)
	at com.carrotsearch.randomizedtesting.ThreadLeakControl.forkTimeoutingTask(ThreadLeakControl.java:798)
	at com.carrotsearch.randomizedtesting.ThreadLeakControl$3.evaluate(ThreadLeakControl.java:458)
	at com.carrotsearch.randomizedtesting.RandomizedRunner.runSingleTest(RandomizedRunner.java:836)
	at com.carrotsearch.randomizedtesting.RandomizedRunner$3.evaluate(RandomizedRunner.java:738)
	at com.carrotsearch.randomizedtesting.RandomizedRunner$4.evaluate(RandomizedRunner.java:772)
	at com.carrotsearch.randomizedtesting.RandomizedRunner$5.evaluate(RandomizedRunner.java:783)
	at com.carrotsearch.randomizedtesting.rules.StatementAdapter.evaluate(StatementAdapter.java:36)
	at com.carrotsearch.randomizedtesting.rules.SystemPropertiesRestoreRule$1.evaluate(SystemPropertiesRestoreRule.java:53)
	at org.apache.lucene.util.AbstractBeforeAfterRule$1.evaluate(AbstractBeforeAfterRule.java:46)
	at org.apache.lucene.util.TestRuleStoreClassName$1.evaluate(TestRuleStoreClassName.java:42)
	at com.carrotsearch.randomizedtesting.rules.SystemPropertiesInvariantRule$1.evaluate(SystemPropertiesInvariantRule.java:55)
	at com.carrotsearch.randomizedtesting.rules.NoShadowingOrOverridesOnMethodsRule$1.evaluate(NoShadowingOrOverridesOnMethodsRule.java:39)
	at com.carrotsearch.randomizedtesting.rules.NoShadowingOrOverridesOnMethodsRule$1.evaluate(NoShadowingOrOverridesOnMethodsRule.java:39)
	at com.carrotsearch.randomizedtesting.rules.StatementAdapter.evaluate(StatementAdapter.java:36)
	at com.carrotsearch.randomizedtesting.rules.StatementAdapter.evaluate(StatementAdapter.java:36)
	at com.carrotsearch.randomizedtesting.rules.StatementAdapter.evaluate(StatementAdapter.java:36)
	at org.apache.lucene.util.TestRuleAssertionsRequired$1.evaluate(TestRuleAssertionsRequired.java:43)
	at org.apache.lucene.util.TestRuleMarkFailure$1.evaluate(TestRuleMarkFailure.java:48)
	at org.apache.lucene.util.TestRuleIgnoreAfterMaxFailures$1.evaluate(TestRuleIgnoreAfterMaxFailures.java:65)
	at org.apache.lucene.util.TestRuleIgnoreTestSuites$1.evaluate(TestRuleIgnoreTestSuites.java:55)
	at com.carrotsearch.randomizedtesting.rules.StatementAdapter.evaluate(StatementAdapter.java:36)
	at com.carrotsearch.randomizedtesting.ThreadLeakControl$StatementRunner.run(ThreadLeakControl.java:365)
	at java.lang.Thread.run(Thread.java:745)
Caused by: org.apache.solr.common.SolrException: Internal Server Error
	at org.apache.solr.core.SolrCore.<init>(SolrCore.java:885)
	at org.apache.solr.core.SolrCore.<init>(SolrCore.java:649)
	at org.apache.solr.core.CoreContainer.create(CoreContainer.java:478)
	at org.apache.solr.core.CoreContainer$1.call(CoreContainer.java:240)
	at org.apache.solr.core.CoreContainer$1.call(CoreContainer.java:237)
	at java.util.concurrent.FutureTask.run(FutureTask.java:262)
	at java.util.concurrent.ThreadPoolExecutor.runWorker(ThreadPoolExecutor.java:1145)
	at java.util.concurrent.ThreadPoolExecutor$Worker.run(ThreadPoolExecutor.java:615)
	... 1 more
Caused by: Internal Server Error (500) - Failed to store data for /rest/managed due to: java.security.AccessControlException: access denied ("java.io.FilePermission" "/usr/home/hudson/hudson-slave/workspace/Lucene-Solr-Tests-trunk-Java7/solr/core/src/test-files/solr/collection1/conf/_rest_managed.json" "write")
	at org.apache.solr.rest.ManagedResource.storeManagedData(ManagedResource.java:270)
	at org.apache.solr.rest.RestManager$RestManagerManagedResource.onManagedDataLoadedFromStorage(RestManager.java:458)
	at org.apache.solr.rest.ManagedResource.reloadFromStorage(ManagedResource.java:229)
	at org.apache.solr.rest.ManagedResource.loadManagedDataAndNotify(ManagedResource.java:87)
	at org.apache.solr.rest.RestManager.init(RestManager.java:593)
	at org.apache.solr.core.SolrCore.initRestManager(SolrCore.java:2369)
	at org.apache.solr.core.SolrCore.<init>(SolrCore.java:864)
	... 8 more
Caused by: java.security.AccessControlException: access denied ("java.io.FilePermission" "/usr/home/hudson/hudson-slave/workspace/Lucene-Solr-Tests-trunk-Java7/solr/core/src/test-files/solr/collection1/conf/_rest_managed.json" "write")
	at java.security.AccessControlContext.checkPermission(AccessControlContext.java:372)
	at java.security.AccessController.checkPermission(AccessController.java:559)
	at java.lang.SecurityManager.checkPermission(SecurityManager.java:549)
	at java.lang.SecurityManager.checkWrite(SecurityManager.java:979)
	at java.io.FileOutputStream.<init>(FileOutputStream.java:209)
	at java.io.FileOutputStream.<init>(FileOutputStream.java:110)
	at org.apache.solr.rest.ManagedResourceStorage$FileStorageIO.openOutputStream(ManagedResourceStorage.java:164)
	at org.apache.solr.rest.ManagedResourceStorage$JsonStorage.store(ManagedResourceStorage.java:407)
	at org.apache.solr.rest.ManagedResource.storeManagedData(ManagedResource.java:247)
	... 14 more


REGRESSION:  org.apache.solr.OutputWriterTest.testUselessWriter

Error Message:
SolrCore 'collection1' is not available due to init failure: Internal Server Error

Stack Trace:
org.apache.solr.common.SolrException: SolrCore 'collection1' is not available due to init failure: Internal Server Error
	at __randomizedtesting.SeedInfo.seed([DE06BBC73D5C2F70:41B09F12937EA678]:0)
	at org.apache.solr.core.CoreContainer.getCore(CoreContainer.java:675)
	at org.apache.solr.util.TestHarness.getCore(TestHarness.java:209)
	at org.apache.solr.util.TestHarness$LocalRequestFactory.makeRequest(TestHarness.java:410)
	at org.apache.solr.SolrTestCaseJ4.req(SolrTestCaseJ4.java:978)
	at org.apache.solr.OutputWriterTest.testUselessWriter(OutputWriterTest.java:74)
	at sun.reflect.NativeMethodAccessorImpl.invoke0(Native Method)
	at sun.reflect.NativeMethodAccessorImpl.invoke(NativeMethodAccessorImpl.java:57)
	at sun.reflect.DelegatingMethodAccessorImpl.invoke(DelegatingMethodAccessorImpl.java:43)
	at java.lang.reflect.Method.invoke(Method.java:606)
	at com.carrotsearch.randomizedtesting.RandomizedRunner.invoke(RandomizedRunner.java:1618)
	at com.carrotsearch.randomizedtesting.RandomizedRunner$6.evaluate(RandomizedRunner.java:827)
	at com.carrotsearch.randomizedtesting.RandomizedRunner$7.evaluate(RandomizedRunner.java:863)
	at com.carrotsearch.randomizedtesting.RandomizedRunner$8.evaluate(RandomizedRunner.java:877)
	at com.carrotsearch.randomizedtesting.rules.SystemPropertiesRestoreRule$1.evaluate(SystemPropertiesRestoreRule.java:53)
	at org.apache.lucene.util.TestRuleSetupTeardownChained$1.evaluate(TestRuleSetupTeardownChained.java:50)
	at org.apache.lucene.util.AbstractBeforeAfterRule$1.evaluate(AbstractBeforeAfterRule.java:46)
	at com.carrotsearch.randomizedtesting.rules.SystemPropertiesInvariantRule$1.evaluate(SystemPropertiesInvariantRule.java:55)
	at org.apache.lucene.util.TestRuleThreadAndTestName$1.evaluate(TestRuleThreadAndTestName.java:49)
	at org.apache.lucene.util.TestRuleIgnoreAfterMaxFailures$1.evaluate(TestRuleIgnoreAfterMaxFailures.java:65)
	at org.apache.lucene.util.TestRuleMarkFailure$1.evaluate(TestRuleMarkFailure.java:48)
	at com.carrotsearch.randomizedtesting.rules.StatementAdapter.evaluate(StatementAdapter.java:36)
	at com.carrotsearch.randomizedtesting.ThreadLeakControl$StatementRunner.run(ThreadLeakControl.java:365)
	at com.carrotsearch.randomizedtesting.ThreadLeakControl.forkTimeoutingTask(ThreadLeakControl.java:798)
	at com.carrotsearch.randomizedtesting.ThreadLeakControl$3.evaluate(ThreadLeakControl.java:458)
	at com.carrotsearch.randomizedtesting.RandomizedRunner.runSingleTest(RandomizedRunner.java:836)
	at com.carrotsearch.randomizedtesting.RandomizedRunner$3.evaluate(RandomizedRunner.java:738)
	at com.carrotsearch.randomizedtesting.RandomizedRunner$4.evaluate(RandomizedRunner.java:772)
	at com.carrotsearch.randomizedtesting.RandomizedRunner$5.evaluate(RandomizedRunner.java:783)
	at com.carrotsearch.randomizedtesting.rules.StatementAdapter.evaluate(StatementAdapter.java:36)
	at com.carrotsearch.randomizedtesting.rules.SystemPropertiesRestoreRule$1.evaluate(SystemPropertiesRestoreRule.java:53)
	at org.apache.lucene.util.AbstractBeforeAfterRule$1.evaluate(AbstractBeforeAfterRule.java:46)
	at org.apache.lucene.util.TestRuleStoreClassName$1.evaluate(TestRuleStoreClassName.java:42)
	at com.carrotsearch.randomizedtesting.rules.SystemPropertiesInvariantRule$1.evaluate(SystemPropertiesInvariantRule.java:55)
	at com.carrotsearch.randomizedtesting.rules.NoShadowingOrOverridesOnMethodsRule$1.evaluate(NoShadowingOrOverridesOnMethodsRule.java:39)
	at com.carrotsearch.randomizedtesting.rules.NoShadowingOrOverridesOnMethodsRule$1.evaluate(NoShadowingOrOverridesOnMethodsRule.java:39)
	at com.carrotsearch.randomizedtesting.rules.StatementAdapter.evaluate(StatementAdapter.java:36)
	at com.carrotsearch.randomizedtesting.rules.StatementAdapter.evaluate(StatementAdapter.java:36)
	at com.carrotsearch.randomizedtesting.rules.StatementAdapter.evaluate(StatementAdapter.java:36)
	at org.apache.lucene.util.TestRuleAssertionsRequired$1.evaluate(TestRuleAssertionsRequired.java:43)
	at org.apache.lucene.util.TestRuleMarkFailure$1.evaluate(TestRuleMarkFailure.java:48)
	at org.apache.lucene.util.TestRuleIgnoreAfterMaxFailures$1.evaluate(TestRuleIgnoreAfterMaxFailures.java:65)
	at org.apache.lucene.util.TestRuleIgnoreTestSuites$1.evaluate(TestRuleIgnoreTestSuites.java:55)
	at com.carrotsearch.randomizedtesting.rules.StatementAdapter.evaluate(StatementAdapter.java:36)
	at com.carrotsearch.randomizedtesting.ThreadLeakControl$StatementRunner.run(ThreadLeakControl.java:365)
	at java.lang.Thread.run(Thread.java:745)
Caused by: org.apache.solr.common.SolrException: Internal Server Error
	at org.apache.solr.core.SolrCore.<init>(SolrCore.java:885)
	at org.apache.solr.core.SolrCore.<init>(SolrCore.java:649)
	at org.apache.solr.core.CoreContainer.create(CoreContainer.java:478)
	at org.apache.solr.core.CoreContainer$1.call(CoreContainer.java:240)
	at org.apache.solr.core.CoreContainer$1.call(CoreContainer.java:237)
	at java.util.concurrent.FutureTask.run(FutureTask.java:262)
	at java.util.concurrent.ThreadPoolExecutor.runWorker(ThreadPoolExecutor.java:1145)
	at java.util.concurrent.ThreadPoolExecutor$Worker.run(ThreadPoolExecutor.java:615)
	... 1 more
Caused by: Internal Server Error (500) - Failed to store data for /rest/managed due to: java.security.AccessControlException: access denied ("java.io.FilePermission" "/usr/home/hudson/hudson-slave/workspace/Lucene-Solr-Tests-trunk-Java7/solr/core/src/test-files/solr/collection1/conf/_rest_managed.json" "write")
	at org.apache.solr.rest.ManagedResource.storeManagedData(ManagedResource.java:270)
	at org.apache.solr.rest.RestManager$RestManagerManagedResource.onManagedDataLoadedFromStorage(RestManager.java:458)
	at org.apache.solr.rest.ManagedResource.reloadFromStorage(ManagedResource.java:229)
	at org.apache.solr.rest.ManagedResource.loadManagedDataAndNotify(ManagedResource.java:87)
	at org.apache.solr.rest.RestManager.init(RestManager.java:593)
	at org.apache.solr.core.SolrCore.initRestManager(SolrCore.java:2369)
	at org.apache.solr.core.SolrCore.<init>(SolrCore.java:864)
	... 8 more
Caused by: java.security.AccessControlException: access denied ("java.io.FilePermission" "/usr/home/hudson/hudson-slave/workspace/Lucene-Solr-Tests-trunk-Java7/solr/core/src/test-files/solr/collection1/conf/_rest_managed.json" "write")
	at java.security.AccessControlContext.checkPermission(AccessControlContext.java:372)
	at java.security.AccessController.checkPermission(AccessController.java:559)
	at java.lang.SecurityManager.checkPermission(SecurityManager.java:549)
	at java.lang.SecurityManager.checkWrite(SecurityManager.java:979)
	at java.io.FileOutputStream.<init>(FileOutputStream.java:209)
	at java.io.FileOutputStream.<init>(FileOutputStream.java:110)
	at org.apache.solr.rest.ManagedResourceStorage$FileStorageIO.openOutputStream(ManagedResourceStorage.java:164)
	at org.apache.solr.rest.ManagedResourceStorage$JsonStorage.store(ManagedResourceStorage.java:407)
	at org.apache.solr.rest.ManagedResource.storeManagedData(ManagedResource.java:247)
	... 14 more


REGRESSION:  org.apache.solr.OutputWriterTest.testTrivialXsltWriter

Error Message:
SolrCore 'collection1' is not available due to init failure: Internal Server Error

Stack Trace:
org.apache.solr.common.SolrException: SolrCore 'collection1' is not available due to init failure: Internal Server Error
	at __randomizedtesting.SeedInfo.seed([DE06BBC73D5C2F70:60CAD01AC16434DC]:0)
	at org.apache.solr.core.CoreContainer.getCore(CoreContainer.java:675)
	at org.apache.solr.util.TestHarness.getCore(TestHarness.java:209)
	at org.apache.solr.util.TestHarness$LocalRequestFactory.makeRequest(TestHarness.java:410)
	at org.apache.solr.SolrTestCaseJ4.req(SolrTestCaseJ4.java:978)
	at org.apache.solr.OutputWriterTest.testTrivialXsltWriter(OutputWriterTest.java:82)
	at sun.reflect.NativeMethodAccessorImpl.invoke0(Native Method)
	at sun.reflect.NativeMethodAccessorImpl.invoke(NativeMethodAccessorImpl.java:57)
	at sun.reflect.DelegatingMethodAccessorImpl.invoke(DelegatingMethodAccessorImpl.java:43)
	at java.lang.reflect.Method.invoke(Method.java:606)
	at com.carrotsearch.randomizedtesting.RandomizedRunner.invoke(RandomizedRunner.java:1618)
	at com.carrotsearch.randomizedtesting.RandomizedRunner$6.evaluate(RandomizedRunner.java:827)
	at com.carrotsearch.randomizedtesting.RandomizedRunner$7.evaluate(RandomizedRunner.java:863)
	at com.carrotsearch.randomizedtesting.RandomizedRunner$8.evaluate(RandomizedRunner.java:877)
	at com.carrotsearch.randomizedtesting.rules.SystemPropertiesRestoreRule$1.evaluate(SystemPropertiesRestoreRule.java:53)
	at org.apache.lucene.util.TestRuleSetupTeardownChained$1.evaluate(TestRuleSetupTeardownChained.java:50)
	at org.apache.lucene.util.AbstractBeforeAfterRule$1.evaluate(AbstractBeforeAfterRule.java:46)
	at com.carrotsearch.randomizedtesting.rules.SystemPropertiesInvariantRule$1.evaluate(SystemPropertiesInvariantRule.java:55)
	at org.apache.lucene.util.TestRuleThreadAndTestName$1.evaluate(TestRuleThreadAndTestName.java:49)
	at org.apache.lucene.util.TestRuleIgnoreAfterMaxFailures$1.evaluate(TestRuleIgnoreAfterMaxFailures.java:65)
	at org.apache.lucene.util.TestRuleMarkFailure$1.evaluate(TestRuleMarkFailure.java:48)
	at com.carrotsearch.randomizedtesting.rules.StatementAdapter.evaluate(StatementAdapter.java:36)
	at com.carrotsearch.randomizedtesting.ThreadLeakControl$StatementRunner.run(ThreadLeakControl.java:365)
	at com.carrotsearch.randomizedtesting.ThreadLeakControl.forkTimeoutingTask(ThreadLeakControl.java:798)
	at com.carrotsearch.randomizedtesting.ThreadLeakControl$3.evaluate(ThreadLeakControl.java:458)
	at com.carrotsearch.randomizedtesting.RandomizedRunner.runSingleTest(RandomizedRunner.java:836)
	at com.carrotsearch.randomizedtesting.RandomizedRunner$3.evaluate(RandomizedRunner.java:738)
	at com.carrotsearch.randomizedtesting.RandomizedRunner$4.evaluate(RandomizedRunner.java:772)
	at com.carrotsearch.randomizedtesting.RandomizedRunner$5.evaluate(RandomizedRunner.java:783)
	at com.carrotsearch.randomizedtesting.rules.StatementAdapter.evaluate(StatementAdapter.java:36)
	at com.carrotsearch.randomizedtesting.rules.SystemPropertiesRestoreRule$1.evaluate(SystemPropertiesRestoreRule.java:53)
	at org.apache.lucene.util.AbstractBeforeAfterRule$1.evaluate(AbstractBeforeAfterRule.java:46)
	at org.apache.lucene.util.TestRuleStoreClassName$1.evaluate(TestRuleStoreClassName.java:42)
	at com.carrotsearch.randomizedtesting.rules.SystemPropertiesInvariantRule$1.evaluate(SystemPropertiesInvariantRule.java:55)
	at com.carrotsearch.randomizedtesting.rules.NoShadowingOrOverridesOnMethodsRule$1.evaluate(NoShadowingOrOverridesOnMethodsRule.java:39)
	at com.carrotsearch.randomizedtesting.rules.NoShadowingOrOverridesOnMethodsRule$1.evaluate(NoShadowingOrOverridesOnMethodsRule.java:39)
	at com.carrotsearch.randomizedtesting.rules.StatementAdapter.evaluate(StatementAdapter.java:36)
	at com.carrotsearch.randomizedtesting.rules.StatementAdapter.evaluate(StatementAdapter.java:36)
	at com.carrotsearch.randomizedtesting.rules.StatementAdapter.evaluate(StatementAdapter.java:36)
	at org.apache.lucene.util.TestRuleAssertionsRequired$1.evaluate(TestRuleAssertionsRequired.java:43)
	at org.apache.lucene.util.TestRuleMarkFailure$1.evaluate(TestRuleMarkFailure.java:48)
	at org.apache.lucene.util.TestRuleIgnoreAfterMaxFailures$1.evaluate(TestRuleIgnoreAfterMaxFailures.java:65)
	at org.apache.lucene.util.TestRuleIgnoreTestSuites$1.evaluate(TestRuleIgnoreTestSuites.java:55)
	at com.carrotsearch.randomizedtesting.rules.StatementAdapter.evaluate(StatementAdapter.java:36)
	at com.carrotsearch.randomizedtesting.ThreadLeakControl$StatementRunner.run(ThreadLeakControl.java:365)
	at java.lang.Thread.run(Thread.java:745)
Caused by: org.apache.solr.common.SolrException: Internal Server Error
	at org.apache.solr.core.SolrCore.<init>(SolrCore.java:885)
	at org.apache.solr.core.SolrCore.<init>(SolrCore.java:649)
	at org.apache.solr.core.CoreContainer.create(CoreContainer.java:478)
	at org.apache.solr.core.CoreContainer$1.call(CoreContainer.java:240)
	at org.apache.solr.core.CoreContainer$1.call(CoreContainer.java:237)
	at java.util.concurrent.FutureTask.run(FutureTask.java:262)
	at java.util.concurrent.ThreadPoolExecutor.runWorker(ThreadPoolExecutor.java:1145)
	at java.util.concurrent.ThreadPoolExecutor$Worker.run(ThreadPoolExecutor.java:615)
	... 1 more
Caused by: Internal Server Error (500) - Failed to store data for /rest/managed due to: java.security.AccessControlException: access denied ("java.io.FilePermission" "/usr/home/hudson/hudson-slave/workspace/Lucene-Solr-Tests-trunk-Java7/solr/core/src/test-files/solr/collection1/conf/_rest_managed.json" "write")
	at org.apache.solr.rest.ManagedResource.storeManagedData(ManagedResource.java:270)
	at org.apache.solr.rest.RestManager$RestManagerManagedResource.onManagedDataLoadedFromStorage(RestManager.java:458)
	at org.apache.solr.rest.ManagedResource.reloadFromStorage(ManagedResource.java:229)
	at org.apache.solr.rest.ManagedResource.loadManagedDataAndNotify(ManagedResource.java:87)
	at org.apache.solr.rest.RestManager.init(RestManager.java:593)
	at org.apache.solr.core.SolrCore.initRestManager(SolrCore.java:2369)
	at org.apache.solr.core.SolrCore.<init>(SolrCore.java:864)
	... 8 more
Caused by: java.security.AccessControlException: access denied ("java.io.FilePermission" "/usr/home/hudson/hudson-slave/workspace/Lucene-Solr-Tests-trunk-Java7/solr/core/src/test-files/solr/collection1/conf/_rest_managed.json" "write")
	at java.security.AccessControlContext.checkPermission(AccessControlContext.java:372)
	at java.security.AccessController.checkPermission(AccessController.java:559)
	at java.lang.SecurityManager.checkPermission(SecurityManager.java:549)
	at java.lang.SecurityManager.checkWrite(SecurityManager.java:979)
	at java.io.FileOutputStream.<init>(FileOutputStream.java:209)
	at java.io.FileOutputStream.<init>(FileOutputStream.java:110)
	at org.apache.solr.rest.ManagedResourceStorage$FileStorageIO.openOutputStream(ManagedResourceStorage.java:164)
	at org.apache.solr.rest.ManagedResourceStorage$JsonStorage.store(ManagedResourceStorage.java:407)
	at org.apache.solr.rest.ManagedResource.storeManagedData(ManagedResource.java:247)
	... 14 more


REGRESSION:  org.apache.solr.SampleTest.testSimple

Error Message:
SolrCore 'collection1' is not available due to init failure: Internal Server Error

Stack Trace:
org.apache.solr.common.SolrException: SolrCore 'collection1' is not available due to init failure: Internal Server Error
	at __randomizedtesting.SeedInfo.seed([DE06BBC73D5C2F70:E6B59F391AAFFBA1]:0)
	at org.apache.solr.core.CoreContainer.getCore(CoreContainer.java:675)
	at org.apache.solr.util.TestHarness.getCoreInc(TestHarness.java:219)
	at org.apache.solr.util.TestHarness.update(TestHarness.java:235)
	at org.apache.solr.util.BaseTestHarness.checkUpdateStatus(BaseTestHarness.java:282)
	at org.apache.solr.util.BaseTestHarness.validateUpdate(BaseTestHarness.java:252)
	at org.apache.solr.SolrTestCaseJ4.checkUpdateU(SolrTestCaseJ4.java:673)
	at org.apache.solr.SolrTestCaseJ4.assertU(SolrTestCaseJ4.java:652)
	at org.apache.solr.SampleTest.testSimple(SampleTest.java:51)
	at sun.reflect.NativeMethodAccessorImpl.invoke0(Native Method)
	at sun.reflect.NativeMethodAccessorImpl.invoke(NativeMethodAccessorImpl.java:57)
	at sun.reflect.DelegatingMethodAccessorImpl.invoke(DelegatingMethodAccessorImpl.java:43)
	at java.lang.reflect.Method.invoke(Method.java:606)
	at com.carrotsearch.randomizedtesting.RandomizedRunner.invoke(RandomizedRunner.java:1618)
	at com.carrotsearch.randomizedtesting.RandomizedRunner$6.evaluate(RandomizedRunner.java:827)
	at com.carrotsearch.randomizedtesting.RandomizedRunner$7.evaluate(RandomizedRunner.java:863)
	at com.carrotsearch.randomizedtesting.RandomizedRunner$8.evaluate(RandomizedRunner.java:877)
	at com.carrotsearch.randomizedtesting.rules.SystemPropertiesRestoreRule$1.evaluate(SystemPropertiesRestoreRule.java:53)
	at org.apache.lucene.util.TestRuleSetupTeardownChained$1.evaluate(TestRuleSetupTeardownChained.java:50)
	at org.apache.lucene.util.AbstractBeforeAfterRule$1.evaluate(AbstractBeforeAfterRule.java:46)
	at com.carrotsearch.randomizedtesting.rules.SystemPropertiesInvariantRule$1.evaluate(SystemPropertiesInvariantRule.java:55)
	at org.apache.lucene.util.TestRuleThreadAndTestName$1.evaluate(TestRuleThreadAndTestName.java:49)
	at org.apache.lucene.util.TestRuleIgnoreAfterMaxFailures$1.evaluate(TestRuleIgnoreAfterMaxFailures.java:65)
	at org.apache.lucene.util.TestRuleMarkFailure$1.evaluate(TestRuleMarkFailure.java:48)
	at com.carrotsearch.randomizedtesting.rules.StatementAdapter.evaluate(StatementAdapter.java:36)
	at com.carrotsearch.randomizedtesting.ThreadLeakControl$StatementRunner.run(ThreadLeakControl.java:365)
	at com.carrotsearch.randomizedtesting.ThreadLeakControl.forkTimeoutingTask(ThreadLeakControl.java:798)
	at com.carrotsearch.randomizedtesting.ThreadLeakControl$3.evaluate(ThreadLeakControl.java:458)
	at com.carrotsearch.randomizedtesting.RandomizedRunner.runSingleTest(RandomizedRunner.java:836)
	at com.carrotsearch.randomizedtesting.RandomizedRunner$3.evaluate(RandomizedRunner.java:738)
	at com.carrotsearch.randomizedtesting.RandomizedRunner$4.evaluate(RandomizedRunner.java:772)
	at com.carrotsearch.randomizedtesting.RandomizedRunner$5.evaluate(RandomizedRunner.java:783)
	at com.carrotsearch.randomizedtesting.rules.StatementAdapter.evaluate(StatementAdapter.java:36)
	at com.carrotsearch.randomizedtesting.rules.SystemPropertiesRestoreRule$1.evaluate(SystemPropertiesRestoreRule.java:53)
	at org.apache.lucene.util.AbstractBeforeAfterRule$1.evaluate(AbstractBeforeAfterRule.java:46)
	at org.apache.lucene.util.TestRuleStoreClassName$1.evaluate(TestRuleStoreClassName.java:42)
	at com.carrotsearch.randomizedtesting.rules.SystemPropertiesInvariantRule$1.evaluate(SystemPropertiesInvariantRule.java:55)
	at com.carrotsearch.randomizedtesting.rules.NoShadowingOrOverridesOnMethodsRule$1.evaluate(NoShadowingOrOverridesOnMethodsRule.java:39)
	at com.carrotsearch.randomizedtesting.rules.NoShadowingOrOverridesOnMethodsRule$1.evaluate(NoShadowingOrOverridesOnMethodsRule.java:39)
	at com.carrotsearch.randomizedtesting.rules.StatementAdapter.evaluate(StatementAdapter.java:36)
	at com.carrotsearch.randomizedtesting.rules.StatementAdapter.evaluate(StatementAdapter.java:36)
	at com.carrotsearch.randomizedtesting.rules.StatementAdapter.evaluate(StatementAdapter.java:36)
	at org.apache.lucene.util.TestRuleAssertionsRequired$1.evaluate(TestRuleAssertionsRequired.java:43)
	at org.apache.lucene.util.TestRuleMarkFailure$1.evaluate(TestRuleMarkFailure.java:48)
	at org.apache.lucene.util.TestRuleIgnoreAfterMaxFailures$1.evaluate(TestRuleIgnoreAfterMaxFailures.java:65)
	at org.apache.lucene.util.TestRuleIgnoreTestSuites$1.evaluate(TestRuleIgnoreTestSuites.java:55)
	at com.carrotsearch.randomizedtesting.rules.StatementAdapter.evaluate(StatementAdapter.java:36)
	at com.carrotsearch.randomizedtesting.ThreadLeakControl$StatementRunner.run(ThreadLeakControl.java:365)
	at java.lang.Thread.run(Thread.java:745)
Caused by: org.apache.solr.common.SolrException: Internal Server Error
	at org.apache.solr.core.SolrCore.<init>(SolrCore.java:885)
	at org.apache.solr.core.SolrCore.<init>(SolrCore.java:649)
	at org.apache.solr.core.CoreContainer.create(CoreContainer.java:478)
	at org.apache.solr.core.CoreContainer$1.call(CoreContainer.java:240)
	at org.apache.solr.core.CoreContainer$1.call(CoreContainer.java:237)
	at java.util.concurrent.FutureTask.run(FutureTask.java:262)
	at java.util.concurrent.ThreadPoolExecutor.runWorker(ThreadPoolExecutor.java:1145)
	at java.util.concurrent.ThreadPoolExecutor$Worker.run(ThreadPoolExecutor.java:615)
	... 1 more
Caused by: Internal Server Error (500) - Failed to store data for /rest/managed due to: java.security.AccessControlException: access denied ("java.io.FilePermission" "/usr/home/hudson/hudson-slave/workspace/Lucene-Solr-Tests-trunk-Java7/solr/core/src/test-files/solr/collection1/conf/_rest_managed.json" "write")
	at org.apache.solr.rest.ManagedResource.storeManagedData(ManagedResource.java:270)
	at org.apache.solr.rest.RestManager$RestManagerManagedResource.onManagedDataLoadedFromStorage(RestManager.java:458)
	at org.apache.solr.rest.ManagedResource.reloadFromStorage(ManagedResource.java:229)
	at org.apache.solr.rest.ManagedResource.loadManagedDataAndNotify(ManagedResource.java:87)
	at org.apache.solr.rest.RestManager.init(RestManager.java:593)
	at org.apache.solr.core.SolrCore.initRestManager(SolrCore.java:2369)
	at org.apache.solr.core.SolrCore.<init>(SolrCore.java:864)
	... 8 more
Caused by: java.security.AccessControlException: access denied ("java.io.FilePermission" "/usr/home/hudson/hudson-slave/workspace/Lucene-Solr-Tests-trunk-Java7/solr/core/src/test-files/solr/collection1/conf/_rest_managed.json" "write")
	at java.security.AccessControlContext.checkPermission(AccessControlContext.java:372)
	at java.security.AccessController.checkPermission(AccessController.java:559)
	at java.lang.SecurityManager.checkPermission(SecurityManager.java:549)
	at java.lang.SecurityManager.checkWrite(SecurityManager.java:979)
	at java.io.FileOutputStream.<init>(FileOutputStream.java:209)
	at java.io.FileOutputStream.<init>(FileOutputStream.java:110)
	at org.apache.solr.rest.ManagedResourceStorage$FileStorageIO.openOutputStream(ManagedResourceStorage.java:164)
	at org.apache.solr.rest.ManagedResourceStorage$JsonStorage.store(ManagedResourceStorage.java:407)
	at org.apache.solr.rest.ManagedResource.storeManagedData(ManagedResource.java:247)
	... 14 more


REGRESSION:  org.apache.solr.SampleTest.testAdvanced

Error Message:
SolrCore 'collection1' is not available due to init failure: Internal Server Error

Stack Trace:
org.apache.solr.common.SolrException: SolrCore 'collection1' is not available due to init failure: Internal Server Error
	at __randomizedtesting.SeedInfo.seed([DE06BBC73D5C2F70:5B87FE0E8978245]:0)
	at org.apache.solr.core.CoreContainer.getCore(CoreContainer.java:675)
	at org.apache.solr.util.TestHarness.getCoreInc(TestHarness.java:219)
	at org.apache.solr.util.TestHarness.update(TestHarness.java:235)
	at org.apache.solr.util.BaseTestHarness.checkUpdateStatus(BaseTestHarness.java:282)
	at org.apache.solr.util.BaseTestHarness.validateUpdate(BaseTestHarness.java:252)
	at org.apache.solr.SolrTestCaseJ4.checkUpdateU(SolrTestCaseJ4.java:673)
	at org.apache.solr.SolrTestCaseJ4.assertU(SolrTestCaseJ4.java:652)
	at org.apache.solr.SampleTest.testAdvanced(SampleTest.java:75)
	at sun.reflect.NativeMethodAccessorImpl.invoke0(Native Method)
	at sun.reflect.NativeMethodAccessorImpl.invoke(NativeMethodAccessorImpl.java:57)
	at sun.reflect.DelegatingMethodAccessorImpl.invoke(DelegatingMethodAccessorImpl.java:43)
	at java.lang.reflect.Method.invoke(Method.java:606)
	at com.carrotsearch.randomizedtesting.RandomizedRunner.invoke(RandomizedRunner.java:1618)
	at com.carrotsearch.randomizedtesting.RandomizedRunner$6.evaluate(RandomizedRunner.java:827)
	at com.carrotsearch.randomizedtesting.RandomizedRunner$7.evaluate(RandomizedRunner.java:863)
	at com.carrotsearch.randomizedtesting.RandomizedRunner$8.evaluate(RandomizedRunner.java:877)
	at com.carrotsearch.randomizedtesting.rules.SystemPropertiesRestoreRule$1.evaluate(SystemPropertiesRestoreRule.java:53)
	at org.apache.lucene.util.TestRuleSetupTeardownChained$1.evaluate(TestRuleSetupTeardownChained.java:50)
	at org.apache.lucene.util.AbstractBeforeAfterRule$1.evaluate(AbstractBeforeAfterRule.java:46)
	at com.carrotsearch.randomizedtesting.rules.SystemPropertiesInvariantRule$1.evaluate(SystemPropertiesInvariantRule.java:55)
	at org.apache.lucene.util.TestRuleThreadAndTestName$1.evaluate(TestRuleThreadAndTestName.java:49)
	at org.apache.lucene.util.TestRuleIgnoreAfterMaxFailures$1.evaluate(TestRuleIgnoreAfterMaxFailures.java:65)
	at org.apache.lucene.util.TestRuleMarkFailure$1.evaluate(TestRuleMarkFailure.java:48)
	at com.carrotsearch.randomizedtesting.rules.StatementAdapter.evaluate(StatementAdapter.java:36)
	at com.carrotsearch.randomizedtesting.ThreadLeakControl$StatementRunner.run(ThreadLeakControl.java:365)
	at com.carrotsearch.randomizedtesting.ThreadLeakControl.forkTimeoutingTask(ThreadLeakControl.java:798)
	at com.carrotsearch.randomizedtesting.ThreadLeakControl$3.evaluate(ThreadLeakControl.java:458)
	at com.carrotsearch.randomizedtesting.RandomizedRunner.runSingleTest(RandomizedRunner.java:836)
	at com.carrotsearch.randomizedtesting.RandomizedRunner$3.evaluate(RandomizedRunner.java:738)
	at com.carrotsearch.randomizedtesting.RandomizedRunner$4.evaluate(RandomizedRunner.java:772)
	at com.carrotsearch.randomizedtesting.RandomizedRunner$5.evaluate(RandomizedRunner.java:783)
	at com.carrotsearch.randomizedtesting.rules.StatementAdapter.evaluate(StatementAdapter.java:36)
	at com.carrotsearch.randomizedtesting.rules.SystemPropert

[...truncated too long message...]

nk-Java7/solr/core/src/test-files/solr/collection1/conf/_rest_managed.json" "write")
   [junit4]    > 	at org.apache.solr.rest.ManagedResource.storeManagedData(ManagedResource.java:270)
   [junit4]    > 	at org.apache.solr.rest.RestManager$RestManagerManagedResource.onManagedDataLoadedFromStorage(RestManager.java:458)
   [junit4]    > 	at org.apache.solr.rest.ManagedResource.reloadFromStorage(ManagedResource.java:229)
   [junit4]    > 	at org.apache.solr.rest.ManagedResource.loadManagedDataAndNotify(ManagedResource.java:87)
   [junit4]    > 	at org.apache.solr.rest.RestManager.init(RestManager.java:593)
   [junit4]    > 	at org.apache.solr.core.SolrCore.initRestManager(SolrCore.java:2369)
   [junit4]    > 	at org.apache.solr.core.SolrCore.<init>(SolrCore.java:864)
   [junit4]    > 	... 8 more
   [junit4]    > Caused by: java.security.AccessControlException: access denied ("java.io.FilePermission" "/usr/home/hudson/hudson-slave/workspace/Lucene-Solr-Tests-trunk-Java7/solr/core/src/test-files/solr/collection1/conf/_rest_managed.json" "write")
   [junit4]    > 	at java.security.AccessControlContext.checkPermission(AccessControlContext.java:372)
   [junit4]    > 	at java.security.AccessController.checkPermission(AccessController.java:559)
   [junit4]    > 	at java.lang.SecurityManager.checkPermission(SecurityManager.java:549)
   [junit4]    > 	at java.lang.SecurityManager.checkWrite(SecurityManager.java:979)
   [junit4]    > 	at java.io.FileOutputStream.<init>(FileOutputStream.java:209)
   [junit4]    > 	at java.io.FileOutputStream.<init>(FileOutputStream.java:110)
   [junit4]    > 	at org.apache.solr.rest.ManagedResourceStorage$FileStorageIO.openOutputStream(ManagedResourceStorage.java:164)
   [junit4]    > 	at org.apache.solr.rest.ManagedResourceStorage$JsonStorage.store(ManagedResourceStorage.java:407)
   [junit4]    > 	at org.apache.solr.rest.ManagedResource.storeManagedData(ManagedResource.java:247)
   [junit4]    > 	... 14 more
   [junit4]   2> 3850882 T43609 oas.SolrTestCaseJ4.deleteCore ###deleteCore
   [junit4]   2> 3850883 T43609 oasc.CoreContainer.shutdown Shutting down CoreContainer instance=63913257
   [junit4]   2> NOTE: leaving temporary files on disk at: /usr/home/hudson/hudson-slave/workspace/Lucene-Solr-Tests-trunk-Java7/solr/build/solr-core/test/J1/./temp/solr.update.processor.ParsingFieldUpdateProcessorsTest-DE06BBC73D5C2F70-001
   [junit4]   2> NOTE: test params are: codec=Lucene49: {}, docValues:{}, sim=RandomSimilarityProvider(queryNorm=true,coord=yes): {}, locale=en_MT, timezone=US/Samoa
   [junit4]   2> NOTE: FreeBSD 9.1-RELEASE-p3 amd64/Oracle Corporation 1.7.0_60 (64-bit)/cpus=16,threads=1,free=276345856,total=536870912
   [junit4]   2> NOTE: All tests run in this JVM: [TestRandomFaceting, TestXIncludeConfig, TestSolrQueryParserResource, DistanceFunctionTest, TestSchemaNameResource, TestReversedWildcardFilterFactory, FieldAnalysisRequestHandlerTest, TestModifyConfFiles, TestCollectionAPI, TestCloudManagedSchemaConcurrent, TestCopyFieldCollectionResource, TestMultiCoreConfBootstrap, ExpressionTest, MultiTermTest, TestManagedSchemaFieldResource, TestBlendedInfixSuggestions, CircularListTest, DistributedSuggestComponentTest, SystemInfoHandlerTest, DeleteInactiveReplicaTest, TestFreeTextSuggestions, DeleteShardTest, TestPostingsSolrHighlighter, PreAnalyzedUpdateProcessorTest, TestLFUCache, OutputWriterTest, TestStressLucene, TestDistributedGrouping, TestQueryTypes, CopyFieldTest, TestRecovery, BinaryUpdateRequestHandlerTest, AtomicUpdatesTest, TestNoOpRegenerator, TestDocumentBuilder, QueryElevationComponentTest, DirectSolrConnectionTest, FieldFacetExtrasTest, SortByFunctionTest, TestSolrQueryParser, TestRealTimeGet, AbstractAnalyticsFacetTest, RequestHandlersTest, URLClassifyProcessorTest, IndexSchemaRuntimeFieldTest, ScriptEngineTest, TestCharFilters, CustomCollectionTest, TestHighlightDedupGrouping, CollectionsAPIDistributedZkTest, DateMathParserTest, DistributedTermsComponentTest, DefaultValueUpdateProcessorTest, TermVectorComponentDistributedTest, CacheHeaderTest, OpenCloseCoreStressTest, LoggingHandlerTest, DistributedQueryElevationComponentTest, DocValuesTest, AsyncMigrateRouteKeyTest, QueryFacetTest, TestFieldTypeCollectionResource, TestQueryUtils, HardAutoCommitTest, MergeStrategyTest, SolrPluginUtilsTest, TestSweetSpotSimilarityFactory, TestSolrXmlPersistor, TestLRUCache, ShardSplitTest, TestFieldSortValues, TestDistribDocBasedVersion, ClusterStateTest, TestSystemIdResolver, BJQParserTest, InfoHandlerTest, TestNonNRTOpen, TestComplexPhraseQParserPlugin, StatsComponentTest, DeleteReplicaTest, TestShortCircuitedRequests, SoftAutoCommitTest, TestFiltering, TestCursorMarkWithoutUniqueKey, BlockCacheTest, TestConfigSets, TestChildDocTransformer, ChangedSchemaMergeTest, TestClassNameShortening, TestJmxMonitoredMap, SchemaVersionSpecificBehaviorTest, TestExpandComponent, TestWriterPerf, TestFileDictionaryLookup, ChaosMonkeySafeLeaderTest, SOLR749Test, TestCSVResponseWriter, DistributedQueryComponentCustomSortTest, TestIBSimilarityFactory, DistributedQueryComponentOptimizationTest, ResourceLoaderTest, BasicDistributedZkTest, BasicDistributedZk2Test, SyncSliceTest, LeaderElectionIntegrationTest, ShardRoutingTest, BasicZkTest, FullSolrCloudDistribCmdsTest, LeaderElectionTest, ZkSolrClientTest, TestZkChroot, TestRandomDVFaceting, ShardRoutingCustomTest, TestDistributedSearch, TestRangeQuery, TestSolr4Spatial, SolrCoreTest, SpellCheckComponentTest, TestGroupingSearch, TestFunctionQuery, BasicFunctionalityTest, DirectUpdateHandlerTest, TestBadConfig, OverseerCollectionProcessorTest, TestIndexSearcher, HighlighterTest, ShowFileRequestHandlerTest, CurrencyFieldOpenExchangeTest, CurrencyFieldXmlFileTest, SolrIndexSplitterTest, SimplePostToolTest, TestCoreDiscovery, AnalysisAfterCoreReloadTest, SignatureUpdateProcessorFactoryTest, TestExtendedDismaxParser, SpellCheckCollatorTest, SuggesterFSTTest, CoreAdminHandlerTest, SolrRequestParserTest, TestFoldingMultitermQuery, SuggesterTest, TestTrie, SpatialFilterTest, SuggesterWFSTTest, TestCSVLoader, PolyFieldTest, WordBreakSolrSpellCheckerTest, SolrCoreCheckLockOnStartupTest, TestPseudoReturnFields, TestUpdate, TestAtomicUpdateErrorCases, QueryEqualityTest, DirectUpdateHandlerOptimizeTest, TestRemoteStreaming, DocValuesMultiTest, SolrInfoMBeanTest, DebugComponentTest, IndexBasedSpellCheckerTest, TestSurroundQueryParser, LukeRequestHandlerTest, DisMaxRequestHandlerTest, StandardRequestHandlerTest, DirectSolrSpellCheckerTest, DocumentAnalysisRequestHandlerTest, TestOmitPositions, FileBasedSpellCheckerTest, TermsComponentTest, XmlUpdateRequestHandlerTest, DocumentBuilderTest, TestValueSourceCache, TermVectorComponentTest, TestIndexingPerformance, RequiredFieldsTest, TestArbitraryIndexDir, TestCollationField, ReturnFieldsTest, UpdateRequestProcessorFactoryTest, MBeansHandlerTest, QueryParsingTest, TestAnalyzedSuggestions, UniqFieldsUpdateProcessorFactoryTest, TestPHPSerializedResponseWriter, PingRequestHandlerTest, CSVRequestHandlerTest, SearchHandlerTest, CoreContainerCoreInitFailuresTest, AlternateDirectoryTest, ResponseLogComponentTest, TestMergePolicyConfig, TestSolrDeletionPolicy2, TestBinaryField, MinimalSchemaTest, NotRequiredUniqueKeyTest, SynonymTokenizerTest, TestBM25SimilarityFactory, PluginInfoTest, PreAnalyzedFieldTest, UUIDFieldTest, AbstractAnalyticsStatsTest, FieldFacetTest, AliasIntegrationTest, DistribDocExpirationUpdateProcessorTest, MigrateRouteKeyTest, MultiThreadedOCPTest, OverseerStatusTest, RollingRestartTest, SSLMigrationTest, TestLeaderElectionZkExpiry, TriLevelCompositeIdRoutingTest, TestCollationFieldDocValues, AnalyticsMergeStrategyTest, CursorMarkTest, RankQueryTest, TestAddFieldRealTimeGet, TestInitQParser, TestMaxScoreQueryParser, TestReRankQParserPlugin, TestRecoveryHdfs, TestSearcherReuse, TestStandardQParsers, TestStressUserVersions, TestNonDefinedSimilarityFactory, ResponseHeaderTest, TestAnalyzeInfixSuggestions, TestHighFrequencyDictionaryFactory, BlockDirectoryTest, HdfsLockFactoryTest, AddBlockUpdateTest, AnalysisErrorHandlingTest, TestDocBasedVersionConstraints, TestExceedMaxTermLength, AddSchemaFieldsUpdateProcessorFactoryTest, DocExpirationUpdateProcessorFactoryTest, ParsingFieldUpdateProcessorsTest]
   [junit4] Completed on J1 in 1.90s, 33 tests, 33 errors <<< FAILURES!

[...truncated 25 lines...]
BUILD FAILED
/usr/home/hudson/hudson-slave/workspace/Lucene-Solr-Tests-trunk-Java7/build.xml:467: The following error occurred while executing this line:
/usr/home/hudson/hudson-slave/workspace/Lucene-Solr-Tests-trunk-Java7/build.xml:447: The following error occurred while executing this line:
/usr/home/hudson/hudson-slave/workspace/Lucene-Solr-Tests-trunk-Java7/build.xml:45: The following error occurred while executing this line:
/usr/home/hudson/hudson-slave/workspace/Lucene-Solr-Tests-trunk-Java7/extra-targets.xml:37: The following error occurred while executing this line:
/usr/home/hudson/hudson-slave/workspace/Lucene-Solr-Tests-trunk-Java7/solr/build.xml:189: The following error occurred while executing this line:
/usr/home/hudson/hudson-slave/workspace/Lucene-Solr-Tests-trunk-Java7/solr/common-build.xml:496: The following error occurred while executing this line:
/usr/home/hudson/hudson-slave/workspace/Lucene-Solr-Tests-trunk-Java7/lucene/common-build.xml:1298: The following error occurred while executing this line:
/usr/home/hudson/hudson-slave/workspace/Lucene-Solr-Tests-trunk-Java7/lucene/common-build.xml:922: There were test failures: 415 suites, 1560 tests, 27 suite-level errors, 389 errors, 9 failures, 49 ignored (15 assumptions)

Total time: 109 minutes 22 seconds
Build step 'Invoke Ant' marked build as failure
Archiving artifacts
Sending artifact delta relative to Lucene-Solr-Tests-trunk-Java7 #4753
Archived 3 artifacts
Archive block size is 32768
Received 0 blocks and 117705364 bytes
Compression is 0.0%
Took 21 sec
Recording test results
Email was triggered for: Failure
Sending email for trigger: Failure



Mime
View raw message