lucene-dev mailing list archives

Site index · List index
Message view « Date » · « Thread »
Top « Date » · « Thread »
From Apache Jenkins Server <jenk...@builds.apache.org>
Subject [JENKINS-MAVEN] Lucene-Solr-Maven-trunk #1164: POMs out of sync
Date Wed, 09 Jul 2014 13:06:42 GMT
Build: https://builds.apache.org/job/Lucene-Solr-Maven-trunk/1164/

1 tests failed.
FAILED:  org.apache.solr.cloud.MultiThreadedOCPTest.testDistribSearch

Error Message:
Task 3002 did not complete, final state: running

Stack Trace:
java.lang.AssertionError: Task 3002 did not complete, final state: running
	at __randomizedtesting.SeedInfo.seed([F6ECCECD0DA5EB33:770A40D57AFA8B0F]:0)
	at org.junit.Assert.fail(Assert.java:93)
	at org.junit.Assert.assertTrue(Assert.java:43)
	at org.apache.solr.cloud.MultiThreadedOCPTest.testDeduplicationOfSubmittedTasks(MultiThreadedOCPTest.java:162)
	at org.apache.solr.cloud.MultiThreadedOCPTest.doTest(MultiThreadedOCPTest.java:71)




Build Log:
[...truncated 54896 lines...]
BUILD FAILED
/usr/home/hudson/hudson-slave/workspace/Lucene-Solr-Maven-trunk/build.xml:490: The following
error occurred while executing this line:
/usr/home/hudson/hudson-slave/workspace/Lucene-Solr-Maven-trunk/build.xml:182: The following
error occurred while executing this line:
/usr/home/hudson/hudson-slave/workspace/Lucene-Solr-Maven-trunk/extra-targets.xml:77: Java
returned: 1

Total time: 168 minutes 38 seconds
Build step 'Invoke Ant' marked build as failure
Recording test results
Email was triggered for: Failure
Sending email for trigger: Failure



Mime
View raw message