lucene-dev mailing list archives

Site index · List index
Message view « Date » · « Thread »
Top « Date » · « Thread »
From Apache Jenkins Server <jenk...@builds.apache.org>
Subject [JENKINS-MAVEN] Lucene-Solr-Maven-4.x #648: POMs out of sync
Date Tue, 01 Jul 2014 10:39:50 GMT
Build: https://builds.apache.org/job/Lucene-Solr-Maven-4.x/648/

No tests ran.

Build Log:
[...truncated 38842 lines...]
-validate-maven-dependencies:
[artifact:dependencies] [INFO] snapshot org.apache.lucene:lucene-codecs:4.10-SNAPSHOT: checking
for updates from sonatype.releases
[artifact:dependencies] [WARNING] *** CHECKSUM FAILED - Checksum failed on download: local
= '780ba3cf6b6eb0f7c9f6d41d8d25a86a2f46b0c4'; remote = '<html>
[artifact:dependencies] <head><title>301' - RETRYING
[artifact:dependencies] [WARNING] *** CHECKSUM FAILED - Checksum failed on download: local
= '780ba3cf6b6eb0f7c9f6d41d8d25a86a2f46b0c4'; remote = '<html>
[artifact:dependencies] <head><title>301' - IGNORING
[artifact:dependencies] An error has occurred while processing the Maven artifact tasks.

[...truncated 18 lines...]
BUILD FAILED
/usr/home/hudson/hudson-slave/workspace/Lucene-Solr-Maven-4.x/build.xml:483: The following
error occurred while executing this line:
/usr/home/hudson/hudson-slave/workspace/Lucene-Solr-Maven-4.x/build.xml:174: The following
error occurred while executing this line:
/usr/home/hudson/hudson-slave/workspace/Lucene-Solr-Maven-4.x/lucene/build.xml:512: The following
error occurred while executing this line:
/usr/home/hudson/hudson-slave/workspace/Lucene-Solr-Maven-4.x/lucene/common-build.xml:1531:
The following error occurred while executing this line:
/usr/home/hudson/hudson-slave/workspace/Lucene-Solr-Maven-4.x/lucene/common-build.xml:560:
Unable to resolve artifact: Unable to get dependency information: Unable to read the metadata
file for artifact 'org.apache.lucene:lucene-codecs:jar': Error getting POM for 'org.apache.lucene:lucene-codecs'
from the repository: Unable to read local copy of metadata: Cannot read metadata from '/home/hudson/.m2/repository/org/apache/lucene/lucene-codecs/4.10-SNAPSHOT/maven-metadata-sonatype.releases.xml':
end tag name </body> must match start tag name <hr> from line 5 (position: TEXT
seen ...</center>\r\n</body>... @6:8) 
  org.apache.lucene:lucene-codecs:pom:4.10-SNAPSHOT


 for project org.apache.lucene:lucene-codecs
  org.apache.lucene:lucene-codecs:jar:4.10-SNAPSHOT

from the specified remote repositories:
  central (http://repo1.maven.org/maven2),
  sonatype.releases (http://oss.sonatype.org/content/repositories/releases),
  Nexus (http://repository.apache.org/snapshots)

Path to dependency: 
	1) org.apache.lucene:lucene-test-framework:jar:4.10-SNAPSHOT



Total time: 29 minutes 21 seconds
Build step 'Invoke Ant' marked build as failure
Recording test results
Email was triggered for: Failure
Sending email for trigger: Failure



Mime
View raw message