lucene-dev mailing list archives

Site index · List index
Message view « Date » · « Thread »
Top « Date » · « Thread »
From "david.w.smiley@gmail.com" <david.w.smi...@gmail.com>
Subject Re: [JENKINS] Lucene-Solr-trunk-MacOSX (64bit/jdk1.7.0) - Build # 1682 - Still Failing!
Date Tue, 01 Jul 2014 22:13:15 GMT
Another case of:
https://issues.apache.org/jira/browse/LUCENE-5713
(cause unknown)

~ David Smiley
Freelance Apache Lucene/Solr Search Consultant/Developer
http://www.linkedin.com/in/davidwsmiley


On Tue, Jul 1, 2014 at 6:08 PM, Policeman Jenkins Server <
jenkins@thetaphi.de> wrote:

> Build: http://jenkins.thetaphi.de/job/Lucene-Solr-trunk-MacOSX/1682/
> Java: 64bit/jdk1.7.0 -XX:-UseCompressedOops -XX:+UseG1GC
>
> 1 tests failed.
> FAILED:
>  org.apache.lucene.spatial.prefix.RandomSpatialOpFuzzyPrefixTreeTest.testDisjoint
> {#9 seed=[9DF0DFC458CE610C:BB57C3A241E5FB1A]}
>
> Error Message:
> CheckReader failed
>
> Stack Trace:
> java.lang.RuntimeException: CheckReader failed
>         at
> __randomizedtesting.SeedInfo.seed([9DF0DFC458CE610C:BB57C3A241E5FB1A]:0)
>         at org.apache.lucene.util.TestUtil.checkReader(TestUtil.java:240)
>         at org.apache.lucene.util.TestUtil.checkReader(TestUtil.java:218)
>         at
> org.apache.lucene.util.LuceneTestCase.newSearcher(LuceneTestCase.java:1598)
>         at
> org.apache.lucene.util.LuceneTestCase.newSearcher(LuceneTestCase.java:1572)
>         at
> org.apache.lucene.util.LuceneTestCase.newSearcher(LuceneTestCase.java:1564)
>         at
> org.apache.lucene.spatial.SpatialTestCase.commit(SpatialTestCase.java:131)
>         at
> org.apache.lucene.spatial.prefix.RandomSpatialOpFuzzyPrefixTreeTest.doTest(RandomSpatialOpFuzzyPrefixTreeTest.java:294)
>         at
> org.apache.lucene.spatial.prefix.RandomSpatialOpFuzzyPrefixTreeTest.testDisjoint(RandomSpatialOpFuzzyPrefixTreeTest.java:155)
>         at sun.reflect.NativeMethodAccessorImpl.invoke0(Native Method)
>         at
> sun.reflect.NativeMethodAccessorImpl.invoke(NativeMethodAccessorImpl.java:57)
>         at
> sun.reflect.DelegatingMethodAccessorImpl.invoke(DelegatingMethodAccessorImpl.java:43)
>         at java.lang.reflect.Method.invoke(Method.java:606)
>         at
> com.carrotsearch.randomizedtesting.RandomizedRunner.invoke(RandomizedRunner.java:1618)
>         at
> com.carrotsearch.randomizedtesting.RandomizedRunner$6.evaluate(RandomizedRunner.java:827)
>         at
> com.carrotsearch.randomizedtesting.RandomizedRunner$7.evaluate(RandomizedRunner.java:863)
>         at
> com.carrotsearch.randomizedtesting.RandomizedRunner$8.evaluate(RandomizedRunner.java:877)
>         at
> org.apache.lucene.util.TestRuleSetupTeardownChained$1.evaluate(TestRuleSetupTeardownChained.java:50)
>         at
> org.apache.lucene.util.AbstractBeforeAfterRule$1.evaluate(AbstractBeforeAfterRule.java:46)
>         at
> com.carrotsearch.randomizedtesting.rules.SystemPropertiesInvariantRule$1.evaluate(SystemPropertiesInvariantRule.java:55)
>         at
> org.apache.lucene.util.TestRuleThreadAndTestName$1.evaluate(TestRuleThreadAndTestName.java:49)
>         at
> org.apache.lucene.util.TestRuleIgnoreAfterMaxFailures$1.evaluate(TestRuleIgnoreAfterMaxFailures.java:65)
>         at
> org.apache.lucene.util.TestRuleMarkFailure$1.evaluate(TestRuleMarkFailure.java:48)
>         at
> com.carrotsearch.randomizedtesting.rules.StatementAdapter.evaluate(StatementAdapter.java:36)
>         at
> com.carrotsearch.randomizedtesting.ThreadLeakControl$StatementRunner.run(ThreadLeakControl.java:365)
>         at
> com.carrotsearch.randomizedtesting.ThreadLeakControl.forkTimeoutingTask(ThreadLeakControl.java:798)
>         at
> com.carrotsearch.randomizedtesting.ThreadLeakControl$3.evaluate(ThreadLeakControl.java:458)
>         at
> com.carrotsearch.randomizedtesting.RandomizedRunner.runSingleTest(RandomizedRunner.java:836)
>         at
> com.carrotsearch.randomizedtesting.RandomizedRunner$3.evaluate(RandomizedRunner.java:738)
>         at
> com.carrotsearch.randomizedtesting.RandomizedRunner$4.evaluate(RandomizedRunner.java:772)
>         at
> com.carrotsearch.randomizedtesting.RandomizedRunner$5.evaluate(RandomizedRunner.java:783)
>         at
> org.apache.lucene.util.AbstractBeforeAfterRule$1.evaluate(AbstractBeforeAfterRule.java:46)
>         at
> org.apache.lucene.util.TestRuleStoreClassName$1.evaluate(TestRuleStoreClassName.java:42)
>         at
> com.carrotsearch.randomizedtesting.rules.SystemPropertiesInvariantRule$1.evaluate(SystemPropertiesInvariantRule.java:55)
>         at
> com.carrotsearch.randomizedtesting.rules.NoShadowingOrOverridesOnMethodsRule$1.evaluate(NoShadowingOrOverridesOnMethodsRule.java:39)
>         at
> com.carrotsearch.randomizedtesting.rules.NoShadowingOrOverridesOnMethodsRule$1.evaluate(NoShadowingOrOverridesOnMethodsRule.java:39)
>         at
> com.carrotsearch.randomizedtesting.rules.StatementAdapter.evaluate(StatementAdapter.java:36)
>         at
> com.carrotsearch.randomizedtesting.rules.StatementAdapter.evaluate(StatementAdapter.java:36)
>         at
> com.carrotsearch.randomizedtesting.rules.StatementAdapter.evaluate(StatementAdapter.java:36)
>         at
> org.apache.lucene.util.TestRuleAssertionsRequired$1.evaluate(TestRuleAssertionsRequired.java:43)
>         at
> org.apache.lucene.util.TestRuleMarkFailure$1.evaluate(TestRuleMarkFailure.java:48)
>         at
> org.apache.lucene.util.TestRuleIgnoreAfterMaxFailures$1.evaluate(TestRuleIgnoreAfterMaxFailures.java:65)
>         at
> org.apache.lucene.util.TestRuleIgnoreTestSuites$1.evaluate(TestRuleIgnoreTestSuites.java:55)
>         at
> com.carrotsearch.randomizedtesting.rules.StatementAdapter.evaluate(StatementAdapter.java:36)
>         at
> com.carrotsearch.randomizedtesting.ThreadLeakControl$StatementRunner.run(ThreadLeakControl.java:365)
>         at java.lang.Thread.run(Thread.java:745)
>
>
>
>
> Build Log:
> [...truncated 9429 lines...]
>    [junit4] Suite:
> org.apache.lucene.spatial.prefix.RandomSpatialOpFuzzyPrefixTreeTest
>    [junit4]   1> Strategy:
> RecursivePrefixTreeStrategy(SPG:(GeohashPrefixTree(maxLevels:2,ctx:SpatialContext.GEO)))
>    [junit4]   1> Strategy:
> RecursivePrefixTreeStrategy(SPG:(QuadPrefixTree(maxLevels:3,ctx:SpatialContext{geo=false,
> calculator=CartesianDistCalc,
> worldBounds=Rect(minX=0.0,maxX=256.0,minY=-128.0,maxY=128.0)})))
>    [junit4]   1> Strategy:
> RecursivePrefixTreeStrategy(SPG:(GeohashPrefixTree(maxLevels:1,ctx:SpatialContext.GEO)),pruneLeafyBranches)
>    [junit4]   1> Strategy:
> RecursivePrefixTreeStrategy(SPG:(QuadPrefixTree(maxLevels:8,ctx:SpatialContext{geo=false,
> calculator=CartesianDistCalc,
> worldBounds=Rect(minX=0.0,maxX=256.0,minY=-128.0,maxY=128.0)})))
>    [junit4]   1> Strategy:
> RecursivePrefixTreeStrategy(SPG:(GeohashPrefixTree(maxLevels:3,ctx:SpatialContext.GEO)))
>    [junit4]   1> Strategy:
> RecursivePrefixTreeStrategy(SPG:(GeohashPrefixTree(maxLevels:2,ctx:SpatialContext.GEO)))
>    [junit4]   1> Strategy:
> RecursivePrefixTreeStrategy(SPG:(GeohashPrefixTree(maxLevels:3,ctx:SpatialContext.GEO)),pruneLeafyBranches)
>    [junit4]   1> Strategy:
> RecursivePrefixTreeStrategy(SPG:(GeohashPrefixTree(maxLevels:2,ctx:SpatialContext.GEO)))
>    [junit4]   1> Strategy:
> RecursivePrefixTreeStrategy(SPG:(GeohashPrefixTree(maxLevels:1,ctx:SpatialContext.GEO)),pruneLeafyBranches)
>    [junit4]   1> Strategy:
> RecursivePrefixTreeStrategy(SPG:(QuadPrefixTree(maxLevels:2,ctx:SpatialContext{geo=false,
> calculator=CartesianDistCalc,
> worldBounds=Rect(minX=0.0,maxX=256.0,minY=-128.0,maxY=128.0)})),pruneLeafyBranches)
>    [junit4]   1> CheckReader failed
>    [junit4]   1>     test: field norms.........OK [0 fields]
>    [junit4]   1>     test: terms, freq, prox...OK [19 terms; 21 terms/docs
> pairs; 0 tokens]
>    [junit4]   1>     test: stored fields.......OK [10 total field count;
> avg 2 fields per doc]
>    [junit4]   1>     test: term vectors........OK [0 total vector count;
> avg 0 term/freq vector fields per doc]
>    [junit4]   1>     test: docvalues...........ERROR [dv for field:
> RandomSpatialOpFuzzyPrefixTreeTest has -1 ord but is not marked missing for
> doc: 3]
>    [junit4]   1> java.lang.RuntimeException: dv for field:
> RandomSpatialOpFuzzyPrefixTreeTest has -1 ord but is not marked missing for
> doc: 3
>    [junit4]   1>        at
> org.apache.lucene.index.CheckIndex.checkSortedDocValues(CheckIndex.java:1416)
>    [junit4]   1>        at
> org.apache.lucene.index.CheckIndex.checkDocValues(CheckIndex.java:1560)
>    [junit4]   1>        at
> org.apache.lucene.index.CheckIndex.testDocValues(CheckIndex.java:1369)
>    [junit4]   1>        at
> org.apache.lucene.util.TestUtil.checkReader(TestUtil.java:231)
>    [junit4]   1>        at
> org.apache.lucene.util.TestUtil.checkReader(TestUtil.java:218)
>    [junit4]   1>        at
> org.apache.lucene.util.LuceneTestCase.newSearcher(LuceneTestCase.java:1598)
>    [junit4]   1>        at
> org.apache.lucene.util.LuceneTestCase.newSearcher(LuceneTestCase.java:1572)
>    [junit4]   1>        at
> org.apache.lucene.util.LuceneTestCase.newSearcher(LuceneTestCase.java:1564)
>    [junit4]   1>        at
> org.apache.lucene.spatial.SpatialTestCase.commit(SpatialTestCase.java:131)
>    [junit4]   1>        at
> org.apache.lucene.spatial.prefix.RandomSpatialOpFuzzyPrefixTreeTest.doTest(RandomSpatialOpFuzzyPrefixTreeTest.java:294)
>    [junit4]   1>        at
> org.apache.lucene.spatial.prefix.RandomSpatialOpFuzzyPrefixTreeTest.testDisjoint(RandomSpatialOpFuzzyPrefixTreeTest.java:155)
>    [junit4]   1>        at
> sun.reflect.NativeMethodAccessorImpl.invoke0(Native Method)
>    [junit4]   1>        at
> sun.reflect.NativeMethodAccessorImpl.invoke(NativeMethodAccessorImpl.java:57)
>    [junit4]   1>        at
> sun.reflect.DelegatingMethodAccessorImpl.invoke(DelegatingMethodAccessorImpl.java:43)
>    [junit4]   1>        at java.lang.reflect.Method.invoke(Method.java:606)
>    [junit4]   1>        at
> com.carrotsearch.randomizedtesting.RandomizedRunner.invoke(RandomizedRunner.java:1618)
>    [junit4]   1>        at
> com.carrotsearch.randomizedtesting.RandomizedRunner$6.evaluate(RandomizedRunner.java:827)
>    [junit4]   1>        at
> com.carrotsearch.randomizedtesting.RandomizedRunner$7.evaluate(RandomizedRunner.java:863)
>    [junit4]   1>        at
> com.carrotsearch.randomizedtesting.RandomizedRunner$8.evaluate(RandomizedRunner.java:877)
>    [junit4]   1>        at
> org.apache.lucene.util.TestRuleSetupTeardownChained$1.evaluate(TestRuleSetupTeardownChained.java:50)
>    [junit4]   1>        at
> org.apache.lucene.util.AbstractBeforeAfterRule$1.evaluate(AbstractBeforeAfterRule.java:46)
>    [junit4]   1>        at
> com.carrotsearch.randomizedtesting.rules.SystemPropertiesInvariantRule$1.evaluate(SystemPropertiesInvariantRule.java:55)
>    [junit4]   1>        at
> org.apache.lucene.util.TestRuleThreadAndTestName$1.evaluate(TestRuleThreadAndTestName.java:49)
>    [junit4]   1>        at
> org.apache.lucene.util.TestRuleIgnoreAfterMaxFailures$1.evaluate(TestRuleIgnoreAfterMaxFailures.java:65)
>    [junit4]   1>        at
> org.apache.lucene.util.TestRuleMarkFailure$1.evaluate(TestRuleMarkFailure.java:48)
>    [junit4]   1>        at
> com.carrotsearch.randomizedtesting.rules.StatementAdapter.evaluate(StatementAdapter.java:36)
>    [junit4]   1>        at
> com.carrotsearch.randomizedtesting.ThreadLeakControl$StatementRunner.run(ThreadLeakControl.java:365)
>    [junit4]   1>        at
> com.carrotsearch.randomizedtesting.ThreadLeakControl.forkTimeoutingTask(ThreadLeakControl.java:798)
>    [junit4]   1>        at
> com.carrotsearch.randomizedtesting.ThreadLeakControl$3.evaluate(ThreadLeakControl.java:458)
>    [junit4]   1>        at
> com.carrotsearch.randomizedtesting.RandomizedRunner.runSingleTest(RandomizedRunner.java:836)
>    [junit4]   1>        at
> com.carrotsearch.randomizedtesting.RandomizedRunner$3.evaluate(RandomizedRunner.java:738)
>    [junit4]   1>        at
> com.carrotsearch.randomizedtesting.RandomizedRunner$4.evaluate(RandomizedRunner.java:772)
>    [junit4]   1>        at
> com.carrotsearch.randomizedtesting.RandomizedRunner$5.evaluate(RandomizedRunner.java:783)
>    [junit4]   1>        at
> org.apache.lucene.util.AbstractBeforeAfterRule$1.evaluate(AbstractBeforeAfterRule.java:46)
>    [junit4]   1>        at
> org.apache.lucene.util.TestRuleStoreClassName$1.evaluate(TestRuleStoreClassName.java:42)
>    [junit4]   1>        at
> com.carrotsearch.randomizedtesting.rules.SystemPropertiesInvariantRule$1.evaluate(SystemPropertiesInvariantRule.java:55)
>    [junit4]   1>        at
> com.carrotsearch.randomizedtesting.rules.NoShadowingOrOverridesOnMethodsRule$1.evaluate(NoShadowingOrOverridesOnMethodsRule.java:39)
>    [junit4]   1>        at
> com.carrotsearch.randomizedtesting.rules.NoShadowingOrOverridesOnMethodsRule$1.evaluate(NoShadowingOrOverridesOnMethodsRule.java:39)
>    [junit4]   1>        at
> com.carrotsearch.randomizedtesting.rules.StatementAdapter.evaluate(StatementAdapter.java:36)
>    [junit4]   1>        at
> com.carrotsearch.randomizedtesting.rules.StatementAdapter.evaluate(StatementAdapter.java:36)
>    [junit4]   1>        at
> com.carrotsearch.randomizedtesting.rules.StatementAdapter.evaluate(StatementAdapter.java:36)
>    [junit4]   1>        at
> org.apache.lucene.util.TestRuleAssertionsRequired$1.evaluate(TestRuleAssertionsRequired.java:43)
>    [junit4]   1>        at
> org.apache.lucene.util.TestRuleMarkFailure$1.evaluate(TestRuleMarkFailure.java:48)
>    [junit4]   1>        at
> org.apache.lucene.util.TestRuleIgnoreAfterMaxFailures$1.evaluate(TestRuleIgnoreAfterMaxFailures.java:65)
>    [junit4]   1>        at
> org.apache.lucene.util.TestRuleIgnoreTestSuites$1.evaluate(TestRuleIgnoreTestSuites.java:55)
>    [junit4]   1>        at
> com.carrotsearch.randomizedtesting.rules.StatementAdapter.evaluate(StatementAdapter.java:36)
>    [junit4]   1>        at
> com.carrotsearch.randomizedtesting.ThreadLeakControl$StatementRunner.run(ThreadLeakControl.java:365)
>    [junit4]   1>        at java.lang.Thread.run(Thread.java:745)
>    [junit4]   1>
>    [junit4]   2> NOTE: reproduce with: ant test
>  -Dtestcase=RandomSpatialOpFuzzyPrefixTreeTest -Dtests.method=testDisjoint
> -Dtests.seed=9DF0DFC458CE610C -Dtests.slow=true -Dtests.locale=sr_CS
> -Dtests.timezone=Europe/Ljubljana -Dtests.file.encoding=ISO-8859-1
>    [junit4] ERROR   0.14s |
> RandomSpatialOpFuzzyPrefixTreeTest.testDisjoint {#9
> seed=[9DF0DFC458CE610C:BB57C3A241E5FB1A]} <<<
>    [junit4]    > Throwable #1: java.lang.RuntimeException: CheckReader
> failed
>    [junit4]    >        at
> __randomizedtesting.SeedInfo.seed([9DF0DFC458CE610C:BB57C3A241E5FB1A]:0)
>    [junit4]    >        at
> org.apache.lucene.util.TestUtil.checkReader(TestUtil.java:240)
>    [junit4]    >        at
> org.apache.lucene.util.TestUtil.checkReader(TestUtil.java:218)
>    [junit4]    >        at
> org.apache.lucene.util.LuceneTestCase.newSearcher(LuceneTestCase.java:1598)
>    [junit4]    >        at
> org.apache.lucene.util.LuceneTestCase.newSearcher(LuceneTestCase.java:1572)
>    [junit4]    >        at
> org.apache.lucene.util.LuceneTestCase.newSearcher(LuceneTestCase.java:1564)
>    [junit4]    >        at
> org.apache.lucene.spatial.SpatialTestCase.commit(SpatialTestCase.java:131)
>    [junit4]    >        at
> org.apache.lucene.spatial.prefix.RandomSpatialOpFuzzyPrefixTreeTest.doTest(RandomSpatialOpFuzzyPrefixTreeTest.java:294)
>    [junit4]    >        at
> org.apache.lucene.spatial.prefix.RandomSpatialOpFuzzyPrefixTreeTest.testDisjoint(RandomSpatialOpFuzzyPrefixTreeTest.java:155)
>    [junit4]    >        at java.lang.Thread.run(Thread.java:745)
>    [junit4]   1> Strategy:
> RecursivePrefixTreeStrategy(SPG:(GeohashPrefixTree(maxLevels:3,ctx:SpatialContext.GEO)))
>    [junit4]   1> Strategy:
> RecursivePrefixTreeStrategy(SPG:(QuadPrefixTree(maxLevels:4,ctx:SpatialContext{geo=false,
> calculator=CartesianDistCalc,
> worldBounds=Rect(minX=0.0,maxX=256.0,minY=-128.0,maxY=128.0)})),pruneLeafyBranches)
>    [junit4]   1> Strategy:
> RecursivePrefixTreeStrategy(SPG:(GeohashPrefixTree(maxLevels:2,ctx:SpatialContext.GEO)))
>    [junit4]   1> Strategy:
> RecursivePrefixTreeStrategy(SPG:(QuadPrefixTree(maxLevels:5,ctx:SpatialContext{geo=false,
> calculator=CartesianDistCalc,
> worldBounds=Rect(minX=0.0,maxX=256.0,minY=-128.0,maxY=128.0)})))
>    [junit4]   1> Strategy:
> RecursivePrefixTreeStrategy(SPG:(QuadPrefixTree(maxLevels:5,ctx:SpatialContext{geo=false,
> calculator=CartesianDistCalc,
> worldBounds=Rect(minX=0.0,maxX=256.0,minY=-128.0,maxY=128.0)})))
>    [junit4]   1> Strategy:
> RecursivePrefixTreeStrategy(SPG:(QuadPrefixTree(maxLevels:8,ctx:SpatialContext{geo=false,
> calculator=CartesianDistCalc,
> worldBounds=Rect(minX=0.0,maxX=256.0,minY=-128.0,maxY=128.0)})),pruneLeafyBranches)
>    [junit4]   1> Strategy:
> RecursivePrefixTreeStrategy(SPG:(QuadPrefixTree(maxLevels:1,ctx:SpatialContext{geo=false,
> calculator=CartesianDistCalc,
> worldBounds=Rect(minX=0.0,maxX=256.0,minY=-128.0,maxY=128.0)})),pruneLeafyBranches)
>    [junit4]   1> Strategy:
> RecursivePrefixTreeStrategy(SPG:(QuadPrefixTree(maxLevels:2,ctx:SpatialContext{geo=false,
> calculator=CartesianDistCalc,
> worldBounds=Rect(minX=0.0,maxX=256.0,minY=-128.0,maxY=128.0)})),pruneLeafyBranches)
>    [junit4]   1> Strategy:
> RecursivePrefixTreeStrategy(SPG:(GeohashPrefixTree(maxLevels:1,ctx:SpatialContext.GEO)))
>    [junit4]   1> Strategy:
> RecursivePrefixTreeStrategy(SPG:(QuadPrefixTree(maxLevels:2,ctx:SpatialContext{geo=false,
> calculator=CartesianDistCalc,
> worldBounds=Rect(minX=0.0,maxX=256.0,minY=-128.0,maxY=128.0)})))
>    [junit4]   1> Strategy:
> RecursivePrefixTreeStrategy(SPG:(GeohashPrefixTree(maxLevels:2,ctx:SpatialContext.GEO)))
>    [junit4]   1> Strategy:
> RecursivePrefixTreeStrategy(SPG:(GeohashPrefixTree(maxLevels:3,ctx:SpatialContext.GEO)))
>    [junit4]   1> Strategy:
> RecursivePrefixTreeStrategy(SPG:(QuadPrefixTree(maxLevels:6,ctx:SpatialContext{geo=false,
> calculator=CartesianDistCalc,
> worldBounds=Rect(minX=0.0,maxX=256.0,minY=-128.0,maxY=128.0)})),pruneLeafyBranches)
>    [junit4]   1> Strategy:
> RecursivePrefixTreeStrategy(SPG:(QuadPrefixTree(maxLevels:1,ctx:SpatialContext{geo=false,
> calculator=CartesianDistCalc,
> worldBounds=Rect(minX=0.0,maxX=256.0,minY=-128.0,maxY=128.0)})),pruneLeafyBranches)
>    [junit4]   1> Strategy:
> RecursivePrefixTreeStrategy(SPG:(GeohashPrefixTree(maxLevels:1,ctx:SpatialContext.GEO)),pruneLeafyBranches)
>    [junit4]   1> Strategy:
> RecursivePrefixTreeStrategy(SPG:(QuadPrefixTree(maxLevels:2,ctx:SpatialContext{geo=false,
> calculator=CartesianDistCalc,
> worldBounds=Rect(minX=0.0,maxX=256.0,minY=-128.0,maxY=128.0)})))
>    [junit4]   1> Strategy:
> RecursivePrefixTreeStrategy(SPG:(QuadPrefixTree(maxLevels:8,ctx:SpatialContext{geo=false,
> calculator=CartesianDistCalc,
> worldBounds=Rect(minX=0.0,maxX=256.0,minY=-128.0,maxY=128.0)})))
>    [junit4]   1> Strategy:
> RecursivePrefixTreeStrategy(SPG:(QuadPrefixTree(maxLevels:4,ctx:SpatialContext{geo=false,
> calculator=CartesianDistCalc,
> worldBounds=Rect(minX=0.0,maxX=256.0,minY=-128.0,maxY=128.0)})),pruneLeafyBranches)
>    [junit4]   1> Strategy:
> RecursivePrefixTreeStrategy(SPG:(GeohashPrefixTree(maxLevels:1,ctx:SpatialContext.GEO)))
>    [junit4]   1> Strategy:
> RecursivePrefixTreeStrategy(SPG:(GeohashPrefixTree(maxLevels:1,ctx:SpatialContext.GEO)))
>    [junit4]   1> Strategy:
> RecursivePrefixTreeStrategy(SPG:(GeohashPrefixTree(maxLevels:2,ctx:SpatialContext.GEO)),pruneLeafyBranches)
>    [junit4]   1> Strategy:
> RecursivePrefixTreeStrategy(SPG:(GeohashPrefixTree(maxLevels:1,ctx:SpatialContext.GEO)))
>    [junit4]   1> Strategy:
> RecursivePrefixTreeStrategy(SPG:(QuadPrefixTree(maxLevels:7,ctx:SpatialContext{geo=false,
> calculator=CartesianDistCalc,
> worldBounds=Rect(minX=0.0,maxX=256.0,minY=-128.0,maxY=128.0)})))
>    [junit4]   1> Strategy:
> RecursivePrefixTreeStrategy(SPG:(QuadPrefixTree(maxLevels:3,ctx:SpatialContext{geo=false,
> calculator=CartesianDistCalc,
> worldBounds=Rect(minX=0.0,maxX=256.0,minY=-128.0,maxY=128.0)})))
>    [junit4]   1> Strategy:
> RecursivePrefixTreeStrategy(SPG:(GeohashPrefixTree(maxLevels:3,ctx:SpatialContext.GEO)),pruneLeafyBranches)
>    [junit4]   1> Strategy:
> RecursivePrefixTreeStrategy(SPG:(GeohashPrefixTree(maxLevels:2,ctx:SpatialContext.GEO)))
>    [junit4]   1> Strategy:
> RecursivePrefixTreeStrategy(SPG:(GeohashPrefixTree(maxLevels:1,ctx:SpatialContext.GEO)),pruneLeafyBranches)
>    [junit4]   1> Strategy:
> RecursivePrefixTreeStrategy(SPG:(GeohashPrefixTree(maxLevels:2,ctx:SpatialContext.GEO)))
>    [junit4]   1> Strategy:
> RecursivePrefixTreeStrategy(SPG:(GeohashPrefixTree(maxLevels:3,ctx:SpatialContext.GEO)))
>    [junit4]   1> Strategy:
> RecursivePrefixTreeStrategy(SPG:(GeohashPrefixTree(maxLevels:3,ctx:SpatialContext.GEO)),pruneLeafyBranches)
>    [junit4]   2> NOTE: test params are: codec=Lucene45,
> sim=RandomSimilarityProvider(queryNorm=true,coord=no): {}, locale=sr_CS,
> timezone=Europe/Ljubljana
>    [junit4]   2> NOTE: Mac OS X 10.8.5 x86_64/Oracle Corporation 1.7.0_60
> (64-bit)/cpus=2,threads=1,free=400611816,total=526385152
>    [junit4]   2> NOTE: All tests run in this JVM: [SpatialArgsParserTest,
> PortedSolr3Test, SpatialPrefixTreeTest, DateRangePrefixTreeTest,
> QueryEqualsHashCodeTest, TestBBoxStrategy, JtsPolygonTest,
> TestRecursivePrefixTreeStrategy, TestPointVectorStrategy,
> TestTestFramework, DistanceStrategyTest, TestTermQueryPrefixGridStrategy,
> DateNRStrategyTest, RandomSpatialOpFuzzyPrefixTreeTest]
>    [junit4] Completed in 3.62s, 44 tests, 1 error <<< FAILURES!
>
> [...truncated 12 lines...]
> BUILD FAILED
> /Users/jenkins/workspace/Lucene-Solr-trunk-MacOSX/build.xml:467: The
> following error occurred while executing this line:
> /Users/jenkins/workspace/Lucene-Solr-trunk-MacOSX/build.xml:447: The
> following error occurred while executing this line:
> /Users/jenkins/workspace/Lucene-Solr-trunk-MacOSX/build.xml:45: The
> following error occurred while executing this line:
> /Users/jenkins/workspace/Lucene-Solr-trunk-MacOSX/extra-targets.xml:37:
> The following error occurred while executing this line:
> /Users/jenkins/workspace/Lucene-Solr-trunk-MacOSX/lucene/build.xml:544:
> The following error occurred while executing this line:
> /Users/jenkins/workspace/Lucene-Solr-trunk-MacOSX/lucene/common-build.xml:2019:
> The following error occurred while executing this line:
> /Users/jenkins/workspace/Lucene-Solr-trunk-MacOSX/lucene/module-build.xml:60:
> The following error occurred while executing this line:
> /Users/jenkins/workspace/Lucene-Solr-trunk-MacOSX/lucene/common-build.xml:1298:
> The following error occurred while executing this line:
> /Users/jenkins/workspace/Lucene-Solr-trunk-MacOSX/lucene/common-build.xml:922:
> There were test failures: 16 suites, 126 tests, 1 error, 13 ignored (2
> assumptions)
>
> Total time: 42 minutes 45 seconds
> Build step 'Invoke Ant' marked build as failure
> Description set: Java: 64bit/jdk1.7.0 -XX:-UseCompressedOops -XX:+UseG1GC
> Archiving artifacts
> Recording test results
> Email was triggered for: Failure - Any
> Sending email for trigger: Failure - Any
>
>
>
>
> ---------------------------------------------------------------------
> To unsubscribe, e-mail: dev-unsubscribe@lucene.apache.org
> For additional commands, e-mail: dev-help@lucene.apache.org
>

Mime
View raw message