lucene-dev mailing list archives

Site index · List index
Message view « Date » · « Thread »
Top « Date » · « Thread »
From Shalin Shekhar Mangar <shalinman...@gmail.com>
Subject Re: [JENKINS-MAVEN] Lucene-Solr-Maven-trunk #1162: POMs out of sync
Date Sat, 05 Jul 2014 20:24:26 GMT
I have increased the timeout for MultiThreadedOCPTest to 90 seconds from 30
seconds.


On Sat, Jul 5, 2014 at 10:55 PM, Apache Jenkins Server <
jenkins@builds.apache.org> wrote:

> Build: https://builds.apache.org/job/Lucene-Solr-Maven-trunk/1162/
>
> 4 tests failed.
> REGRESSION:
>  org.apache.solr.cloud.ChaosMonkeyNothingIsSafeTest.testDistribSearch
>
> Error Message:
> No registered leader was found after waiting for 30000ms , collection:
> collection1 slice: shard1
>
> Stack Trace:
> org.apache.solr.common.SolrException: No registered leader was found after
> waiting for 30000ms , collection: collection1 slice: shard1
>         at
> __randomizedtesting.SeedInfo.seed([B8CA289EBBEC5636:392CA686CCB3360A]:0)
>         at
> org.apache.solr.common.cloud.ZkStateReader.getLeaderRetry(ZkStateReader.java:567)
>         at
> org.apache.solr.cloud.ChaosMonkeyNothingIsSafeTest.doTest(ChaosMonkeyNothingIsSafeTest.java:203)
>
>
> REGRESSION:  org.apache.solr.cloud.HttpPartitionTest.testDistribSearch
>
> Error Message:
> No registered leader was found after waiting for 60000ms , collection:
> c8n_1x3_lf slice: shard1
>
> Stack Trace:
> org.apache.solr.common.SolrException: No registered leader was found after
> waiting for 60000ms , collection: c8n_1x3_lf slice: shard1
>         at
> __randomizedtesting.SeedInfo.seed([EF8FD670B47ABA7A:6E695868C325DA46]:0)
>         at
> org.apache.solr.common.cloud.ZkStateReader.getLeaderRetry(ZkStateReader.java:567)
>         at
> org.apache.solr.cloud.HttpPartitionTest.testRf3WithLeaderFailover(HttpPartitionTest.java:349)
>         at
> org.apache.solr.cloud.HttpPartitionTest.doTest(HttpPartitionTest.java:148)
>
>
> REGRESSION:
>  org.apache.solr.client.solrj.embedded.SolrExampleStreamingTest.testChildDoctransformer
>
> Error Message:
> java.lang.AssertionError
>
> Stack Trace:
> org.apache.solr.client.solrj.impl.HttpSolrServer$RemoteSolrException:
> java.lang.AssertionError
>         at
> __randomizedtesting.SeedInfo.seed([88AD3474D0CE355F:FB772BEE5CD64259]:0)
>         at
> org.apache.solr.client.solrj.impl.HttpSolrServer.executeMethod(HttpSolrServer.java:554)
>         at
> org.apache.solr.client.solrj.impl.HttpSolrServer.request(HttpSolrServer.java:210)
>         at
> org.apache.solr.client.solrj.impl.HttpSolrServer.request(HttpSolrServer.java:206)
>         at
> org.apache.solr.client.solrj.impl.ConcurrentUpdateSolrServer.request(ConcurrentUpdateSolrServer.java:280)
>         at
> org.apache.solr.client.solrj.request.QueryRequest.process(QueryRequest.java:91)
>         at
> org.apache.solr.client.solrj.SolrServer.query(SolrServer.java:301)
>         at
> org.apache.solr.client.solrj.SolrExampleTests.testChildDoctransformer(SolrExampleTests.java:1373)
>         at sun.reflect.NativeMethodAccessorImpl.invoke0(Native Method)
>         at
> sun.reflect.NativeMethodAccessorImpl.invoke(NativeMethodAccessorImpl.java:57)
>         at
> sun.reflect.DelegatingMethodAccessorImpl.invoke(DelegatingMethodAccessorImpl.java:43)
>         at java.lang.reflect.Method.invoke(Method.java:606)
>         at
> com.carrotsearch.randomizedtesting.RandomizedRunner.invoke(RandomizedRunner.java:1618)
>         at
> com.carrotsearch.randomizedtesting.RandomizedRunner$6.evaluate(RandomizedRunner.java:827)
>         at
> com.carrotsearch.randomizedtesting.RandomizedRunner$7.evaluate(RandomizedRunner.java:863)
>         at
> com.carrotsearch.randomizedtesting.RandomizedRunner$8.evaluate(RandomizedRunner.java:877)
>         at
> com.carrotsearch.randomizedtesting.rules.SystemPropertiesRestoreRule$1.evaluate(SystemPropertiesRestoreRule.java:53)
>         at
> org.apache.lucene.util.TestRuleSetupTeardownChained$1.evaluate(TestRuleSetupTeardownChained.java:50)
>         at
> org.apache.lucene.util.AbstractBeforeAfterRule$1.evaluate(AbstractBeforeAfterRule.java:46)
>         at
> com.carrotsearch.randomizedtesting.rules.SystemPropertiesInvariantRule$1.evaluate(SystemPropertiesInvariantRule.java:55)
>         at
> org.apache.lucene.util.TestRuleThreadAndTestName$1.evaluate(TestRuleThreadAndTestName.java:49)
>         at
> org.apache.lucene.util.TestRuleIgnoreAfterMaxFailures$1.evaluate(TestRuleIgnoreAfterMaxFailures.java:65)
>         at
> org.apache.lucene.util.TestRuleMarkFailure$1.evaluate(TestRuleMarkFailure.java:48)
>         at
> com.carrotsearch.randomizedtesting.rules.StatementAdapter.evaluate(StatementAdapter.java:36)
>         at
> com.carrotsearch.randomizedtesting.ThreadLeakControl$StatementRunner.run(ThreadLeakControl.java:365)
>         at
> com.carrotsearch.randomizedtesting.ThreadLeakControl.forkTimeoutingTask(ThreadLeakControl.java:798)
>         at
> com.carrotsearch.randomizedtesting.ThreadLeakControl$3.evaluate(ThreadLeakControl.java:458)
>         at
> com.carrotsearch.randomizedtesting.RandomizedRunner.runSingleTest(RandomizedRunner.java:836)
>         at
> com.carrotsearch.randomizedtesting.RandomizedRunner$3.evaluate(RandomizedRunner.java:738)
>         at
> com.carrotsearch.randomizedtesting.RandomizedRunner$4.evaluate(RandomizedRunner.java:772)
>         at
> com.carrotsearch.randomizedtesting.RandomizedRunner$5.evaluate(RandomizedRunner.java:783)
>         at
> com.carrotsearch.randomizedtesting.rules.StatementAdapter.evaluate(StatementAdapter.java:36)
>         at
> com.carrotsearch.randomizedtesting.rules.SystemPropertiesRestoreRule$1.evaluate(SystemPropertiesRestoreRule.java:53)
>         at
> org.apache.lucene.util.AbstractBeforeAfterRule$1.evaluate(AbstractBeforeAfterRule.java:46)
>         at
> org.apache.lucene.util.TestRuleStoreClassName$1.evaluate(TestRuleStoreClassName.java:42)
>         at
> com.carrotsearch.randomizedtesting.rules.SystemPropertiesInvariantRule$1.evaluate(SystemPropertiesInvariantRule.java:55)
>         at
> com.carrotsearch.randomizedtesting.rules.NoShadowingOrOverridesOnMethodsRule$1.evaluate(NoShadowingOrOverridesOnMethodsRule.java:39)
>         at
> com.carrotsearch.randomizedtesting.rules.NoShadowingOrOverridesOnMethodsRule$1.evaluate(NoShadowingOrOverridesOnMethodsRule.java:39)
>         at
> com.carrotsearch.randomizedtesting.rules.StatementAdapter.evaluate(StatementAdapter.java:36)
>         at
> com.carrotsearch.randomizedtesting.rules.StatementAdapter.evaluate(StatementAdapter.java:36)
>         at
> com.carrotsearch.randomizedtesting.rules.StatementAdapter.evaluate(StatementAdapter.java:36)
>         at
> org.apache.lucene.util.TestRuleAssertionsRequired$1.evaluate(TestRuleAssertionsRequired.java:43)
>         at
> org.apache.lucene.util.TestRuleMarkFailure$1.evaluate(TestRuleMarkFailure.java:48)
>         at
> org.apache.lucene.util.TestRuleIgnoreAfterMaxFailures$1.evaluate(TestRuleIgnoreAfterMaxFailures.java:65)
>         at
> org.apache.lucene.util.TestRuleIgnoreTestSuites$1.evaluate(TestRuleIgnoreTestSuites.java:55)
>         at
> com.carrotsearch.randomizedtesting.rules.StatementAdapter.evaluate(StatementAdapter.java:36)
>         at
> com.carrotsearch.randomizedtesting.ThreadLeakControl$StatementRunner.run(ThreadLeakControl.java:365)
>         at java.lang.Thread.run(Thread.java:745)
>
>
> FAILED:  org.apache.solr.cloud.MultiThreadedOCPTest.testDistribSearch
>
> Error Message:
> Task 3002 did not complete, final state: running
>
> Stack Trace:
> java.lang.AssertionError: Task 3002 did not complete, final state: running
>         at
> __randomizedtesting.SeedInfo.seed([F217ACDF9EE8AEF8:73F122C7E9B7CEC4]:0)
>         at org.junit.Assert.fail(Assert.java:93)
>         at org.junit.Assert.assertTrue(Assert.java:43)
>         at
> org.apache.solr.cloud.MultiThreadedOCPTest.testDeduplicationOfSubmittedTasks(MultiThreadedOCPTest.java:161)
>         at
> org.apache.solr.cloud.MultiThreadedOCPTest.doTest(MultiThreadedOCPTest.java:70)
>
>
>
>
> Build Log:
> [...truncated 54903 lines...]
> BUILD FAILED
> /usr/home/hudson/hudson-slave/workspace/Lucene-Solr-Maven-trunk/build.xml:490:
> The following error occurred while executing this line:
> /usr/home/hudson/hudson-slave/workspace/Lucene-Solr-Maven-trunk/build.xml:182:
> The following error occurred while executing this line:
> /usr/home/hudson/hudson-slave/workspace/Lucene-Solr-Maven-trunk/extra-targets.xml:77:
> Java returned: 1
>
> Total time: 173 minutes 35 seconds
> Build step 'Invoke Ant' marked build as failure
> Recording test results
> Email was triggered for: Failure
> Sending email for trigger: Failure
>
>
>
>
> ---------------------------------------------------------------------
> To unsubscribe, e-mail: dev-unsubscribe@lucene.apache.org
> For additional commands, e-mail: dev-help@lucene.apache.org
>



-- 
Regards,
Shalin Shekhar Mangar.

Mime
View raw message