lucene-dev mailing list archives

Site index · List index
Message view « Date » · « Thread »
Top « Date » · « Thread »
From Robert Muir <rcm...@gmail.com>
Subject Re: [JENKINS] Lucene-trunk-Linux-Java7-64-test-only - Build # 88910 - Failure!
Date Tue, 01 Jul 2014 16:52:35 GMT
I committed a fix.

On Tue, Jul 1, 2014 at 8:37 AM, Robert Muir <rcmuir@gmail.com> wrote:
> one of these guys (either that stringunion automaton, or the "naive"
> one), isnt really deterministic and has transitions to dead states.
>
> On Tue, Jul 1, 2014 at 8:20 AM,  <builder@flonkings.com> wrote:
>> Build: builds.flonkings.com/job/Lucene-trunk-Linux-Java7-64-test-only/88910/
>>
>> 1 tests failed.
>> REGRESSION:  org.apache.lucene.util.automaton.TestOperations.testStringUnion
>>
>> Error Message:
>>
>>
>> Stack Trace:
>> java.lang.AssertionError
>>         at __randomizedtesting.SeedInfo.seed([5B10EDB8D55580F8:57D561ED8F9CA461]:0)
>>         at org.apache.lucene.util.automaton.Operations.subsetOf(Operations.java:414)
>>         at org.apache.lucene.util.automaton.Operations.sameLanguage(Operations.java:367)
>>         at org.apache.lucene.util.automaton.TestOperations.testStringUnion(TestOperations.java:37)
>>         at sun.reflect.NativeMethodAccessorImpl.invoke0(Native Method)
>>         at sun.reflect.NativeMethodAccessorImpl.invoke(NativeMethodAccessorImpl.java:57)
>>         at sun.reflect.DelegatingMethodAccessorImpl.invoke(DelegatingMethodAccessorImpl.java:43)
>>         at java.lang.reflect.Method.invoke(Method.java:606)
>>         at com.carrotsearch.randomizedtesting.RandomizedRunner.invoke(RandomizedRunner.java:1618)
>>         at com.carrotsearch.randomizedtesting.RandomizedRunner$6.evaluate(RandomizedRunner.java:827)
>>         at com.carrotsearch.randomizedtesting.RandomizedRunner$7.evaluate(RandomizedRunner.java:863)
>>         at com.carrotsearch.randomizedtesting.RandomizedRunner$8.evaluate(RandomizedRunner.java:877)
>>         at org.apache.lucene.util.TestRuleSetupTeardownChained$1.evaluate(TestRuleSetupTeardownChained.java:50)
>>         at org.apache.lucene.util.AbstractBeforeAfterRule$1.evaluate(AbstractBeforeAfterRule.java:46)
>>         at com.carrotsearch.randomizedtesting.rules.SystemPropertiesInvariantRule$1.evaluate(SystemPropertiesInvariantRule.java:55)
>>         at org.apache.lucene.util.TestRuleThreadAndTestName$1.evaluate(TestRuleThreadAndTestName.java:49)
>>         at org.apache.lucene.util.TestRuleIgnoreAfterMaxFailures$1.evaluate(TestRuleIgnoreAfterMaxFailures.java:65)
>>         at org.apache.lucene.util.TestRuleMarkFailure$1.evaluate(TestRuleMarkFailure.java:48)
>>         at com.carrotsearch.randomizedtesting.rules.StatementAdapter.evaluate(StatementAdapter.java:36)
>>         at com.carrotsearch.randomizedtesting.ThreadLeakControl$StatementRunner.run(ThreadLeakControl.java:365)
>>         at com.carrotsearch.randomizedtesting.ThreadLeakControl.forkTimeoutingTask(ThreadLeakControl.java:798)
>>         at com.carrotsearch.randomizedtesting.ThreadLeakControl$3.evaluate(ThreadLeakControl.java:458)
>>         at com.carrotsearch.randomizedtesting.RandomizedRunner.runSingleTest(RandomizedRunner.java:836)
>>         at com.carrotsearch.randomizedtesting.RandomizedRunner$3.evaluate(RandomizedRunner.java:738)
>>         at com.carrotsearch.randomizedtesting.RandomizedRunner$4.evaluate(RandomizedRunner.java:772)
>>         at com.carrotsearch.randomizedtesting.RandomizedRunner$5.evaluate(RandomizedRunner.java:783)
>>         at org.apache.lucene.util.AbstractBeforeAfterRule$1.evaluate(AbstractBeforeAfterRule.java:46)
>>         at org.apache.lucene.util.TestRuleStoreClassName$1.evaluate(TestRuleStoreClassName.java:42)
>>         at com.carrotsearch.randomizedtesting.rules.SystemPropertiesInvariantRule$1.evaluate(SystemPropertiesInvariantRule.java:55)
>>         at com.carrotsearch.randomizedtesting.rules.NoShadowingOrOverridesOnMethodsRule$1.evaluate(NoShadowingOrOverridesOnMethodsRule.java:39)
>>         at com.carrotsearch.randomizedtesting.rules.NoShadowingOrOverridesOnMethodsRule$1.evaluate(NoShadowingOrOverridesOnMethodsRule.java:39)
>>         at com.carrotsearch.randomizedtesting.rules.StatementAdapter.evaluate(StatementAdapter.java:36)
>>         at com.carrotsearch.randomizedtesting.rules.StatementAdapter.evaluate(StatementAdapter.java:36)
>>         at com.carrotsearch.randomizedtesting.rules.StatementAdapter.evaluate(StatementAdapter.java:36)
>>         at org.apache.lucene.util.TestRuleAssertionsRequired$1.evaluate(TestRuleAssertionsRequired.java:43)
>>         at org.apache.lucene.util.TestRuleMarkFailure$1.evaluate(TestRuleMarkFailure.java:48)
>>         at org.apache.lucene.util.TestRuleIgnoreAfterMaxFailures$1.evaluate(TestRuleIgnoreAfterMaxFailures.java:65)
>>         at org.apache.lucene.util.TestRuleIgnoreTestSuites$1.evaluate(TestRuleIgnoreTestSuites.java:55)
>>         at com.carrotsearch.randomizedtesting.rules.StatementAdapter.evaluate(StatementAdapter.java:36)
>>         at com.carrotsearch.randomizedtesting.ThreadLeakControl$StatementRunner.run(ThreadLeakControl.java:365)
>>         at java.lang.Thread.run(Thread.java:745)
>>
>>
>>
>>
>> Build Log:
>> [...truncated 263 lines...]
>>    [junit4] Suite: org.apache.lucene.util.automaton.TestOperations
>>    [junit4]   2> NOTE: reproduce with: ant test  -Dtestcase=TestOperations -Dtests.method=testStringUnion
-Dtests.seed=5B10EDB8D55580F8 -Dtests.slow=true -Dtests.locale=en_SG -Dtests.timezone=CTT
-Dtests.file.encoding=UTF-8
>>    [junit4] FAILURE 0.21s J4 | TestOperations.testStringUnion <<<
>>    [junit4]    > Throwable #1: java.lang.AssertionError
>>    [junit4]    >        at __randomizedtesting.SeedInfo.seed([5B10EDB8D55580F8:57D561ED8F9CA461]:0)
>>    [junit4]    >        at org.apache.lucene.util.automaton.Operations.subsetOf(Operations.java:414)
>>    [junit4]    >        at org.apache.lucene.util.automaton.Operations.sameLanguage(Operations.java:367)
>>    [junit4]    >        at org.apache.lucene.util.automaton.TestOperations.testStringUnion(TestOperations.java:37)
>>    [junit4]    >        at java.lang.Thread.run(Thread.java:745)
>>    [junit4]   2> NOTE: test params are: codec=Lucene46, sim=DefaultSimilarity,
locale=en_SG, timezone=CTT
>>    [junit4]   2> NOTE: Linux 3.2.0-26-generic amd64/Oracle Corporation 1.7.0_55
(64-bit)/cpus=8,threads=1,free=113721024,total=251133952
>>    [junit4]   2> NOTE: All tests run in this JVM: [TestOpenBitSet, TestOperations]
>>    [junit4] Completed on J4 in 14.07s, 14 tests, 1 failure <<< FAILURES!
>>
>> [...truncated 1299 lines...]
>> BUILD FAILED
>> /var/lib/jenkins/workspace/Lucene-trunk-Linux-Java7-64-test-only/checkout/lucene/build.xml:49:
The following error occurred while executing this line:
>> /var/lib/jenkins/workspace/Lucene-trunk-Linux-Java7-64-test-only/checkout/lucene/common-build.xml:1298:
The following error occurred while executing this line:
>> /var/lib/jenkins/workspace/Lucene-trunk-Linux-Java7-64-test-only/checkout/lucene/common-build.xml:922:
There were test failures: 401 suites, 3341 tests, 1 failure, 116 ignored (105 assumptions)
>>
>> Total time: 6 minutes 1 second
>> Build step 'Invoke Ant' marked build as failure
>> Archiving artifacts
>> Recording test results
>> Email was triggered for: Failure
>> Sending email for trigger: Failure
>>
>>
>>
>>
>> ---------------------------------------------------------------------
>> To unsubscribe, e-mail: dev-unsubscribe@lucene.apache.org
>> For additional commands, e-mail: dev-help@lucene.apache.org

---------------------------------------------------------------------
To unsubscribe, e-mail: dev-unsubscribe@lucene.apache.org
For additional commands, e-mail: dev-help@lucene.apache.org


Mime
View raw message