lucene-dev mailing list archives

Site index · List index
Message view « Date » · « Thread »
Top « Date » · « Thread »
From "Shalin Shekhar Mangar (JIRA)" <j...@apache.org>
Subject [jira] [Created] (SOLR-6287) CollectionsAPIDistributedZkTest fails with a create collection timeout
Date Sun, 27 Jul 2014 20:06:38 GMT
Shalin Shekhar Mangar created SOLR-6287:
-------------------------------------------

             Summary: CollectionsAPIDistributedZkTest fails with a create collection timeout
                 Key: SOLR-6287
                 URL: https://issues.apache.org/jira/browse/SOLR-6287
             Project: Solr
          Issue Type: Bug
          Components: SolrCloud, Tests
            Reporter: Shalin Shekhar Mangar


http://jenkins.thetaphi.de/job/Lucene-Solr-trunk-Linux/10905/

{code}
4 tests failed.
FAILED:  junit.framework.TestSuite.org.apache.solr.cloud.CollectionsAPIDistributedZkTest

Error Message:
ERROR: SolrZkClient opens=16 closes=15

Stack Trace:
java.lang.AssertionError: ERROR: SolrZkClient opens=16 closes=15
        at __randomizedtesting.SeedInfo.seed([EC56B329DF05FAC4]:0)
        at org.junit.Assert.fail(Assert.java:93)
        at org.apache.solr.SolrTestCaseJ4.endTrackingZkClients(SolrTestCaseJ4.java:451)
        at org.apache.solr.SolrTestCaseJ4.afterClass(SolrTestCaseJ4.java:184)
        at sun.reflect.GeneratedMethodAccessor29.invoke(Unknown Source)
        at sun.reflect.DelegatingMethodAccessorImpl.invoke(DelegatingMethodAccessorImpl.java:43)
        at java.lang.reflect.Method.invoke(Method.java:606)
        at com.carrotsearch.randomizedtesting.RandomizedRunner.invoke(RandomizedRunner.java:1618)
        at com.carrotsearch.randomizedtesting.RandomizedRunner$5.evaluate(RandomizedRunner.java:790)
        at com.carrotsearch.randomizedtesting.rules.StatementAdapter.evaluate(StatementAdapter.java:36)
        at com.carrotsearch.randomizedtesting.rules.SystemPropertiesRestoreRule$1.evaluate(SystemPropertiesRestoreRule.java:53)
        at org.apache.lucene.util.AbstractBeforeAfterRule$1.evaluate(AbstractBeforeAfterRule.java:46)
        at org.apache.lucene.util.TestRuleStoreClassName$1.evaluate(TestRuleStoreClassName.java:42)
        at com.carrotsearch.randomizedtesting.rules.SystemPropertiesInvariantRule$1.evaluate(SystemPropertiesInvariantRule.java:55)
        at com.carrotsearch.randomizedtesting.rules.NoShadowingOrOverridesOnMethodsRule$1.evaluate(NoShadowingOrOverridesOnMethodsRule.java:39)
        at com.carrotsearch.randomizedtesting.rules.NoShadowingOrOverridesOnMethodsRule$1.evaluate(NoShadowingOrOverridesOnMethodsRule.java:39)
        at com.carrotsearch.randomizedtesting.rules.StatementAdapter.evaluate(StatementAdapter.java:36)
        at com.carrotsearch.randomizedtesting.rules.StatementAdapter.evaluate(StatementAdapter.java:36)
        at com.carrotsearch.randomizedtesting.rules.StatementAdapter.evaluate(StatementAdapter.java:36)
        at org.apache.lucene.util.TestRuleAssertionsRequired$1.evaluate(TestRuleAssertionsRequired.java:43)
        at org.apache.lucene.util.TestRuleMarkFailure$1.evaluate(TestRuleMarkFailure.java:48)
        at org.apache.lucene.util.TestRuleIgnoreAfterMaxFailures$1.evaluate(TestRuleIgnoreAfterMaxFailures.java:65)
        at org.apache.lucene.util.TestRuleIgnoreTestSuites$1.evaluate(TestRuleIgnoreTestSuites.java:55)
        at com.carrotsearch.randomizedtesting.rules.StatementAdapter.evaluate(StatementAdapter.java:36)
        at com.carrotsearch.randomizedtesting.ThreadLeakControl$StatementRunner.run(ThreadLeakControl.java:365)
        at java.lang.Thread.run(Thread.java:745)


FAILED:  junit.framework.TestSuite.org.apache.solr.cloud.CollectionsAPIDistributedZkTest

Error Message:
2 threads leaked from SUITE scope at org.apache.solr.cloud.CollectionsAPIDistributedZkTest:
    1) Thread[id=1693, name=TEST-CollectionsAPIDistributedZkTest.testDistribSearch-seed#[EC56B329DF05FAC4]-SendThread(127.0.0.1:47930),
state=TIMED_WAITING, group=TGRP-CollectionsAPIDistributedZkTest]         at java.lang.Thread.sleep(Native
Method)         at org.apache.zookeeper.client.StaticHostProvider.next(StaticHostProvider.java:101)
        at org.apache.zookeeper.ClientCnxn$SendThread.startConnect(ClientCnxn.java:940)  
      at org.apache.zookeeper.ClientCnxn$SendThread.run(ClientCnxn.java:1003)    2) Thread[id=1694,
name=TEST-CollectionsAPIDistributedZkTest.testDistribSearch-seed#[EC56B329DF05FAC4]-EventThread,
state=WAITING, group=TGRP-CollectionsAPIDistributedZkTest]         at sun.misc.Unsafe.park(Native
Method)         at java.util.concurrent.locks.LockSupport.park(LockSupport.java:186)     
   at java.util.concurrent.locks.AbstractQueuedSynchronizer$ConditionObject.await(AbstractQueuedSynchronizer.java:2043)
        at java.util.concurrent.LinkedBlockingQueue.take(LinkedBlockingQueue.java:442)   
     at org.apache.zookeeper.ClientCnxn$EventThread.run(ClientCnxn.java:494)

Stack Trace:
com.carrotsearch.randomizedtesting.ThreadLeakError: 2 threads leaked from SUITE scope at org.apache.solr.cloud.CollectionsAPIDistributedZkTest:
   1) Thread[id=1693, name=TEST-CollectionsAPIDistributedZkTest.testDistribSearch-seed#[EC56B329DF05FAC4]-SendThread(127.0.0.1:47930),
state=TIMED_WAITING, group=TGRP-CollectionsAPIDistributedZkTest]
        at java.lang.Thread.sleep(Native Method)
        at org.apache.zookeeper.client.StaticHostProvider.next(StaticHostProvider.java:101)
        at org.apache.zookeeper.ClientCnxn$SendThread.startConnect(ClientCnxn.java:940)
        at org.apache.zookeeper.ClientCnxn$SendThread.run(ClientCnxn.java:1003)
   2) Thread[id=1694, name=TEST-CollectionsAPIDistributedZkTest.testDistribSearch-seed#[EC56B329DF05FAC4]-EventThread,
state=WAITING, group=TGRP-CollectionsAPIDistributedZkTest]
        at sun.misc.Unsafe.park(Native Method)
        at java.util.concurrent.locks.LockSupport.park(LockSupport.java:186)
        at java.util.concurrent.locks.AbstractQueuedSynchronizer$ConditionObject.await(AbstractQueuedSynchronizer.java:2043)
        at java.util.concurrent.LinkedBlockingQueue.take(LinkedBlockingQueue.java:442)
        at org.apache.zookeeper.ClientCnxn$EventThread.run(ClientCnxn.java:494)
        at __randomizedtesting.SeedInfo.seed([EC56B329DF05FAC4]:0)


FAILED:  junit.framework.TestSuite.org.apache.solr.cloud.CollectionsAPIDistributedZkTest

Error Message:
There are still zombie threads that couldn't be terminated:    1) Thread[id=1693, name=TEST-CollectionsAPIDistributedZkTest.testDistribSearch-seed#[EC56B329DF05FAC4]-SendThread(127.0.0.1:47930),
state=TIMED_WAITING, group=TGRP-CollectionsAPIDistributedZkTest]         at java.lang.Thread.sleep(Native
Method)         at org.apache.zookeeper.ClientCnxn$SendThread.run(ClientCnxn.java:994)

Stack Trace:
com.carrotsearch.randomizedtesting.ThreadLeakError: There are still zombie threads that couldn't
be terminated:
   1) Thread[id=1693, name=TEST-CollectionsAPIDistributedZkTest.testDistribSearch-seed#[EC56B329DF05FAC4]-SendThread(127.0.0.1:47930),
state=TIMED_WAITING, group=TGRP-CollectionsAPIDistributedZkTest]
        at java.lang.Thread.sleep(Native Method)
        at org.apache.zookeeper.ClientCnxn$SendThread.run(ClientCnxn.java:994)
        at __randomizedtesting.SeedInfo.seed([EC56B329DF05FAC4]:0)


REGRESSION:  org.apache.solr.cloud.CollectionsAPIDistributedZkTest.testDistribSearch

Error Message:
createcollection the collection time out:180s

Stack Trace:
org.apache.solr.client.solrj.impl.HttpSolrServer$RemoteSolrException: createcollection the
collection time out:180s
        at org.apache.solr.client.solrj.impl.HttpSolrServer.executeMethod(HttpSolrServer.java:551)
        at org.apache.solr.client.solrj.impl.HttpSolrServer.request(HttpSolrServer.java:210)
        at org.apache.solr.client.solrj.impl.HttpSolrServer.request(HttpSolrServer.java:206)
        at org.apache.solr.cloud.CollectionsAPIDistributedZkTest.testCollectionsAPI(CollectionsAPIDistributedZkTest.java:884)
        at org.apache.solr.cloud.CollectionsAPIDistributedZkTest.doTest(CollectionsAPIDistributedZkTest.java:203)
        at org.apache.solr.BaseDistributedSearchTestCase.testDistribSearch(BaseDistributedSearchTestCase.java:865)
        at sun.reflect.NativeMethodAccessorImpl.invoke0(Native Method)
{code}



--
This message was sent by Atlassian JIRA
(v6.2#6252)

---------------------------------------------------------------------
To unsubscribe, e-mail: dev-unsubscribe@lucene.apache.org
For additional commands, e-mail: dev-help@lucene.apache.org


Mime
View raw message