lucene-dev mailing list archives

Site index · List index
Message view « Date » · « Thread »
Top « Date » · « Thread »
From Apache Jenkins Server <jenk...@builds.apache.org>
Subject [JENKINS-MAVEN] Lucene-Solr-Maven-4.x #702: POMs out of sync
Date Mon, 15 Sep 2014 07:56:06 GMT
Build: https://builds.apache.org/job/Lucene-Solr-Maven-4.x/702/

1 tests failed.
REGRESSION:  org.apache.solr.client.solrj.SolrExampleBinaryTest.testChildDoctransformer

Error Message:
Expected mime type application/octet-stream but got text/html. <html>
<head>
<meta http-equiv="Content-Type" content="text/html;charset=ISO-8859-1"/>
<title>Error 500 Server Error</title>
</head>
<body>
<h2>HTTP ERROR: 500</h2>
<p>Problem accessing /solr/collection1/select. Reason:
<pre>    Server Error</pre></p>
<hr /><i><small>Powered by Jetty://</small></i>
                                                
                                                
                                                
                                                
                                                
                                                
                                                
                                                
                                                
                                                
                                                
                                                
                                                
                                                
                                                
                                                
                                                
                                                
                                                
                                                
</body>
</html>


Stack Trace:
org.apache.solr.client.solrj.impl.HttpSolrServer$RemoteSolrException: Expected mime type application/octet-stream but got text/html. <html>
<head>
<meta http-equiv="Content-Type" content="text/html;charset=ISO-8859-1"/>
<title>Error 500 Server Error</title>
</head>
<body>
<h2>HTTP ERROR: 500</h2>
<p>Problem accessing /solr/collection1/select. Reason:
<pre>    Server Error</pre></p>
<hr /><i><small>Powered by Jetty://</small></i>
                                                
                                                
                                                
                                                
                                                
                                                
                                                
                                                
                                                
                                                
                                                
                                                
                                                
                                                
                                                
                                                
                                                
                                                
                                                
                                                
</body>
</html>

	at __randomizedtesting.SeedInfo.seed([F0B07D57164E865B:836A62CD9A56F15D]:0)
	at org.apache.solr.client.solrj.impl.HttpSolrServer.executeMethod(HttpSolrServer.java:512)
	at org.apache.solr.client.solrj.impl.HttpSolrServer.request(HttpSolrServer.java:210)
	at org.apache.solr.client.solrj.impl.HttpSolrServer.request(HttpSolrServer.java:206)
	at org.apache.solr.client.solrj.request.QueryRequest.process(QueryRequest.java:91)
	at org.apache.solr.client.solrj.SolrServer.query(SolrServer.java:301)
	at org.apache.solr.client.solrj.SolrExampleTests.testChildDoctransformer(SolrExampleTests.java:1373)
	at sun.reflect.NativeMethodAccessorImpl.invoke0(Native Method)
	at sun.reflect.NativeMethodAccessorImpl.invoke(NativeMethodAccessorImpl.java:57)
	at sun.reflect.DelegatingMethodAccessorImpl.invoke(DelegatingMethodAccessorImpl.java:43)
	at java.lang.reflect.Method.invoke(Method.java:606)
	at com.carrotsearch.randomizedtesting.RandomizedRunner.invoke(RandomizedRunner.java:1618)
	at com.carrotsearch.randomizedtesting.RandomizedRunner$6.evaluate(RandomizedRunner.java:827)
	at com.carrotsearch.randomizedtesting.RandomizedRunner$7.evaluate(RandomizedRunner.java:863)
	at com.carrotsearch.randomizedtesting.RandomizedRunner$8.evaluate(RandomizedRunner.java:877)
	at com.carrotsearch.randomizedtesting.rules.SystemPropertiesRestoreRule$1.evaluate(SystemPropertiesRestoreRule.java:53)
	at org.apache.lucene.util.TestRuleSetupTeardownChained$1.evaluate(TestRuleSetupTeardownChained.java:50)
	at org.apache.lucene.util.TestRuleFieldCacheSanity$1.evaluate(TestRuleFieldCacheSanity.java:51)
	at org.apache.lucene.util.AbstractBeforeAfterRule$1.evaluate(AbstractBeforeAfterRule.java:46)
	at com.carrotsearch.randomizedtesting.rules.SystemPropertiesInvariantRule$1.evaluate(SystemPropertiesInvariantRule.java:55)
	at org.apache.lucene.util.TestRuleThreadAndTestName$1.evaluate(TestRuleThreadAndTestName.java:49)
	at org.apache.lucene.util.TestRuleIgnoreAfterMaxFailures$1.evaluate(TestRuleIgnoreAfterMaxFailures.java:65)
	at org.apache.lucene.util.TestRuleMarkFailure$1.evaluate(TestRuleMarkFailure.java:48)
	at com.carrotsearch.randomizedtesting.rules.StatementAdapter.evaluate(StatementAdapter.java:36)
	at com.carrotsearch.randomizedtesting.ThreadLeakControl$StatementRunner.run(ThreadLeakControl.java:365)
	at com.carrotsearch.randomizedtesting.ThreadLeakControl.forkTimeoutingTask(ThreadLeakControl.java:798)
	at com.carrotsearch.randomizedtesting.ThreadLeakControl$3.evaluate(ThreadLeakControl.java:458)
	at com.carrotsearch.randomizedtesting.RandomizedRunner.runSingleTest(RandomizedRunner.java:836)
	at com.carrotsearch.randomizedtesting.RandomizedRunner$3.evaluate(RandomizedRunner.java:738)
	at com.carrotsearch.randomizedtesting.RandomizedRunner$4.evaluate(RandomizedRunner.java:772)
	at com.carrotsearch.randomizedtesting.RandomizedRunner$5.evaluate(RandomizedRunner.java:783)
	at com.carrotsearch.randomizedtesting.rules.StatementAdapter.evaluate(StatementAdapter.java:36)
	at com.carrotsearch.randomizedtesting.rules.SystemPropertiesRestoreRule$1.evaluate(SystemPropertiesRestoreRule.java:53)
	at org.apache.lucene.util.AbstractBeforeAfterRule$1.evaluate(AbstractBeforeAfterRule.java:46)
	at org.apache.lucene.util.TestRuleStoreClassName$1.evaluate(TestRuleStoreClassName.java:42)
	at com.carrotsearch.randomizedtesting.rules.SystemPropertiesInvariantRule$1.evaluate(SystemPropertiesInvariantRule.java:55)
	at com.carrotsearch.randomizedtesting.rules.NoShadowingOrOverridesOnMethodsRule$1.evaluate(NoShadowingOrOverridesOnMethodsRule.java:39)
	at com.carrotsearch.randomizedtesting.rules.NoShadowingOrOverridesOnMethodsRule$1.evaluate(NoShadowingOrOverridesOnMethodsRule.java:39)
	at com.carrotsearch.randomizedtesting.rules.StatementAdapter.evaluate(StatementAdapter.java:36)
	at com.carrotsearch.randomizedtesting.rules.StatementAdapter.evaluate(StatementAdapter.java:36)
	at com.carrotsearch.randomizedtesting.rules.StatementAdapter.evaluate(StatementAdapter.java:36)
	at org.apache.lucene.util.TestRuleAssertionsRequired$1.evaluate(TestRuleAssertionsRequired.java:43)
	at org.apache.lucene.util.TestRuleMarkFailure$1.evaluate(TestRuleMarkFailure.java:48)
	at org.apache.lucene.util.TestRuleIgnoreAfterMaxFailures$1.evaluate(TestRuleIgnoreAfterMaxFailures.java:65)
	at org.apache.lucene.util.TestRuleIgnoreTestSuites$1.evaluate(TestRuleIgnoreTestSuites.java:55)
	at com.carrotsearch.randomizedtesting.rules.StatementAdapter.evaluate(StatementAdapter.java:36)
	at com.carrotsearch.randomizedtesting.ThreadLeakControl$StatementRunner.run(ThreadLeakControl.java:365)
	at java.lang.Thread.run(Thread.java:745)




Build Log:
[...truncated 49412 lines...]
      [mvn] <h2>HTTP ERROR: 500</h2>
      [mvn] <p>Problem accessing /solr/collection1/select. Reason:
      [mvn] <pre>    Server Error</pre></p>
      [mvn] <hr /><i><small>Powered by Jetty://</small></i>
      [mvn]                                                 
      [mvn]                                                 
      [mvn]                                                 
      [mvn]                                                 
      [mvn]                                                 
      [mvn]                                                 
      [mvn]                                                 
      [mvn]                                                 
      [mvn]                                                 
      [mvn]                                                 
      [mvn]                                                 
      [mvn]                                                 
      [mvn]                                                 
      [mvn]                                                 
      [mvn]                                                 
      [mvn]                                                 
      [mvn]                                                 
      [mvn]                                                 
      [mvn]                                                 
      [mvn]                                                 
      [mvn] </body>
      [mvn] </html>
      [mvn] 
      [mvn] 	at __randomizedtesting.SeedInfo.seed([F0B07D57164E865B:836A62CD9A56F15D]:0)
      [mvn] 	at org.apache.solr.client.solrj.impl.HttpSolrServer.executeMethod(HttpSolrServer.java:512)
      [mvn] 	at org.apache.solr.client.solrj.impl.HttpSolrServer.request(HttpSolrServer.java:210)
      [mvn] 	at org.apache.solr.client.solrj.impl.HttpSolrServer.request(HttpSolrServer.java:206)
      [mvn] 	at org.apache.solr.client.solrj.request.QueryRequest.process(QueryRequest.java:91)
      [mvn] 	at org.apache.solr.client.solrj.SolrServer.query(SolrServer.java:301)
      [mvn] 	at org.apache.solr.client.solrj.SolrExampleTests.testChildDoctransformer(SolrExampleTests.java:1373)
      [mvn] 	at sun.reflect.NativeMethodAccessorImpl.invoke0(Native Method)
      [mvn] 	at sun.reflect.NativeMethodAccessorImpl.invoke(NativeMethodAccessorImpl.java:57)
      [mvn] 	at sun.reflect.DelegatingMethodAccessorImpl.invoke(DelegatingMethodAccessorImpl.java:43)
      [mvn] 	at java.lang.reflect.Method.invoke(Method.java:606)
      [mvn] 	at com.carrotsearch.randomizedtesting.RandomizedRunner.invoke(RandomizedRunner.java:1618)
      [mvn] 	at com.carrotsearch.randomizedtesting.RandomizedRunner$6.evaluate(RandomizedRunner.java:827)
      [mvn] 	at com.carrotsearch.randomizedtesting.RandomizedRunner$7.evaluate(RandomizedRunner.java:863)
      [mvn] 	at com.carrotsearch.randomizedtesting.RandomizedRunner$8.evaluate(RandomizedRunner.java:877)
      [mvn] 	at com.carrotsearch.randomizedtesting.rules.SystemPropertiesRestoreRule$1.evaluate(SystemPropertiesRestoreRule.java:53)
      [mvn] 	at org.apache.lucene.util.TestRuleSetupTeardownChained$1.evaluate(TestRuleSetupTeardownChained.java:50)
      [mvn] 	at org.apache.lucene.util.TestRuleFieldCacheSanity$1.evaluate(TestRuleFieldCacheSanity.java:51)
      [mvn] 	at org.apache.lucene.util.AbstractBeforeAfterRule$1.evaluate(AbstractBeforeAfterRule.java:46)
      [mvn] 	at com.carrotsearch.randomizedtesting.rules.SystemPropertiesInvariantRule$1.evaluate(SystemPropertiesInvariantRule.java:55)
      [mvn] 	at org.apache.lucene.util.TestRuleThreadAndTestName$1.evaluate(TestRuleThreadAndTestName.java:49)
      [mvn] 	at org.apache.lucene.util.TestRuleIgnoreAfterMaxFailures$1.evaluate(TestRuleIgnoreAfterMaxFailures.java:65)
      [mvn] 	at org.apache.lucene.util.TestRuleMarkFailure$1.evaluate(TestRuleMarkFailure.java:48)
      [mvn] 	at com.carrotsearch.randomizedtesting.rules.StatementAdapter.evaluate(StatementAdapter.java:36)
      [mvn] 	at com.carrotsearch.randomizedtesting.ThreadLeakControl$StatementRunner.run(ThreadLeakControl.java:365)
      [mvn] 	at com.carrotsearch.randomizedtesting.ThreadLeakControl.forkTimeoutingTask(ThreadLeakControl.java:798)
      [mvn] 	at com.carrotsearch.randomizedtesting.ThreadLeakControl$3.evaluate(ThreadLeakControl.java:458)
      [mvn] 	at com.carrotsearch.randomizedtesting.RandomizedRunner.runSingleTest(RandomizedRunner.java:836)
      [mvn] 	at com.carrotsearch.randomizedtesting.RandomizedRunner$3.evaluate(RandomizedRunner.java:738)
      [mvn] 	at com.carrotsearch.randomizedtesting.RandomizedRunner$4.evaluate(RandomizedRunner.java:772)
      [mvn] 	at com.carrotsearch.randomizedtesting.RandomizedRunner$5.evaluate(RandomizedRunner.java:783)
      [mvn] 	at com.carrotsearch.randomizedtesting.rules.StatementAdapter.evaluate(StatementAdapter.java:36)
      [mvn] 	at com.carrotsearch.randomizedtesting.rules.SystemPropertiesRestoreRule$1.evaluate(SystemPropertiesRestoreRule.java:53)
      [mvn] 	at org.apache.lucene.util.AbstractBeforeAfterRule$1.evaluate(AbstractBeforeAfterRule.java:46)
      [mvn] 	at org.apache.lucene.util.TestRuleStoreClassName$1.evaluate(TestRuleStoreClassName.java:42)
      [mvn] 	at com.carrotsearch.randomizedtesting.rules.SystemPropertiesInvariantRule$1.evaluate(SystemPropertiesInvariantRule.java:55)
      [mvn] 	at com.carrotsearch.randomizedtesting.rules.NoShadowingOrOverridesOnMethodsRule$1.evaluate(NoShadowingOrOverridesOnMethodsRule.java:39)
      [mvn] 	at com.carrotsearch.randomizedtesting.rules.NoShadowingOrOverridesOnMethodsRule$1.evaluate(NoShadowingOrOverridesOnMethodsRule.java:39)
      [mvn] 	at com.carrotsearch.randomizedtesting.rules.StatementAdapter.evaluate(StatementAdapter.java:36)
      [mvn] 	at com.carrotsearch.randomizedtesting.rules.StatementAdapter.evaluate(StatementAdapter.java:36)
      [mvn] 	at com.carrotsearch.randomizedtesting.rules.StatementAdapter.evaluate(StatementAdapter.java:36)
      [mvn] 	at org.apache.lucene.util.TestRuleAssertionsRequired$1.evaluate(TestRuleAssertionsRequired.java:43)
      [mvn] 	at org.apache.lucene.util.TestRuleMarkFailure$1.evaluate(TestRuleMarkFailure.java:48)
      [mvn] 	at org.apache.lucene.util.TestRuleIgnoreAfterMaxFailures$1.evaluate(TestRuleIgnoreAfterMaxFailures.java:65)
      [mvn] 	at org.apache.lucene.util.TestRuleIgnoreTestSuites$1.evaluate(TestRuleIgnoreTestSuites.java:55)
      [mvn] 	at com.carrotsearch.randomizedtesting.rules.StatementAdapter.evaluate(StatementAdapter.java:36)
      [mvn] 	at com.carrotsearch.randomizedtesting.ThreadLeakControl$StatementRunner.run(ThreadLeakControl.java:365)
      [mvn] 	at java.lang.Thread.run(Thread.java:745)
      [mvn] 
      [mvn] testSetNullUpdates(org.apache.solr.client.solrj.SolrExampleBinaryTest)  Time elapsed: 0.327 sec
      [mvn] testAddDelete(org.apache.solr.client.solrj.SolrExampleBinaryTest)  Time elapsed: 0.636 sec
      [mvn] testUpdateField(org.apache.solr.client.solrj.SolrExampleBinaryTest)  Time elapsed: 0.351 sec
      [mvn] testRealtimeGet(org.apache.solr.client.solrj.SolrExampleBinaryTest)  Time elapsed: 0.14 sec
      [mvn] testStreamingRequest(org.apache.solr.client.solrj.SolrExampleBinaryTest)  Time elapsed: 0.189 sec
      [mvn] testCommitWithinOnDelete(org.apache.solr.client.solrj.SolrExampleBinaryTest)  Time elapsed: 1.351 sec
      [mvn] testAddRetrieve(org.apache.solr.client.solrj.SolrExampleBinaryTest)  Time elapsed: 0.395 sec
      [mvn] testUpdateMultiValuedField(org.apache.solr.client.solrj.SolrExampleBinaryTest)  Time elapsed: 0.489 sec
      [mvn] testLukeHandler(org.apache.solr.client.solrj.SolrExampleBinaryTest)  Time elapsed: 0.201 sec
      [mvn] testErrorHandling(org.apache.solr.client.solrj.SolrExampleBinaryTest)  Time elapsed: 0.056 sec
      [mvn] testGetEmptyResults(org.apache.solr.client.solrj.SolrExampleBinaryTest)  Time elapsed: 0.185 sec
      [mvn] testPivotFacetsMissing(org.apache.solr.client.solrj.SolrExampleBinaryTest)  Time elapsed: 0.196 sec
      [mvn] testMultiContentStreamRequest(org.apache.solr.client.solrj.SolrExampleBinaryTest)  Time elapsed: 0.185 sec
      [mvn] testStatistics(org.apache.solr.client.solrj.SolrExampleBinaryTest)  Time elapsed: 0.599 sec
      [mvn] testContentStreamRequest(org.apache.solr.client.solrj.SolrExampleBinaryTest)  Time elapsed: 0.188 sec
      [mvn] testExampleConfig(org.apache.solr.client.solrj.SolrExampleBinaryTest)  Time elapsed: 0.43 sec
      [mvn] testCommitWithinOnAdd(org.apache.solr.client.solrj.SolrExampleBinaryTest)  Time elapsed: 1.984 sec
      [mvn] testPingHandler(org.apache.solr.client.solrj.SolrExampleBinaryTest)  Time elapsed: 0.126 sec
      [mvn] testQueryWithParams(org.apache.solr.client.solrj.SolrExampleBinaryTest)  Time elapsed: 0.003 sec
      [mvn] testAugmentFields(org.apache.solr.client.solrj.SolrExampleBinaryTest)  Time elapsed: 0.214 sec
      [mvn] Running org.apache.solr.common.util.URLUtilTest
      [mvn] Tests run: 1, Failures: 0, Errors: 0, Skipped: 0, Time elapsed: 0 sec - in org.apache.solr.common.util.URLUtilTest
      [mvn] test(org.apache.solr.common.util.URLUtilTest)  Time elapsed: 0 sec
      [mvn] Running org.apache.solr.client.solrj.impl.BasicHttpSolrServerTest
      [mvn] Tests run: 10, Failures: 0, Errors: 0, Skipped: 0, Time elapsed: 8.96 sec - in org.apache.solr.client.solrj.impl.BasicHttpSolrServerTest
      [mvn] testTimeout(org.apache.solr.client.solrj.impl.BasicHttpSolrServerTest)  Time elapsed: 1.908 sec
      [mvn] testSetParametersExternalClient(org.apache.solr.client.solrj.impl.BasicHttpSolrServerTest)  Time elapsed: 0.01 sec
      [mvn] testSolrExceptionCodeNotFromSolr(org.apache.solr.client.solrj.impl.BasicHttpSolrServerTest)  Time elapsed: 0.166 sec
      [mvn] testRedirect(org.apache.solr.client.solrj.impl.BasicHttpSolrServerTest)  Time elapsed: 0.14 sec
      [mvn] testQuery(org.apache.solr.client.solrj.impl.BasicHttpSolrServerTest)  Time elapsed: 0.155 sec
      [mvn] testDelete(org.apache.solr.client.solrj.impl.BasicHttpSolrServerTest)  Time elapsed: 0.144 sec
      [mvn] testUpdate(org.apache.solr.client.solrj.impl.BasicHttpSolrServerTest)  Time elapsed: 0.151 sec
      [mvn] testCompression(org.apache.solr.client.solrj.impl.BasicHttpSolrServerTest)  Time elapsed: 0.422 sec
      [mvn] testExampleKeystorePath(org.apache.solr.client.solrj.impl.BasicHttpSolrServerTest)  Time elapsed: 0.008 sec
      [mvn] testGetRawStream(org.apache.solr.client.solrj.impl.BasicHttpSolrServerTest)  Time elapsed: 0.139 sec
      [mvn] Running org.apache.solr.client.solrj.impl.ExternalHttpClientTest
      [mvn] Tests run: 1, Failures: 0, Errors: 0, Skipped: 0, Time elapsed: 6.166 sec - in org.apache.solr.client.solrj.impl.ExternalHttpClientTest
      [mvn] testTimeoutWithExternalClient(org.apache.solr.client.solrj.impl.ExternalHttpClientTest)  Time elapsed: 1.953 sec
      [mvn] Running org.apache.solr.client.solrj.request.SolrPingTest
      [mvn] Tests run: 2, Failures: 0, Errors: 0, Skipped: 0, Time elapsed: 1.217 sec - in org.apache.solr.client.solrj.request.SolrPingTest
      [mvn] testDisabledSolrPing(org.apache.solr.client.solrj.request.SolrPingTest)  Time elapsed: 0.054 sec
      [mvn] testEnabledSolrPing(org.apache.solr.client.solrj.request.SolrPingTest)  Time elapsed: 0.069 sec
      [mvn] Running org.apache.solr.client.solrj.embedded.LargeVolumeEmbeddedTest
      [mvn] Tests run: 1, Failures: 0, Errors: 0, Skipped: 0, Time elapsed: 2.517 sec - in org.apache.solr.client.solrj.embedded.LargeVolumeEmbeddedTest
      [mvn] testMultiThreaded(org.apache.solr.client.solrj.embedded.LargeVolumeEmbeddedTest)  Time elapsed: 0.624 sec
      [mvn] Running org.apache.solr.common.util.TestFastInputStream
      [mvn] Tests run: 1, Failures: 0, Errors: 0, Skipped: 0, Time elapsed: 0 sec - in org.apache.solr.common.util.TestFastInputStream
      [mvn] testgzip(org.apache.solr.common.util.TestFastInputStream)  Time elapsed: 0 sec
      [mvn] Running org.apache.solr.client.solrj.embedded.LargeVolumeBinaryJettyTest
      [mvn] Tests run: 1, Failures: 0, Errors: 0, Skipped: 0, Time elapsed: 6.203 sec - in org.apache.solr.client.solrj.embedded.LargeVolumeBinaryJettyTest
      [mvn] testMultiThreaded(org.apache.solr.client.solrj.embedded.LargeVolumeBinaryJettyTest)  Time elapsed: 0.603 sec
      [mvn] Running org.apache.solr.common.util.NamedListTest
      [mvn] Tests run: 4, Failures: 0, Errors: 0, Skipped: 0, Time elapsed: 0.023 sec - in org.apache.solr.common.util.NamedListTest
      [mvn] testRemoveAll(org.apache.solr.common.util.NamedListTest)  Time elapsed: 0.002 sec
      [mvn] testRemove(org.apache.solr.common.util.NamedListTest)  Time elapsed: 0.001 sec
      [mvn] testRemoveArgs(org.apache.solr.common.util.NamedListTest)  Time elapsed: 0.002 sec
      [mvn] testRecursive(org.apache.solr.common.util.NamedListTest)  Time elapsed: 0.002 sec
      [mvn] Running org.apache.solr.common.SolrDocumentTest
      [mvn] Tests run: 5, Failures: 0, Errors: 0, Skipped: 0, Time elapsed: 0.028 sec - in org.apache.solr.common.SolrDocumentTest
      [mvn] testUnsupportedStuff(org.apache.solr.common.SolrDocumentTest)  Time elapsed: 0.005 sec
      [mvn] testDuplicate(org.apache.solr.common.SolrDocumentTest)  Time elapsed: 0.002 sec
      [mvn] testMapInterface(org.apache.solr.common.SolrDocumentTest)  Time elapsed: 0.002 sec
      [mvn] testSimple(org.apache.solr.common.SolrDocumentTest)  Time elapsed: 0.002 sec
      [mvn] testAddCollections(org.apache.solr.common.SolrDocumentTest)  Time elapsed: 0.003 sec
      [mvn] Running org.apache.solr.client.solrj.response.FieldAnalysisResponseTest
      [mvn] Tests run: 1, Failures: 0, Errors: 0, Skipped: 0, Time elapsed: 0.021 sec - in org.apache.solr.client.solrj.response.FieldAnalysisResponseTest
      [mvn] testSetResponse(org.apache.solr.client.solrj.response.FieldAnalysisResponseTest)  Time elapsed: 0.004 sec
      [mvn] Running org.apache.solr.client.solrj.TestBatchUpdate
      [mvn] Tests run: 3, Failures: 0, Errors: 0, Skipped: 0, Time elapsed: 6.866 sec - in org.apache.solr.client.solrj.TestBatchUpdate
      [mvn] testWithBinaryBean(org.apache.solr.client.solrj.TestBatchUpdate)  Time elapsed: 0.228 sec
      [mvn] testWithXml(org.apache.solr.client.solrj.TestBatchUpdate)  Time elapsed: 0.289 sec
      [mvn] testWithBinary(org.apache.solr.client.solrj.TestBatchUpdate)  Time elapsed: 0.244 sec
      [mvn] Running org.apache.solr.client.solrj.embedded.LargeVolumeJettyTest
      [mvn] Tests run: 1, Failures: 0, Errors: 0, Skipped: 0, Time elapsed: 6.585 sec - in org.apache.solr.client.solrj.embedded.LargeVolumeJettyTest
      [mvn] testMultiThreaded(org.apache.solr.client.solrj.embedded.LargeVolumeJettyTest)  Time elapsed: 0.689 sec
      [mvn] Running org.apache.solr.common.util.TestHash
      [mvn] Tests run: 2, Failures: 0, Errors: 0, Skipped: 0, Time elapsed: 0.1 sec - in org.apache.solr.common.util.TestHash
      [mvn] testEqualsLOOKUP3(org.apache.solr.common.util.TestHash)  Time elapsed: 0.002 sec
      [mvn] testHash(org.apache.solr.common.util.TestHash)  Time elapsed: 0.085 sec
      [mvn] Running org.apache.solr.common.util.TestJavaBinCodec
      [mvn] Tests run: 6, Failures: 0, Errors: 0, Skipped: 0, Time elapsed: 0.265 sec - in org.apache.solr.common.util.TestJavaBinCodec
      [mvn] testStrings(org.apache.solr.common.util.TestJavaBinCodec)  Time elapsed: 0.21 sec
      [mvn] testBackCompat(org.apache.solr.common.util.TestJavaBinCodec)  Time elapsed: 0.006 sec
      [mvn] testForwardCompatForSolrDocumentWithChildDocs(org.apache.solr.common.util.TestJavaBinCodec)  Time elapsed: 0.006 sec
      [mvn] testBackCompatForSolrDocumentWithChildDocs(org.apache.solr.common.util.TestJavaBinCodec)  Time elapsed: 0.004 sec
      [mvn] testForwardCompat(org.apache.solr.common.util.TestJavaBinCodec)  Time elapsed: 0.004 sec
      [mvn] testResponseChildDocuments(org.apache.solr.common.util.TestJavaBinCodec)  Time elapsed: 0.005 sec
      [mvn] Running org.apache.solr.client.solrj.response.AnlysisResponseBaseTest
      [mvn] Tests run: 2, Failures: 0, Errors: 0, Skipped: 0, Time elapsed: 0.018 sec - in org.apache.solr.client.solrj.response.AnlysisResponseBaseTest
      [mvn] testBuildPhases(org.apache.solr.client.solrj.response.AnlysisResponseBaseTest)  Time elapsed: 0.002 sec
      [mvn] testBuildTokenInfo(org.apache.solr.client.solrj.response.AnlysisResponseBaseTest)  Time elapsed: 0.002 sec
      [mvn] Running org.apache.solr.common.util.ContentStreamTest
      [mvn] Tests run: 3, Failures: 0, Errors: 0, Skipped: 0, Time elapsed: 0.075 sec - in org.apache.solr.common.util.ContentStreamTest
      [mvn] testStringStream(org.apache.solr.common.util.ContentStreamTest)  Time elapsed: 0.002 sec
      [mvn] testFileStream(org.apache.solr.common.util.ContentStreamTest)  Time elapsed: 0.019 sec
      [mvn] testURLStream(org.apache.solr.common.util.ContentStreamTest)  Time elapsed: 0.024 sec
      [mvn] Running org.apache.solr.client.solrj.response.DocumentAnalysisResponseTest
      [mvn] Tests run: 1, Failures: 0, Errors: 0, Skipped: 0, Time elapsed: 0.017 sec - in org.apache.solr.client.solrj.response.DocumentAnalysisResponseTest
      [mvn] testSetResponse(org.apache.solr.client.solrj.response.DocumentAnalysisResponseTest)  Time elapsed: 0.004 sec
      [mvn] Running org.apache.solr.client.solrj.SolrExceptionTest
      [mvn] Tests run: 1, Failures: 0, Errors: 0, Skipped: 0, Time elapsed: 0.027 sec - in org.apache.solr.client.solrj.SolrExceptionTest
      [mvn] testSolrException(org.apache.solr.client.solrj.SolrExceptionTest)  Time elapsed: 0.015 sec
      [mvn] Running org.apache.solr.client.solrj.SolrExampleXMLTest
      [mvn] Tests run: 28, Failures: 0, Errors: 0, Skipped: 0, Time elapsed: 17.484 sec - in org.apache.solr.client.solrj.SolrExampleXMLTest
      [mvn] testStatistics(org.apache.solr.client.solrj.SolrExampleXMLTest)  Time elapsed: 0.549 sec
      [mvn] testCommitWithinOnAdd(org.apache.solr.client.solrj.SolrExampleXMLTest)  Time elapsed: 1.993 sec
      [mvn] testUpdateMultiValuedField(org.apache.solr.client.solrj.SolrExampleXMLTest)  Time elapsed: 0.533 sec
      [mvn] testChildDoctransformer(org.apache.solr.client.solrj.SolrExampleXMLTest)  Time elapsed: 0.964 sec
      [mvn] testUpdateRequestWithParameters(org.apache.solr.client.solrj.SolrExampleXMLTest)  Time elapsed: 0.194 sec
      [mvn] testFaceting(org.apache.solr.client.solrj.SolrExampleXMLTest)  Time elapsed: 0.313 sec
      [mvn] testStreamingRequest(org.apache.solr.client.solrj.SolrExampleXMLTest)  Time elapsed: 0.259 sec
      [mvn] testContentStreamRequest(org.apache.solr.client.solrj.SolrExampleXMLTest)  Time elapsed: 0.197 sec
      [mvn] testAddRetrieve(org.apache.solr.client.solrj.SolrExampleXMLTest)  Time elapsed: 0.26 sec
      [mvn] testAddDelete(org.apache.solr.client.solrj.SolrExampleXMLTest)  Time elapsed: 0.797 sec
      [mvn] testRealtimeGet(org.apache.solr.client.solrj.SolrExampleXMLTest)  Time elapsed: 0.173 sec
      [mvn] testQueryWithParams(org.apache.solr.client.solrj.SolrExampleXMLTest)  Time elapsed: 0.003 sec
      [mvn] testExampleConfig(org.apache.solr.client.solrj.SolrExampleXMLTest)  Time elapsed: 0.43 sec
      [mvn] testChineseDefaults(org.apache.solr.client.solrj.SolrExampleXMLTest)  Time elapsed: 0.209 sec
      [mvn] testSetNullUpdates(org.apache.solr.client.solrj.SolrExampleXMLTest)  Time elapsed: 0.239 sec
      [mvn] testPivotFacets(org.apache.solr.client.solrj.SolrExampleXMLTest)  Time elapsed: 0.236 sec
      [mvn] testErrorHandling(org.apache.solr.client.solrj.SolrExampleXMLTest)  Time elapsed: 0.052 sec
      [mvn] testCommitWithinOnDelete(org.apache.solr.client.solrj.SolrExampleXMLTest)  Time elapsed: 1.116 sec
      [mvn] testPivotFacetsMissing(org.apache.solr.client.solrj.SolrExampleXMLTest)  Time elapsed: 0.327 sec
      [mvn] testMultiContentStreamRequest(org.apache.solr.client.solrj.SolrExampleXMLTest)  Time elapsed: 0.344 sec
      [mvn] testGetEmptyResults(org.apache.solr.client.solrj.SolrExampleXMLTest)  Time elapsed: 0.343 sec
      [mvn] testSetNullUpdateOrder(org.apache.solr.client.solrj.SolrExampleXMLTest)  Time elapsed: 0.281 sec
      [mvn] testFieldGlobbing(org.apache.solr.client.solrj.SolrExampleXMLTest)  Time elapsed: 0.115 sec
      [mvn] testPingHandler(org.apache.solr.client.solrj.SolrExampleXMLTest)  Time elapsed: 0.114 sec
      [mvn] testUnicode(org.apache.solr.client.solrj.SolrExampleXMLTest)  Time elapsed: 0.765 sec
      [mvn] testAugmentFields(org.apache.solr.client.solrj.SolrExampleXMLTest)  Time elapsed: 0.228 sec
      [mvn] testUpdateField(org.apache.solr.client.solrj.SolrExampleXMLTest)  Time elapsed: 0.409 sec
      [mvn] testLukeHandler(org.apache.solr.client.solrj.SolrExampleXMLTest)  Time elapsed: 0.152 sec
      [mvn] Running org.apache.solr.client.solrj.TestLBHttpSolrServer
      [mvn] Tests run: 3, Failures: 0, Errors: 0, Skipped: 0, Time elapsed: 99.611 sec - in org.apache.solr.client.solrj.TestLBHttpSolrServer
      [mvn] testReliability(org.apache.solr.client.solrj.TestLBHttpSolrServer)  Time elapsed: 51.935 sec
      [mvn] testSimple(org.apache.solr.client.solrj.TestLBHttpSolrServer)  Time elapsed: 23.643 sec
      [mvn] testTwoServers(org.apache.solr.client.solrj.TestLBHttpSolrServer)  Time elapsed: 23.999 sec
      [mvn] Running org.apache.solr.client.solrj.SolrQueryTest
      [mvn] Tests run: 16, Failures: 0, Errors: 0, Skipped: 0, Time elapsed: 0.061 sec - in org.apache.solr.client.solrj.SolrQueryTest
      [mvn] testFacetDateRange(org.apache.solr.client.solrj.SolrQueryTest)  Time elapsed: 0.003 sec
      [mvn] testSettersGetters(org.apache.solr.client.solrj.SolrQueryTest)  Time elapsed: 0.002 sec
      [mvn] testOrder(org.apache.solr.client.solrj.SolrQueryTest)  Time elapsed: 0.001 sec
      [mvn] testTerms(org.apache.solr.client.solrj.SolrQueryTest)  Time elapsed: 0.002 sec
      [mvn] testFacetSortLegacy(org.apache.solr.client.solrj.SolrQueryTest)  Time elapsed: 0.001 sec
      [mvn] testSortFieldRawStringAndMethods(org.apache.solr.client.solrj.SolrQueryTest)  Time elapsed: 0.002 sec
      [mvn] testFacetNumericRange(org.apache.solr.client.solrj.SolrQueryTest)  Time elapsed: 0.002 sec
      [mvn] testFacetInterval(org.apache.solr.client.solrj.SolrQueryTest)  Time elapsed: 0.002 sec
      [mvn] testSort(org.apache.solr.client.solrj.SolrQueryTest)  Time elapsed: 0.019 sec
      [mvn] testSortFieldRemoveAfterRemove(org.apache.solr.client.solrj.SolrQueryTest)  Time elapsed: 0.002 sec
      [mvn] testSortFieldRemoveLast(org.apache.solr.client.solrj.SolrQueryTest)  Time elapsed: 0.001 sec
      [mvn] testFacetSort(org.apache.solr.client.solrj.SolrQueryTest)  Time elapsed: 0.001 sec
      [mvn] testGetSortImmutable(org.apache.solr.client.solrj.SolrQueryTest)  Time elapsed: 0.002 sec
      [mvn] testSolrQueryMethods(org.apache.solr.client.solrj.SolrQueryTest)  Time elapsed: 0.001 sec
      [mvn] testAddFacetQuery(org.apache.solr.client.solrj.SolrQueryTest)  Time elapsed: 0.001 sec
      [mvn] testSortClause(org.apache.solr.client.solrj.SolrQueryTest)  Time elapsed: 0.002 sec
      [mvn] Running org.apache.solr.client.solrj.response.TermsResponseTest
      [mvn] Tests run: 1, Failures: 0, Errors: 0, Skipped: 0, Time elapsed: 2.216 sec - in org.apache.solr.client.solrj.response.TermsResponseTest
      [mvn] testTermsResponse(org.apache.solr.client.solrj.response.TermsResponseTest)  Time elapsed: 0.268 sec
      [mvn] Running org.apache.solr.client.solrj.embedded.SolrExampleStreamingBinaryTest
      [mvn] Tests run: 29, Failures: 0, Errors: 0, Skipped: 0, Time elapsed: 27.644 sec - in org.apache.solr.client.solrj.embedded.SolrExampleStreamingBinaryTest
      [mvn] testQueryWithParams(org.apache.solr.client.solrj.embedded.SolrExampleStreamingBinaryTest)  Time elapsed: 0.009 sec
      [mvn] testUpdateField(org.apache.solr.client.solrj.embedded.SolrExampleStreamingBinaryTest)  Time elapsed: 1.273 sec
      [mvn] testChineseDefaults(org.apache.solr.client.solrj.embedded.SolrExampleStreamingBinaryTest)  Time elapsed: 0.269 sec
      [mvn] testAddDelete(org.apache.solr.client.solrj.embedded.SolrExampleStreamingBinaryTest)  Time elapsed: 1.187 sec
      [mvn] testSetNullUpdates(org.apache.solr.client.solrj.embedded.SolrExampleStreamingBinaryTest)  Time elapsed: 0.612 sec
      [mvn] testFieldGlobbing(org.apache.solr.client.solrj.embedded.SolrExampleStreamingBinaryTest)  Time elapsed: 0.334 sec
      [mvn] testCommitWithinOnAdd(org.apache.solr.client.solrj.embedded.SolrExampleStreamingBinaryTest)  Time elapsed: 2.017 sec
      [mvn] testCommitWithinOnDelete(org.apache.solr.client.solrj.embedded.SolrExampleStreamingBinaryTest)  Time elapsed: 1.681 sec
      [mvn] testAugmentFields(org.apache.solr.client.solrj.embedded.SolrExampleStreamingBinaryTest)  Time elapsed: 0.755 sec
      [mvn] testPivotFacetsMissing(org.apache.solr.client.solrj.embedded.SolrExampleStreamingBinaryTest)  Time elapsed: 0.461 sec
      [mvn] testErrorHandling(org.apache.solr.client.solrj.embedded.SolrExampleStreamingBinaryTest)  Time elapsed: 0.191 sec
      [mvn] testContentStreamRequest(org.apache.solr.client.solrj.embedded.SolrExampleStreamingBinaryTest)  Time elapsed: 0.298 sec
      [mvn] testFaceting(org.apache.solr.client.solrj.embedded.SolrExampleStreamingBinaryTest)  Time elapsed: 0.32 sec
      [mvn] testStatistics(org.apache.solr.client.solrj.embedded.SolrExampleStreamingBinaryTest)  Time elapsed: 1.65 sec
      [mvn] testChildDoctransformer(org.apache.solr.client.solrj.embedded.SolrExampleStreamingBinaryTest)  Time elapsed: 0.656 sec
      [mvn] testExampleConfig(org.apache.solr.client.solrj.embedded.SolrExampleStreamingBinaryTest)  Time elapsed: 1.016 sec
      [mvn] testWaitOptions(org.apache.solr.client.solrj.embedded.SolrExampleStreamingBinaryTest)  Time elapsed: 1.401 sec
      [mvn] testRealtimeGet(org.apache.solr.client.solrj.embedded.SolrExampleStreamingBinaryTest)  Time elapsed: 0.326 sec
      [mvn] testPingHandler(org.apache.solr.client.solrj.embedded.SolrExampleStreamingBinaryTest)  Time elapsed: 0.098 sec
      [mvn] testGetEmptyResults(org.apache.solr.client.solrj.embedded.SolrExampleStreamingBinaryTest)  Time elapsed: 0.349 sec
      [mvn] testSetNullUpdateOrder(org.apache.solr.client.solrj.embedded.SolrExampleStreamingBinaryTest)  Time elapsed: 0.75 sec
      [mvn] testMultiContentStreamRequest(org.apache.solr.client.solrj.embedded.SolrExampleStreamingBinaryTest)  Time elapsed: 0.335 sec
      [mvn] testUnicode(org.apache.solr.client.solrj.embedded.SolrExampleStreamingBinaryTest)  Time elapsed: 2.746 sec
      [mvn] testAddRetrieve(org.apache.solr.client.solrj.embedded.SolrExampleStreamingBinaryTest)  Time elapsed: 0.686 sec
      [mvn] testStreamingRequest(org.apache.solr.client.solrj.embedded.SolrExampleStreamingBinaryTest)  Time elapsed: 0.303 sec
      [mvn] testLukeHandler(org.apache.solr.client.solrj.embedded.SolrExampleStreamingBinaryTest)  Time elapsed: 0.473 sec
      [mvn] testPivotFacets(org.apache.solr.client.solrj.embedded.SolrExampleStreamingBinaryTest)  Time elapsed: 0.447 sec
      [mvn] testUpdateRequestWithParameters(org.apache.solr.client.solrj.embedded.SolrExampleStreamingBinaryTest)  Time elapsed: 0.337 sec
      [mvn] testUpdateMultiValuedField(org.apache.solr.client.solrj.embedded.SolrExampleStreamingBinaryTest)  Time elapsed: 1.042 sec
      [mvn] Running org.apache.solr.common.util.TestRetryUtil
      [mvn] Tests run: 1, Failures: 0, Errors: 0, Skipped: 0, Time elapsed: 1.052 sec - in org.apache.solr.common.util.TestRetryUtil
      [mvn] testRetryOnThrowable(org.apache.solr.common.util.TestRetryUtil)  Time elapsed: 1.024 sec
      [mvn] Running org.apache.solr.client.solrj.impl.CloudSolrServerTest
      [mvn] Tests run: 3, Failures: 0, Errors: 0, Skipped: 0, Time elapsed: 45.093 sec - in org.apache.solr.client.solrj.impl.CloudSolrServerTest
      [mvn] testDistribSearch(org.apache.solr.client.solrj.impl.CloudSolrServerTest)  Time elapsed: 42.834 sec
      [mvn] testWrongZkChrootTest(org.apache.solr.client.solrj.impl.CloudSolrServerTest)  Time elapsed: 0.36 sec
      [mvn] testShutdown(org.apache.solr.client.solrj.impl.CloudSolrServerTest)  Time elapsed: 1.798 sec
      [mvn] Running org.apache.solr.common.util.TestNamedListCodec
      [mvn] Tests run: 4, Failures: 0, Errors: 0, Skipped: 0, Time elapsed: 0.364 sec - in org.apache.solr.common.util.TestNamedListCodec
      [mvn] testRandom(org.apache.solr.common.util.TestNamedListCodec)  Time elapsed: 0.344 sec
      [mvn] testIterator(org.apache.solr.common.util.TestNamedListCodec)  Time elapsed: 0.003 sec
      [mvn] testIterable(org.apache.solr.common.util.TestNamedListCodec)  Time elapsed: 0.002 sec
      [mvn] testSimple(org.apache.solr.common.util.TestNamedListCodec)  Time elapsed: 0.002 sec
      [mvn] Running org.apache.solr.client.solrj.embedded.TestEmbeddedSolrServer
      [mvn] Tests run: 2, Failures: 0, Errors: 0, Skipped: 0, Time elapsed: 1.094 sec - in org.apache.solr.client.solrj.embedded.TestEmbeddedSolrServer
      [mvn] testShutdown(org.apache.solr.client.solrj.embedded.TestEmbeddedSolrServer)  Time elapsed: 0.596 sec
      [mvn] testGetCoreContainer(org.apache.solr.client.solrj.embedded.TestEmbeddedSolrServer)  Time elapsed: 0.472 sec
      [mvn] Running org.apache.solr.client.solrj.response.FacetFieldTest
      [mvn] Tests run: 1, Failures: 0, Errors: 0, Skipped: 0, Time elapsed: 0 sec - in org.apache.solr.client.solrj.response.FacetFieldTest
      [mvn] testGetValues(org.apache.solr.client.solrj.response.FacetFieldTest)  Time elapsed: 0 sec
      [mvn] Running org.apache.solr.client.solrj.impl.ConcurrentUpdateSolrServerTest
      [mvn] Tests run: 1, Failures: 0, Errors: 0, Skipped: 0, Time elapsed: 10.647 sec - in org.apache.solr.client.solrj.impl.ConcurrentUpdateSolrServerTest
      [mvn] testConcurrentUpdate(org.apache.solr.client.solrj.impl.ConcurrentUpdateSolrServerTest)  Time elapsed: 4.912 sec
      [mvn] Running org.apache.solr.client.solrj.impl.LBHttpSolrServerTest
      [mvn] Tests run: 1, Failures: 0, Errors: 0, Skipped: 0, Time elapsed: 0 sec - in org.apache.solr.client.solrj.impl.LBHttpSolrServerTest
      [mvn] testLBHttpSolrServerHttpClientResponseParserStringArray(org.apache.solr.client.solrj.impl.LBHttpSolrServerTest)  Time elapsed: 0 sec
      [mvn] Running org.apache.solr.common.util.TestJsonRecordReader
      [mvn] Tests run: 3, Failures: 0, Errors: 0, Skipped: 0, Time elapsed: 0.036 sec - in org.apache.solr.common.util.TestJsonRecordReader
      [mvn] testRecursiveWildcard2(org.apache.solr.common.util.TestJsonRecordReader)  Time elapsed: 0.002 sec
      [mvn] testOneLevelSplit(org.apache.solr.common.util.TestJsonRecordReader)  Time elapsed: 0.003 sec
      [mvn] testRecursiveWildCard(org.apache.solr.common.util.TestJsonRecordReader)  Time elapsed: 0.004 sec
      [mvn] Running org.apache.solr.client.solrj.request.TestCoreAdmin
      [mvn] Tests run: 3, Failures: 0, Errors: 0, Skipped: 0, Time elapsed: 1.784 sec - in org.apache.solr.client.solrj.request.TestCoreAdmin
      [mvn] testErrorCases(org.apache.solr.client.solrj.request.TestCoreAdmin)  Time elapsed: 0.749 sec
      [mvn] testCustomUlogDir(org.apache.solr.client.solrj.request.TestCoreAdmin)  Time elapsed: 0.533 sec
      [mvn] testConfigSet(org.apache.solr.client.solrj.request.TestCoreAdmin)  Time elapsed: 0.475 sec
      [mvn] Running org.apache.solr.client.solrj.embedded.SolrExampleEmbeddedTest
      [mvn] Tests run: 28, Failures: 0, Errors: 0, Skipped: 0, Time elapsed: 15.222 sec - in org.apache.solr.client.solrj.embedded.SolrExampleEmbeddedTest
      [mvn] testStatistics(org.apache.solr.client.solrj.embedded.SolrExampleEmbeddedTest)  Time elapsed: 0.821 sec
      [mvn] testErrorHandling(org.apache.solr.client.solrj.embedded.SolrExampleEmbeddedTest)  Time elapsed: 0.008 sec
      [mvn] testMultiContentStreamRequest(org.apache.solr.client.solrj.embedded.SolrExampleEmbeddedTest)  Time elapsed: 0.256 sec
      [mvn] testUnicode(org.apache.solr.client.solrj.embedded.SolrExampleEmbeddedTest)  Time elapsed: 1.551 sec
      [mvn] testAddRetrieve(org.apache.solr.client.solrj.embedded.SolrExampleEmbeddedTest)  Time elapsed: 0.32 sec
      [mvn] testSetNullUpdateOrder(org.apache.solr.client.solrj.embedded.SolrExampleEmbeddedTest)  Time elapsed: 0.283 sec
      [mvn] testFaceting(org.apache.solr.client.solrj.embedded.SolrExampleEmbeddedTest)  Time elapsed: 0.269 sec
      [mvn] testSetNullUpdates(org.apache.solr.client.solrj.embedded.SolrExampleEmbeddedTest)  Time elapsed: 0.276 sec
      [mvn] testUpdateField(org.apache.solr.client.solrj.embedded.SolrExampleEmbeddedTest)  Time elapsed: 0.536 sec
      [mvn] testUpdateMultiValuedField(org.apache.solr.client.solrj.embedded.SolrExampleEmbeddedTest)  Time elapsed: 0.443 sec
      [mvn] testQueryWithParams(org.apache.solr.client.solrj.embedded.SolrExampleEmbeddedTest)  Time elapsed: 0.003 sec
      [mvn] testAddDelete(org.apache.solr.client.solrj.embedded.SolrExampleEmbeddedTest)  Time elapsed: 0.756 sec
      [mvn] testExampleConfig(org.apache.solr.client.solrj.embedded.SolrExampleEmbeddedTest)  Time elapsed: 0.513 sec
      [mvn] testAugmentFields(org.apache.solr.client.solrj.embedded.SolrExampleEmbeddedTest)  Time elapsed: 0.324 sec
      [mvn] testCommitWithinOnAdd(org.apache.solr.client.solrj.embedded.SolrExampleEmbeddedTest)  Time elapsed: 1.999 sec
      [mvn] testFieldGlobbing(org.apache.solr.client.solrj.embedded.SolrExampleEmbeddedTest)  Time elapsed: 0.239 sec
      [mvn] testChildDoctransformer(org.apache.solr.client.solrj.embedded.SolrExampleEmbeddedTest)  Time elapsed: 0.714 sec
      [mvn] testRealtimeGet(org.apache.solr.client.solrj.embedded.SolrExampleEmbeddedTest)  Time elapsed: 0.29 sec
      [mvn] testChineseDefaults(org.apache.solr.client.solrj.embedded.SolrExampleEmbeddedTest)  Time elapsed: 0.368 sec
      [mvn] testGetEmptyResults(org.apache.solr.client.solrj.embedded.SolrExampleEmbeddedTest)  Time elapsed: 0.251 sec
      [mvn] testStreamingRequest(org.apache.solr.client.solrj.embedded.SolrExampleEmbeddedTest)  Time elapsed: 0.256 sec
      [mvn] testPivotFacetsMissing(org.apache.solr.client.solrj.embedded.SolrExampleEmbeddedTest)  Time elapsed: 0.267 sec
      [mvn] testCommitWithinOnDelete(org.apache.solr.client.solrj.embedded.SolrExampleEmbeddedTest)  Time elapsed: 1.411 sec
      [mvn] testPivotFacets(org.apache.solr.client.solrj.embedded.SolrExampleEmbeddedTest)  Time elapsed: 0.394 sec
      [mvn] testPingHandler(org.apache.solr.client.solrj.embedded.SolrExampleEmbeddedTest)  Time elapsed: 0.203 sec
      [mvn] testContentStreamRequest(org.apache.solr.client.solrj.embedded.SolrExampleEmbeddedTest)  Time elapsed: 0.256 sec
      [mvn] testUpdateRequestWithParameters(org.apache.solr.client.solrj.embedded.SolrExampleEmbeddedTest)  Time elapsed: 0.262 sec
      [mvn] testLukeHandler(org.apache.solr.client.solrj.embedded.SolrExampleEmbeddedTest)  Time elapsed: 0.203 sec
      [mvn] Running org.apache.solr.common.params.SolrParamTest
      [mvn] Tests run: 1, Failures: 0, Errors: 0, Skipped: 0, Time elapsed: 0 sec - in org.apache.solr.common.params.SolrParamTest
      [mvn] testGetParams(org.apache.solr.common.params.SolrParamTest)  Time elapsed: 0 sec
      [mvn] Running org.apache.solr.client.solrj.response.NoOpResponseParserTest
      [mvn] Tests run: 3, Failures: 0, Errors: 0, Skipped: 0, Time elapsed: 6.193 sec - in org.apache.solr.client.solrj.response.NoOpResponseParserTest
      [mvn] testInputStreamResponse(org.apache.solr.client.solrj.response.NoOpResponseParserTest)  Time elapsed: 0.136 sec
      [mvn] testQueryParse(org.apache.solr.client.solrj.response.NoOpResponseParserTest)  Time elapsed: 0.162 sec
      [mvn] testReaderResponse(org.apache.solr.client.solrj.response.NoOpResponseParserTest)  Time elapsed: 0.173 sec
      [mvn] Running org.apache.solr.common.util.IteratorChainTest
      [mvn] Tests run: 7, Failures: 0, Errors: 0, Skipped: 0, Time elapsed: 0.024 sec - in org.apache.solr.common.util.IteratorChainTest
      [mvn] testTwoIterators(org.apache.solr.common.util.IteratorChainTest)  Time elapsed: 0.002 sec
      [mvn] testNoIterator(org.apache.solr.common.util.IteratorChainTest)  Time elapsed: 0.002 sec
      [mvn] testCallNextTooEarly(org.apache.solr.common.util.IteratorChainTest)  Time elapsed: 0.001 sec
      [mvn] testEmptyIteratorsInTheMiddle(org.apache.solr.common.util.IteratorChainTest)  Time elapsed: 0.001 sec
      [mvn] testRemove(org.apache.solr.common.util.IteratorChainTest)  Time elapsed: 0.002 sec
      [mvn] testOneIterator(org.apache.solr.common.util.IteratorChainTest)  Time elapsed: 0.001 sec
      [mvn] testCallAddTooLate(org.apache.solr.common.util.IteratorChainTest)  Time elapsed: 0.002 sec
      [mvn] Running org.apache.solr.client.solrj.request.TestUpdateRequestCodec
      [mvn] Tests run: 3, Failures: 0, Errors: 0, Skipped: 0, Time elapsed: 0.029 sec - in org.apache.solr.client.solrj.request.TestUpdateRequestCodec
      [mvn] testBackCompat4_5(org.apache.solr.client.solrj.request.TestUpdateRequestCodec)  Time elapsed: 0.018 sec
      [mvn] simple(org.apache.solr.client.solrj.request.TestUpdateRequestCodec)  Time elapsed: 0 sec
      [mvn] testIteratable(org.apache.solr.client.solrj.request.TestUpdateRequestCodec)  Time elapsed: 0 sec
      [mvn] Running org.apache.solr.client.solrj.embedded.MergeIndexesEmbeddedTest
      [mvn] Tests run: 3, Failures: 0, Errors: 0, Skipped: 0, Time elapsed: 1.67 sec - in org.apache.solr.client.solrj.embedded.MergeIndexesEmbeddedTest
      [mvn] testMergeMultipleRequest(org.apache.solr.client.solrj.embedded.MergeIndexesEmbeddedTest)  Time elapsed: 0.713 sec
      [mvn] testMergeIndexesByDirName(org.apache.solr.client.solrj.embedded.MergeIndexesEmbeddedTest)  Time elapsed: 0.477 sec
      [mvn] testMergeIndexesByCoreName(org.apache.solr.client.solrj.embedded.MergeIndexesEmbeddedTest)  Time elapsed: 0.454 sec
      [mvn] 
      [mvn] Results :
      [mvn] 
      [mvn] Tests in error: 
      [mvn]   SolrExampleBinaryTest>SolrExampleTests.testChildDoctransformer:1373 ? RemoteSolr
      [mvn] 
      [mvn] Tests run: 313, Failures: 0, Errors: 1, Skipped: 0
      [mvn] 
      [mvn] [INFO] ------------------------------------------------------------------------
      [mvn] [INFO] Building Apache Solr Solrj aggregator POM
      [mvn] [INFO]    task-segment: [install]
      [mvn] [INFO] ------------------------------------------------------------------------
      [mvn] [INFO] [groovy:execute {execution: generate-timestamps-and-get-top-level-basedir}]
      [mvn] [INFO] [buildnumber:create {execution: default}]
      [mvn] [INFO] [enforcer:enforce {execution: enforce-java-compat-version-and-maven-2.2.1}]
      [mvn] [INFO] [remote-resources:process {execution: default}]
      [mvn] [INFO] [bundle:manifest {execution: bundle-manifest}]
      [mvn] [WARNING] Ignoring project type pom - supportedProjectTypes = [jar, bundle]
      [mvn] [INFO] [forbiddenapis:check {execution: solr-shared-check-forbidden-apis}]
      [mvn] [INFO] Skipping execution for packaging "pom"
      [mvn] [INFO] [forbiddenapis:testCheck {execution: solr-shared-test-check-forbidden-apis}]
      [mvn] [INFO] Skipping execution for packaging "pom"
      [mvn] [INFO] [site:attach-descriptor {execution: default-attach-descriptor}]
      [mvn] [INFO] [install:install {execution: default-install}]
      [mvn] [INFO] Installing /usr/home/jenkins/jenkins-slave/workspace/Lucene-Solr-Maven-4.x/maven-build/solr/solrj/pom.xml to /home/jenkins/.m2/repository/org/apache/solr/solr-solrj-aggregator/4.11.0-SNAPSHOT/solr-solrj-aggregator-4.11.0-SNAPSHOT.pom
      [mvn] [INFO] ------------------------------------------------------------------------
      [mvn] [INFO] Building Apache Solr Search Server
      [mvn] [INFO]    task-segment: [install]
      [mvn] [INFO] ------------------------------------------------------------------------
      [mvn] [INFO] [groovy:execute {execution: generate-timestamps-and-get-top-level-basedir}]
      [mvn] [INFO] [buildnumber:create {execution: default}]
      [mvn] [INFO] [enforcer:enforce {execution: enforce-java-compat-version-and-maven-2.2.1}]
      [mvn] [INFO] [remote-resources:process {execution: default}]
      [mvn] [INFO] [resources:resources {execution: default-resources}]
      [mvn] [INFO] Using 'UTF-8' encoding to copy filtered resources.
      [mvn] [INFO] skip non existing resourceDirectory /usr/home/jenkins/jenkins-slave/workspace/Lucene-Solr-Maven-4.x/maven-build/solr/webapp/src/main/resources
      [mvn] [INFO] Copying 3 resources
      [mvn] [INFO] [compiler:compile {execution: default-compile}]
      [mvn] [INFO] No sources to compile
      [mvn] [INFO] [bundle:manifest {execution: bundle-manifest}]
      [mvn] [WARNING] Ignoring project type war - supportedProjectTypes = [jar, bundle]
      [mvn] [INFO] [resources:testResources {execution: default-testResources}]
      [mvn] [INFO] Using 'UTF-8' encoding to copy filtered resources.
      [mvn] [INFO] skip non existing resourceDirectory /usr/home/jenkins/jenkins-slave/workspace/Lucene-Solr-Maven-4.x/maven-build/solr/webapp/src/test/resources
      [mvn] [INFO] Copying 3 resources
      [mvn] [INFO] [compiler:testCompile {execution: default-testCompile}]
      [mvn] [INFO] No sources to compile
      [mvn] [INFO] [surefire:test {execution: default-test}]
      [mvn] [INFO] [war:war {execution: default-war}]
      [mvn] [INFO] Packaging webapp
      [mvn] [INFO] Assembling webapp [solr] in [/usr/home/jenkins/jenkins-slave/workspace/Lucene-Solr-Maven-4.x/maven-build/solr/webapp/null/solr-4.11.0-SNAPSHOT]
      [mvn] [INFO] Processing war project
      [mvn] [INFO] Copying webapp resources [/usr/home/jenkins/jenkins-slave/workspace/Lucene-Solr-Maven-4.x/solr/webapp/web]
      [mvn] [INFO] Webapp assembled in [692 msecs]
      [mvn] [INFO] Building war: /usr/home/jenkins/jenkins-slave/workspace/Lucene-Solr-Maven-4.x/maven-build/solr/webapp/null/solr-4.11.0-SNAPSHOT.war
      [mvn] [INFO] [install:install {execution: default-install}]
      [mvn] [INFO] Installing /usr/home/jenkins/jenkins-slave/workspace/Lucene-Solr-Maven-4.x/maven-build/solr/webapp/null/solr-4.11.0-SNAPSHOT.war to /home/jenkins/.m2/repository/org/apache/solr/solr/4.11.0-SNAPSHOT/solr-4.11.0-SNAPSHOT.war
      [mvn] [INFO] ------------------------------------------------------------------------
      [mvn] [INFO] Building Apache Solr Clustering
      [mvn] [INFO]    task-segment: [install]
      [mvn] [INFO] ------------------------------------------------------------------------
      [mvn] [INFO] [groovy:execute {execution: generate-timestamps-and-get-top-level-basedir}]
      [mvn] [INFO] [buildnumber:create {execution: default}]
      [mvn] [INFO] [enforcer:enforce {execution: enforce-java-compat-version-and-maven-2.2.1}]
      [mvn] [INFO] [remote-resources:process {execution: default}]
      [mvn] [INFO] [resources:resources {execution: default-resources}]
      [mvn] [INFO] Using 'UTF-8' encoding to copy filtered resources.
      [mvn] [INFO] skip non existing resourceDirectory /usr/home/jenkins/jenkins-slave/workspace/Lucene-Solr-Maven-4.x/maven-build/solr/contrib/clustering/src/main/resources
      [mvn] [INFO] Copying 3 resources
      [mvn] [INFO] [compiler:compile {execution: default-compile}]
      [mvn] [INFO] Changes detected - recompiling the module!
      [mvn] [INFO] Compiling 11 source files to /usr/home/jenkins/jenkins-slave/workspace/Lucene-Solr-Maven-4.x/maven-build/solr/contrib/clustering/target/classes
      [mvn] [INFO] [bundle:manifest {execution: bundle-manifest}]
      [mvn] [INFO] [forbiddenapis:check {execution: solr-shared-check-forbidden-apis}]
      [mvn] [INFO] Scanning for classes to check...
      [mvn] [INFO] Reading bundled API signatures: jdk-unsafe
      [mvn] [INFO] Reading bundled API signatures: jdk-deprecated
      [mvn] [INFO] Reading API signatures: /usr/home/jenkins/jenkins-slave/workspace/Lucene-Solr-Maven-4.x/lucene/tools/forbiddenApis/base.txt
      [mvn] [INFO] Loading classes to check...
      [mvn] [INFO] Scanning for API signatures and dependencies...
      [mvn] [INFO] Scanned 23 (and 353 related) class file(s) for forbidden API invocations (in 0.07s), 0 error(s).
      [mvn] [INFO] [resources:testResources {execution: default-testResources}]
      [mvn] [INFO] Using 'UTF-8' encoding to copy filtered resources.
      [mvn] [INFO] Copying 13 resources
      [mvn] [INFO] Copying 1 resource
      [mvn] [INFO] Copying 3 resources
      [mvn] [INFO] [compiler:testCompile {execution: default-testCompile}]
      [mvn] [INFO] Changes detected - recompiling the module!
      [mvn] [INFO] Compiling 12 source files to /usr/home/jenkins/jenkins-slave/workspace/Lucene-Solr-Maven-4.x/maven-build/solr/contrib/clustering/target/test-classes
      [mvn] [INFO] [forbiddenapis:testCheck {execution: solr-shared-test-check-forbidden-apis}]
      [mvn] [INFO] Scanning for classes to check...
      [mvn] [INFO] Reading bundled API signatures: jdk-unsafe
      [mvn] [INFO] Reading bundled API signatures: jdk-deprecated
      [mvn] [INFO] Reading API signatures: /usr/home/jenkins/jenkins-slave/workspace/Lucene-Solr-Maven-4.x/lucene/tools/forbiddenApis/tests.txt
      [mvn] [INFO] Reading API signatures: /usr/home/jenkins/jenkins-slave/workspace/Lucene-Solr-Maven-4.x/lucene/tools/forbiddenApis/base.txt
      [mvn] [INFO] Loading classes to check...
      [mvn] [INFO] Scanning for API signatures and dependencies...
      [mvn] [INFO] Scanned 14 (and 292 related) class file(s) for forbidden API invocations (in 0.06s), 0 error(s).
      [mvn] [INFO] [surefire:test {execution: default-test}]
      [mvn] [INFO] Surefire report directory: /usr/home/jenkins/jenkins-slave/workspace/Lucene-Solr-Maven-4.x/maven-build/solr/contrib/clustering/target/surefire-reports
      [mvn] 
      [mvn] -------------------------------------------------------
      [mvn]  T E S T S
      [mvn] -------------------------------------------------------
      [mvn] Running org.apache.solr.handler.clustering.ClusteringComponentTest
      [mvn] Tests run: 1, Failures: 0, Errors: 0, Skipped: 0, Time elapsed: 4.66 sec - in org.apache.solr.handler.clustering.ClusteringComponentTest
      [mvn] testComponent(org.apache.solr.handler.clustering.ClusteringComponentTest)  Time elapsed: 0.508 sec
      [mvn] Running org.apache.solr.handler.clustering.carrot2.CarrotClusteringEngineTest
      [mvn] Tests run: 28, Failures: 0, Errors: 0, Skipped: 0, Time elapsed: 2.139 sec - in org.apache.solr.handler.clustering.carrot2.CarrotClusteringEngineTest
      [mvn] testClusterScores(org.apache.solr.handler.clustering.carrot2.CarrotClusteringEngineTest)  Time elapsed: 0.073 sec
      [mvn] testDefaultEngineOrder(org.apache.solr.handler.clustering.carrot2.CarrotClusteringEngineTest)  Time elapsed: 0.019 sec
      [mvn] testNumDescriptions(org.apache.solr.handler.clustering.carrot2.CarrotClusteringEngineTest)  Time elapsed: 0.035 sec
      [mvn] testDeclarationEngineOrder(org.apache.solr.handler.clustering.carrot2.CarrotClusteringEngineTest)  Time elapsed: 0.016 sec
      [mvn] testCarrotAttributePassing(org.apache.solr.handler.clustering.carrot2.CarrotClusteringEngineTest)  Time elapsed: 0.025 sec
      [mvn] testHighlightingOfMultiValueField(org.apache.solr.handler.clustering.carrot2.CarrotClusteringEngineTest)  Time elapsed: 0.052 sec
      [mvn] testLexicalResourcesFromSolrConfigCustomDirDeprecated(org.apache.solr.handler.clustering.carrot2.CarrotClusteringEngineTest)  Time elapsed: 0.099 sec
      [mvn] testPassingOfCustomFields(org.apache.solr.handler.clustering.carrot2.CarrotClusteringEngineTest)  Time elapsed: 0.018 sec
      [mvn] testExternalXmlAttributesFile(org.apache.solr.handler.clustering.carrot2.CarrotClusteringEngineTest)  Time elapsed: 0.02 sec
      [mvn] testLanguageCodeMapping(org.apache.solr.handler.clustering.carrot2.CarrotClusteringEngineTest)  Time elapsed: 0.016 sec
      [mvn] testOneCarrot2SupportedLanguage(org.apache.solr.handler.clustering.carrot2.CarrotClusteringEngineTest)  Time elapsed: 0.016 sec
      [mvn] testOneCarrot2SupportedLanguageOfMany(org.apache.solr.handler.clustering.carrot2.CarrotClusteringEngineTest)  Time elapsed: 0.014 sec
      [mvn] testCarrotLingo(org.apache.solr.handler.clustering.carrot2.CarrotClusteringEngineTest)  Time elapsed: 0.149 sec
      [mvn] testProduceSummary(org.apache.solr.handler.clustering.carrot2.CarrotClusteringEngineTest)  Time elapsed: 0.064 sec
      [mvn] testCustomStemmer(org.apache.solr.handler.clustering.carrot2.CarrotClusteringEngineTest)  Time elapsed: 0.136 sec
      [mvn] testWithSubclusters(org.apache.solr.handler.clustering.carrot2.CarrotClusteringEngineTest)  Time elapsed: 0.019 sec
      [mvn] testConcatenatingMultipleFields(org.apache.solr.handler.clustering.carrot2.CarrotClusteringEngineTest)  Time elapsed: 0.011 sec
      [mvn] testLexicalResourcesFromSolrConfigCustomDir(org.apache.solr.handler.clustering.carrot2.CarrotClusteringEngineTest)  Time elapsed: 0.069 sec
      [mvn] testWithoutSubclusters(org.apache.solr.handler.clustering.carrot2.CarrotClusteringEngineTest)  Time elapsed: 0.019 sec
      [mvn] testLexicalResourcesFromSolrConfigDefaultDir(org.apache.solr.handler.clustering.carrot2.CarrotClusteringEngineTest)  Time elapsed: 0.068 sec
      [mvn] testSolrStopWordsNotDefinedOnAFieldForClustering(org.apache.solr.handler.clustering.carrot2.CarrotClusteringEngineTest)  Time elapsed: 0.014 sec
      [mvn] testCarrotStc(org.apache.solr.handler.clustering.carrot2.CarrotClusteringEngineTest)  Time elapsed: 0.091 sec
      [mvn] testDeclarationNameDuplicates(org.apache.solr.handler.clustering.carrot2.CarrotClusteringEngineTest)  Time elapsed: 0.006 sec
      [mvn] testCustomTokenizer(org.apache.solr.handler.clustering.carrot2.CarrotClusteringEngineTest)  Time elapsed: 0.049 sec
      [mvn] testOtherTopics(org.apache.solr.handler.clustering.carrot2.CarrotClusteringEngineTest)  Time elapsed: 0.011 sec
      [mvn] testHighlightingMultipleFields(org.apache.solr.handler.clustering.carrot2.CarrotClusteringEngineTest)  Time elapsed: 0.009 sec
      [mvn] testSolrStopWordsUsedInCarrot2Clustering(org.apache.solr.handler.clustering.carrot2.CarrotClusteringEngineTest)  Time elapsed: 0.009 sec
      [mvn] testSummaryFragSize(org.apache.solr.handler.clustering.carrot2.CarrotClusteringEngineTest)  Time elapsed: 0.065 sec
      [mvn] Running org.apache.solr.handler.clustering.DistributedClusteringComponentTest
      [mvn] Tests run: 1, Failures: 0, Errors: 0, Skipped: 0, Time elapsed: 51.193 sec - in org.apache.solr.handler.clustering.DistributedClusteringComponentTest
      [mvn] testDistribSearch(org.apache.solr.handler.clustering.DistributedClusteringComponentTest)  Time elapsed: 51.137 sec
      [mvn] 
      [mvn] Results :
      [mvn] 
      [mvn] Tests run: 30, Failures: 0, Errors: 0, Skipped: 0
      [mvn] 
      [mvn] [INFO] [jar:jar {execution: default-jar}]
      [mvn] [INFO] Building jar: /usr/home/jenkins/jenkins-slave/workspace/Lucene-Solr-Maven-4.x/maven-build/solr/contrib/clustering/target/solr-clustering-4.11.0-SNAPSHOT.jar
      [mvn] [INFO] [install:install {execution: default-install}]
      [mvn] [INFO] Installing /usr/home/jenkins/jenkins-slave/workspace/Lucene-Solr-Maven-4.x/maven-build/solr/contrib/clustering/target/solr-clustering-4.11.0-SNAPSHOT.jar to /home/jenkins/.m2/repository/org/apache/solr/solr-clustering/4.11.0-SNAPSHOT/solr-clustering-4.11.0-SNAPSHOT.jar
      [mvn] [INFO] ------------------------------------------------------------------------
      [mvn] [INFO] Building Apache Solr DataImportHandler
      [mvn] [INFO]    task-segment: [install]
      [mvn] [INFO] ------------------------------------------------------------------------
      [mvn] [INFO] [groovy:execute {execution: generate-timestamps-and-get-top-level-basedir}]
      [mvn] [INFO] [buildnumber:create {execution: default}]
      [mvn] [INFO] [enforcer:enforce {execution: enforce-java-compat-version-and-maven-2.2.1}]
      [mvn] [INFO] [remote-resources:process {execution: default}]
      [mvn] [INFO] [resources:resources {execution: default-resources}]
      [mvn] [INFO] Using 'UTF-8' encoding to copy filtered resources.
      [mvn] [INFO] skip non existing resourceDirectory /usr/home/jenkins/jenkins-slave/workspace/Lucene-Solr-Maven-4.x/maven-build/solr/contrib/dataimporthandler/src/main/resources
      [mvn] [INFO] Copying 3 resources
      [mvn] [INFO] [compiler:compile {execution: default-compile}]
      [mvn] [INFO] Changes detected - recompiling the module!
      [mvn] [INFO] Compiling 68 source files to /usr/home/jenkins/jenkins-slave/workspace/Lucene-Solr-Maven-4.x/maven-build/solr/contrib/dataimporthandler/target/classes
      [mvn] [WARNING] /usr/home/jenkins/jenkins-slave/workspace/Lucene-Solr-Maven-4.x/solr/contrib/dataimporthandler/src/java/org/apache/solr/handler/dataimport/DocBuilder.java: Some input files use unchecked or unsafe operations.
      [mvn] [WARNING] /usr/home/jenkins/jenkins-slave/workspace/Lucene-Solr-Maven-4.x/solr/contrib/dataimporthandler/src/java/org/apache/solr/handler/dataimport/DocBuilder.java: Recompile with -Xlint:unchecked for details.
      [mvn] [INFO] [bundle:manifest {execution: bundle-manifest}]
      [mvn] [INFO] [forbiddenapis:check {execution: solr-shared-check-forbidden-apis}]
      [mvn] [INFO] Scanning for classes to check...
      [mvn] [INFO] Reading bundled API signatures: jdk-unsafe
      [mvn] [INFO] Reading bundled API signatures: jdk-deprecated
      [mvn] [INFO] Reading API signatures: /usr/home/jenkins/jenkins-slave/workspace/Lucene-Solr-Maven-4.x/lucene/tools/forbiddenApis/base.txt
      [mvn] [INFO] Loading classes to check...
      [mvn] [INFO] Scanning for API signatures and dependencies...
      [mvn] [INFO] Scanned 103 (and 380 related) class file(s) for forbidden API invocations (in 0.08s), 0 error(s).
      [mvn] [INFO] [resources:testResources {execution: default-testResources}]
      [mvn] [INFO] Using 'UTF-8' encoding to copy filtered resources.
      [mvn] [INFO] Copying 15 resources
      [mvn] [INFO] Copying 1 resource
      [mvn] [INFO] Copying 3 resources
      [mvn] [INFO] [compiler:testCompile {execution: default-testCompile}]
      [mvn] [INFO] Changes detected - recompiling the module!
      [mvn] [INFO] Compiling 46 source files to /usr/home/jenkins/jenkins-slave/workspace/Lucene-Solr-Maven-4.x/maven-build/solr/contrib/dataimporthandler/target/test-classes
      [mvn] [WARNING] /usr/home/jenkins/jenkins-slave/workspace/Lucene-Solr-Maven-4.x/solr/contrib/dataimporthandler/src/test/org/apache/solr/handler/dataimport/TestJdbcDataSourceConvertType.java: /usr/home/jenkins/jenkins-slave/workspace/Lucene-Solr-Maven-4.x/solr/contrib/dataimporthandler/src/test/org/apache/solr/handler/dataimport/TestJdbcDataSourceConvertType.java uses or overrides a deprecated API.
      [mvn] [WARNING] /usr/home/jenkins/jenkins-slave/workspace/Lucene-Solr-Maven-4.x/solr/contrib/dataimporthandler/src/test/org/apache/solr/handler/dataimport/TestJdbcDataSourceConvertType.java: Recompile with -Xlint:deprecation for details.
      [mvn] [WARNING] /usr/home/jenkins/jenkins-slave/workspace/Lucene-Solr-Maven-4.x/solr/contrib/dataimporthandler/src/test/org/apache/solr/handler/dataimport/AbstractDataImportHandlerTestCase.java: Some input files use unchecked or unsafe operations.
      [mvn] [WARNING] /usr/home/jenkins/jenkins-slave/workspace/Lucene-Solr-Maven-4.x/solr/contrib/dataimporthandler/src/test/org/apache/solr/handler/dataimport/AbstractDataImportHandlerTestCase.java: Recompile with -Xlint:unchecked for details.
      [mvn] [INFO] [forbiddenapis:testCheck {execution: solr-shared-test-check-forbidden-apis}]
      [mvn] [INFO] Scanning for classes to check...
      [mvn] [INFO] Reading bundled API signatures: jdk-unsafe
      [mvn] [INFO] Reading bundled API signatures: jdk-deprecated
      [mvn] [INFO] Reading API signatures: /usr/home/jenkins/jenkins-slave/workspace/Lucene-Solr-Maven-4.x/lucene/tools/forbiddenApis/tests.txt
      [mvn] [INFO] Reading API signatures: /usr/home/jenkins/jenkins-slave/workspace/Lucene-Solr-Maven-4.x/lucene/tools/forbiddenApis/base.txt
      [mvn] [INFO] Loading classes to check...
      [mvn] [INFO] Scanning for API signatures and dependencies...
      [mvn] [INFO] Scanned 80 (and 385 related) class file(s) for forbidden API invocations (in 0.10s), 0 error(s).
      [mvn] [INFO] [surefire:test {execution: default-test}]
      [mvn] [INFO] Surefire report directory: /usr/home/jenkins/jenkins-slave/workspace/Lucene-Solr-Maven-4.x/maven-build/solr/contrib/dataimporthandler/target/surefire-reports
      [mvn] 
      [mvn] -------------------------------------------------------
      [mvn]  T E S T S
      [mvn] -------------------------------------------------------
      [mvn] Running org.apache.solr.handler.dataimport.TestVariableResolver
      [mvn] Tests run: 9, Failures: 0, Errors: 0, Skipped: 0, Time elapsed: 1.191 sec - in org.apache.solr.handler.dataimport.TestVariableResolver
      [mvn] testSimpleNamespace(org.apache.solr.handler.dataimport.TestVariableResolver)  Time elapsed: 0.083 sec
      [mvn] testDefaultNamespace(org.apache.solr.handler.dataimport.TestVariableResolver)  Time elapsed: 0.013 sec
      [mvn] dateNamespaceWithValue(org.apache.solr.handler.dataimport.TestVariableResolver)  Time elapsed: 0.028 sec
      [mvn] testDefaults(org.apache.solr.handler.dataimport.TestVariableResolver)  Time elapsed: 0.013 sec
      [mvn] dateNamespaceWithExpr(org.apache.solr.handler.dataimport.TestVariableResolver)  Time elapsed: 0.016 sec
      [mvn] testDefaultNamespace1(org.apache.solr.handler.dataimport.TestVariableResolver)  Time elapsed: 0.014 sec
      [mvn] testFunctionNamespace1(org.apache.solr.handler.dataimport.TestVariableResolver)  Time elapsed: 0.016 sec
      [mvn] test3LevelNestedNamespace(org.apache.solr.handler.dataimport.TestVariableResolver)  Time elapsed: 0.013 sec
      [mvn] testNestedNamespace(org.apache.solr.handler.dataimport.TestVariableResolver)  Time elapsed: 0.011 sec
      [mvn] Running org.apache.solr.handler.dataimport.TestDataConfig
      [mvn] Tests run: 2, Failures: 0, Errors: 0, Skipped: 0, Time elapsed: 2.524 sec - in org.apache.solr.handler.dataimport.TestDataConfig
      [mvn] testDataConfigWithDataSource(org.apache.solr.handler.dataimport.TestDataConfig)  Time elapsed: 0.41 sec
      [mvn] testBasic(org.apache.solr.handler.dataimport.TestDataConfig)  Time elapsed: 0.015 sec
      [mvn] Running org.apache.solr.handler.dataimport.TestLineEntityProcessor
      [mvn] Tests run: 4, Failures: 0, Errors: 0, Skipped: 0, Time elapsed: 0.131 sec - in org.apache.solr.handler.dataimport.TestLineEntityProcessor
      [mvn] testSimple(org.apache.solr.handler.dataimport.TestLineEntityProcessor)  Time elapsed: 0.009 sec
      [mvn] testNo_xsd_files(org.apache.solr.handler.dataimport.TestLineEntityProcessor)  Time elapsed: 0.012 sec
      [mvn] testOnly_xml_files_no_xsd(org.apache.solr.handler.dataimport.TestLineEntityProcessor)  Time elapsed: 0.011 sec
      [mvn] testOnly_xml_files(org.apache.solr.handler.dataimport.TestLineEntityProcessor)  Time elapsed: 0.011 sec
      [mvn] Running org.apache.solr.handler.dataimport.TestSqlEntityProcessor
      [mvn] Tests run: 6, Failures: 0, Errors: 0, Skipped: 1, Time elapsed: 2.466 sec - in org.apache.solr.handler.dataimport.TestSqlEntityProcessor
      [mvn] testSimpleCacheChildEntities(org.apache.solr.handler.dataimport.TestSqlEntityProcessor) skipped
      [mvn] testSingleEntity(org.apache.solr.handler.dataimport.TestSqlEntityProcessor)  Time elapsed: 0.397 sec
      [mvn] testCachedChildEntities(org.apache.solr.handler.dataimport.TestSqlEntityProcessor)  Time elapsed: 0.205 sec
      [mvn] testWithSimpleTransformer(org.apache.solr.handler.dataimport.TestSqlEntityProcessor)  Time elapsed: 0.153 sec
      [mvn] testChildEntities(org.apache.solr.handler.dataimport.TestSqlEntityProcessor)  Time elapsed: 0.164 sec
      [mvn] testWithComplexTransformer(org.apache.solr.handler.dataimport.TestSqlEntityProcessor)  Time elapsed: 0.273 sec
      [mvn] Running org.apache.solr.handler.dataimport.TestEphemeralCache
      [mvn] Tests run: 1, Failures: 0, Errors: 0, Skipped: 0, Time elapsed: 0.621 sec - in org.apache.solr.handler.dataimport.TestEphemeralCache
      [mvn] test(org.apache.solr.handler.dataimport.TestEphemeralCache)  Time elapsed: 0.097 sec
      [mvn] Running org.apache.solr.handler.dataimport.TestNestedChildren
      [mvn] Tests run: 1, Failures: 0, Errors: 0, Skipped: 0, Time elapsed: 2.273 sec - in org.apache.solr.handler.dataimport.TestNestedChildren
      [mvn] test(org.apache.solr.handler.dataimport.TestNestedChildren)  Time elapsed: 1.664 sec
      [mvn] Running org.apache.solr.handler.dataimport.TestXPathEntityProcessor
      [mvn] Tests run: 9, Failures: 0, Errors: 0, Skipped: 0, Time elapsed: 0.732 sec - in org.apache.solr.handler.dataimport.TestXPathEntityProcessor
      [mvn] testMultiValuedWithMultipleDocuments(org.apache.solr.handler.dataimport.TestXPathEntityProcessor)  Time elapsed: 0.015 sec
      [mvn] streamStopsAfterInterrupt(org.apache.solr.handler.dataimport.TestXPathEntityProcessor)  Time elapsed: 0.011 sec
      [mvn] withFieldsAndXpathStreamContinuesOnTimeout(org.apache.solr.handler.dataimport.TestXPathEntityProcessor)  Time elapsed: 0.312 sec
      [mvn] testMultiValued(org.apache.solr.handler.dataimport.TestXPathEntityProcessor)  Time elapsed: 0.037 sec
      [mvn] withFieldsAndXpathStream(org.apache.solr.handler.dataimport.TestXPathEntityProcessor)  Time elapsed: 0.009 sec
      [mvn] streamWritesMessageAfterBlockedAttempt(org.apache.solr.handler.dataimport.TestXPathEntityProcessor)  Time elapsed: 0.01 sec
      [mvn] withFieldsAndXpath(org.apache.solr.handler.dataimport.TestXPathEntityProcessor)  Time elapsed: 0.01 sec
      [mvn] withDefaultSolrAndXsl(org.apache.solr.handler.dataimport.TestXPathEntityProcessor)  Time elapsed: 0.252 sec
      [mvn] testMultiValuedFlatten(org.apache.solr.handler.dataimport.TestXPathEntityProcessor)  Time elapsed: 0.008 sec
      [mvn] Running org.apache.solr.handler.dataimport.TestJdbcDataSourceConvertType
      [mvn] Tests run: 1, Failures: 0, Errors: 0, Skipped: 1, Time elapsed: 0.049 sec - in org.apache.solr.handler.dataimport.TestJdbcDataSourceConvertType
      [mvn] testConvertType(org.apache.solr.handler.dataimport.TestJdbcDataSourceConvertType) skipped
      [mvn] Running org.apache.solr.handler.dataimport.TestPlainTextEntityProcessor
      [mvn] Tests run: 1, Failures: 0, Errors: 0, Skipped: 0, Time elapsed: 0.064 sec - in org.apache.solr.handler.dataimport.TestPlainTextEntityProcessor
      [mvn] testSimple(org.apache.solr.handler.dataimport.TestPlainTextEntityProcessor)  Time elapsed: 0.032 sec
      [mvn] Running org.apache.solr.handler.dataimport.TestEntityProcessorBase
      [mvn] Tests run: 1, Failures: 0, Errors: 0, Skipped: 0, Time elapsed: 0.039 sec - in org.apache.solr.handler.dataimport.TestEntityProcessorBase
      [mvn] multiTransformer(org.apache.solr.handler.dataimport.TestEntityProcessorBase)  Time elapsed: 0.004 sec
      [mvn] Running org.apache.solr.handler.dataimport.TestRegexTransformer
      [mvn] Tests run: 5, Failures: 0, Errors: 0, Skipped: 0, Time elapsed: 0.074 sec - in org.apache.solr.handler.dataimport.TestRegexTransformer
      [mvn] testGroupNames(org.apache.solr.handler.dataimport.TestRegexTransformer)  Time elapsed: 0.004 sec
      [mvn] testMultiValuedRegex(org.apache.solr.handler.dataimport.TestRegexTransformer)  Time elapsed: 0.007 sec
      [mvn] testMileage(org.apache.solr.handler.dataimport.TestRegexTransformer)  Time elapsed: 0.006 sec
      [mvn] testReplaceWith(org.apache.solr.handler.dataimport.TestRegexTransformer)  Time elapsed: 0.007 sec
      [mvn] testCommaSeparated(org.apache.solr.handler.dataimport.TestRegexTransformer)  Time elapsed: 0.006 sec
      [mvn] Running org.apache.solr.handler.dataimport.TestSolrEntityProcessorUnit
      [mvn] Tests run: 3, Failures: 0, Errors: 0, Skipped: 0, Time elapsed: 0.068 sec - in org.apache.solr.handler.dataimport.TestSolrEntityProcessorUnit
      [mvn] testMultiValuedFields(org.apache.solr.handler.dataimport.TestSolrEntityProcessorUnit)  Time elapsed: 0.008 sec
      [mvn] testQuery(org.apache.solr.handler.dataimport.TestSolrEntityProcessorUnit)  Time elapsed: 0.006 sec
      [mvn] testNumDocsGreaterThanRows(org.apache.solr.handler.dataimport.TestSolrEntityProcessorUnit)  Time elapsed: 0.015 sec
      [mvn] Running org.apache.solr.handler.dataimport.TestDateFormatTransformer
      [mvn] Tests run: 2, Failures: 0, Errors: 0, Skipped: 0, Time elapsed: 0.05 sec - in org.apache.solr.handler.dataimport.TestDateFormatTransformer
      [mvn] testTransformRow_SingleRow(org.apache.solr.handler.dataimport.TestDateFormatTransformer)  Time elapsed: 0.005 sec
      [mvn] testTransformRow_MultipleRows(org.apache.solr.handler.dataimport.TestDateFormatTransformer)  Time elapsed: 0.007 sec
      [mvn] Running org.apache.solr.handler.dataimport.TestErrorHandling
      [mvn] Tests run: 4, Failures: 0, Errors: 0, Skipped: 0, Time elapsed: 1.302 sec - in org.apache.solr.handler.dataimport.TestErrorHandling
      [mvn] testMalformedNonStreamingXml(org.apache.solr.handler.dataimport.TestErrorHandling)  Time elapsed: 0.12 sec
      [mvn] testMalformedStreamingXml(org.apache.solr.handler.dataimport.TestErrorHandling)  Time elapsed: 0.118 sec
      [mvn] testAbortOnError(org.apache.solr.handler.dataimport.TestErrorHandling)  Time elapsed: 0.09 sec
      [mvn] testTransformerErrorContinue(org.apache.solr.handler.dataimport.TestErrorHandling)  Time elapsed: 0.208 sec
      [mvn] Running org.apache.solr.handler.dataimport.TestDocBuilder
      [mvn] Tests run: 6, Failures: 0, Errors: 0, Skipped: 0, Time elapsed: 0.137 sec - in org.apache.solr.handler.dataimport.TestDocBuilder
      [mvn] testDeltaImportNoRows_MustNotCommit(org.apache.solr.handler.dataimport.TestDocBuilder)  Time elapsed: 0.031 sec
      [mvn] singleEntityOneRow(org.apache.solr.handler.dataimport.TestDocBuilder)  Time elapsed: 0.024 sec
      [mvn] loadClass(org.apache.solr.handler.dataimport.TestDocBuilder)  Time elapsed: 0.002 sec
      [mvn] singleEntityNoRows(org.apache.solr.handler.dataimport.TestDocBuilder)  Time elapsed: 0.024 sec
      [mvn] testImportCommand(org.apache.solr.handler.dataimport.TestDocBuilder)  Time elapsed: 0.024 sec
      [mvn] singleEntityMultipleRows(org.apache.solr.handler.dataimport.TestDocBuilder)  Time elapsed: 0.025 sec
      [mvn] Running org.apache.solr.handler.dataimport.TestFileListEntityProcessor
      [mvn] Tests run: 4, Failures: 0, Errors: 0, Skipped: 0, Time elapsed: 0.015 sec - in org.apache.solr.handler.dataimport.TestFileListEntityProcessor
      [mvn] testNTOT(org.apache.solr.handler.dataimport.TestFileListEntityProcessor)  Time elapsed: 0.002 sec
      [mvn] testRECURSION(org.apache.solr.handler.dataimport.TestFileListEntityProcessor)  Time elapsed: 0.002 sec
      [mvn] testSimple(org.apache.solr.handler.dataimport.TestFileListEntityProcessor)  Time elapsed: 0.002 sec
      [mvn] testBiggerSmallerFiles(org.apache.solr.handler.dataimport.TestFileListEntityProcessor)  Time elapsed: 0.002 sec
      [mvn] Running org.apache.solr.handler.dataimport.TestNonWritablePersistFile
      [mvn] Tests run: 1, Failures: 0, Errors: 0, Skipped: 0, Time elapsed: 0.529 sec - in org.apache.solr.handler.dataimport.TestNonWritablePersistFile
      [mvn] testNonWritablePersistFile(org.apache.solr.handler.dataimport.TestNonWritablePersistFile)  Time elapsed: 0.026 sec
      [mvn] Running org.apache.solr.handler.dataimport.TestSimplePropertiesWriter
      [mvn] Tests run: 1, Failures: 0, Errors: 0, Skipped: 0, Time elapsed: 1.721 sec - in org.apache.solr.handler.dataimport.TestSimplePropertiesWriter
      [mvn] testSimplePropertiesWriter(org.apache.solr.handler.dataimport.TestSimplePropertiesWriter)  Time elapsed: 1.217 sec
      [mvn] Running org.apache.solr.handler.dataimport.TestWriterImpl
      [mvn] Tests run: 1, Failures: 0, Errors: 0, Skipped: 0, Time elapsed: 0.612 sec - in org.apache.solr.handler.dataimport.TestWriterImpl
      [mvn] testDataConfigWithDataSource(org.apache.solr.handler.dataimport.TestWriterImpl)  Time elapsed: 0.061 sec
      [mvn] Running org.apache.solr.handler.dataimport.TestXPathRecordReader
      [mvn] Tests run: 22, Failures: 0, Errors: 0, Skipped: 0, Time elapsed: 0.141 sec - in org.apache.solr.handler.dataimport.TestXPathRecordReader
      [mvn] testAnother(org.apache.solr.handler.dataimport.TestXPathRecordReader)  Time elapsed: 0.002 sec
      [mvn] testElems2LevelEmpty(org.apache.solr.handler.dataimport.TestXPathRecordReader)  Time elapsed: 0.002 sec
      [mvn] testElems2LevelMissing(org.apache.solr.handler.dataimport.TestXPathRecordReader)  Time elapsed: 0.002 sec
      [mvn] testError(org.apache.solr.handler.dataimport.TestXPathRecordReader)  Time elapsed: 0.002 sec
      [mvn] testUnsupported_Xpaths(org.apache.solr.handler.dataimport.TestXPathRecordReader)  Time elapsed: 0.002 sec
      [mvn] testAny_decendent_from_root(org.apache.solr.handler.dataimport.TestXPathRecordReader)  Time elapsed: 0.003 sec
      [mvn] testElems2LevelWithAttribVal(org.apache.solr.handler.dataimport.TestXPathRecordReader)  Time elapsed: 0.002 sec
      [mvn] testAttributes2Level(org.apache.solr.handler.dataimport.TestXPathRecordReader)  Time elapsed: 0.003 sec
      [mvn] testElems2LevelWithAttrib(org.apache.solr.handler.dataimport.TestXPathRecordReader)  Time elapsed: 0.002 sec
      [mvn] testElems2LevelWithAttribMultiple(org.apache.solr.handler.dataimport.TestXPathRecordReader)  Time elapsed: 0.003 sec
      [mvn] testMixedContentFlattened(org.apache.solr.handler.dataimport.TestXPathRecordReader)  Time elapsed: 0.002 sec
      [mvn] testPutNullTest(org.apache.solr.handler.dataimport.TestXPathRecordReader)  Time elapsed: 0.006 sec
      [mvn] testAny_decendent_of_a_child1(org.apache.solr.handler.dataimport.TestXPathRecordReader)  Time elapsed: 0.009 sec
      [mvn] testAttrInRoot(org.apache.solr.handler.dataimport.TestXPathRecordReader)  Time elapsed: 0.009 sec
      [mvn] testAttribValWithSlash(org.apache.solr.handler.dataimport.TestXPathRecordReader)  Time elapsed: 0.01 sec
      [mvn] testAttributes2LevelMissingAttrVal(org.apache.solr.handler.dataimport.TestXPathRecordReader)  Time elapsed: 0.01 sec
      [mvn] testSameForEachAndXpath(org.apache.solr.handler.dataimport.TestXPathRecordReader)  Time elapsed: 0.008 sec
      [mvn] testMixedContent(org.apache.solr.handler.dataimport.TestXPathRecordReader)  Time elapsed: 0.008 sec
      [mvn] testAttributes(org.apache.solr.handler.dataimport.TestXPathRecordReader)  Time elapsed: 0.009 sec
      [mvn] testBasic(org.apache.solr.handler.dataimport.TestXPathRecordReader)  Time elapsed: 0.008 sec
      [mvn] testAttributes2LevelHetero(org.apache.solr.handler.dataimport.TestXPathRecordReader)  Time elapsed: 0.009 sec
      [mvn] testAny_decendent_of_a_child2(org.apache.solr.handler.dataimport.TestXPathRecordReader)  Time elapsed: 0.013 sec
      [mvn] Running org.apache.solr.handler.dataimport.TestContentStreamDataSource
      [mvn] Tests run: 2, Failures: 0, Errors: 0, Skipped: 0, Time elapsed: 12.817 sec - in org.apache.solr.handler.dataimport.TestContentStreamDataSource
      [mvn] testSimple(org.apache.solr.handler.dataimport.TestContentStreamDataSource)  Time elapsed: 6.16 sec
      [mvn] testCommitWithin(org.apache.solr.handler.dataimport.TestContentStreamDataSource)  Time elapsed: 6.616 sec
      [mvn] Running org.apache.solr.handler.dataimport.TestSortedMapBackedCache
      [mvn] Tests run: 4, Failures: 0, Errors: 0, Skipped: 0, Time elapsed: 0.017 sec - in org.apache.solr.handler.dataimport.TestSortedMapBackedCache
      [mvn] testCacheWithKeyLookup(org.apache.solr.handler.dataimport.TestSortedMapBackedCache)  Time elapsed: 0.002 sec
      [mvn] testCacheWithOrderedLookup(org.apache.solr.handler.dataimport.TestSortedMapBackedCache)  Time elapsed: 0 sec
      [mvn] testCacheReopensWithUpdate(org.apache.solr.handler.dataimport.TestSortedMapBackedCache)  Time elapsed: 0.001 sec
      [mvn] testNullKeys(org.apache.solr.handler.dataimport.TestSortedMapBackedCache)  Time elapsed: 0 sec
      [mvn] Running org.apache.solr.handler.dataimport.TestScriptTransformer
      [mvn] Tests run: 4, Failures: 0, Errors: 0, Skipped: 3, Time elapsed: 0.279 sec - in org.apache.solr.handler.dataimport.TestScriptTransformer
      [mvn] testReadScriptTag(org.apache.solr.handler.dataimport.TestScriptTransformer)  Time elapsed: 0.008 sec
      [mvn] testBasic(org.apache.solr.handler.dataimport.TestScriptTransformer) skipped
      [mvn] testOneparam(org.apache.solr.handler.dataimport.TestScriptTransformer) skipped
      [mvn] testCheckScript(org.apache.solr.handler.dataimport.TestScriptTransformer) skipped
      [mvn] Running org.apache.solr.handler.dataimport.TestBuiltInEvaluators
      [mvn] Tests run: 5, Failures: 0, Errors: 0, Skipped: 0, Time elapsed: 0.114 sec - in org.apache.solr.handler.dataimport.TestBuiltInEvaluators
      [mvn] parseParams(org.apache.solr.handler.dataimport.TestBuiltInEvaluators)  Time elapsed: 0.002 sec
      [mvn] testEscapeSolrQueryFunction(org.apache.solr.handler.dataimport.TestBuiltInEvaluators)  Time elapsed: 0.002 sec
      [mvn] testDateFormatEvaluator(org.apache.solr.handler.dataimport.TestBuiltInEvaluators)  Time elapsed: 0.088 sec
      [mvn] testUrlEvaluator(org.apache.solr.handler.dataimport.TestBuiltInEvaluators)  Time elapsed: 0.006 sec
      [mvn] testSqlEscapingEvaluator(org.apache.solr.handler.dataimport.TestBuiltInEvaluators)  Time elapsed: 0.006 sec
      [mvn] Running org.apache.solr.handler.dataimport.TestJdbcDataSource
      [mvn] Tests run: 6, Failures: 0, Errors: 0, Skipped: 1, Time elapsed: 0.126 sec - in org.apache.solr.handler.dataimport.TestJdbcDataSource
      [mvn] testRetrieveFromJndiWithCredentials(org.apache.solr.handler.dataimport.TestJdbcDataSource)  Time elapsed: 0.059 sec
      [mvn] testBasic(org.apache.solr.handler.dataimport.TestJdbcDataSource) skipped
      [mvn] testClosesConnectionWhenExceptionThrownOnSetAutocommit(org.apache.solr.handler.dataimport.TestJdbcDataSource)  Time elapsed: 0.008 sec
      [mvn] testRetrieveFromJndi(org.apache.solr.handler.dataimport.TestJdbcDataSource)  Time elapsed: 0.008 sec
      [mvn] testRetrieveFromJndiFailureNotHidden(org.apache.solr.handler.dataimport.TestJdbcDataSource)  Time elapsed: 0.005 sec
      [mvn] testRetrieveFromDriverManager(org.apache.solr.handler.dataimport.TestJdbcDataSource)  Time elapsed: 0.008 sec
      [mvn] Running org.apache.solr.handler.dataimport.TestFileListWithLineEntityProcessor
      [mvn] Tests run: 1, Failures: 0, Errors: 0, Skipped: 0, Time elapsed: 0.65 sec - in org.apache.solr.handler.dataimport.TestFileListWithLineEntityProcessor
      [mvn] test(org.apache.solr.handler.dataimport.TestFileListWithLineEntityProcessor)  Time elapsed: 0.079 sec
      [mvn] Running org.apache.solr.handler.dataimport.TestVariableResolverEndToEnd
      [mvn] Tests run: 1, Failures: 0, Errors: 0, Skipped: 0, Time elapsed: 0.628 sec - in org.apache.solr.handler.dataimport.TestVariableResolverEndToEnd
      [mvn] test(org.apache.solr.handler.dataimport.TestVariableResolverEndToEnd)  Time elapsed: 0.126 sec
      [mvn] Running org.apache.solr.handler.dataimport.TestTemplateTransformer
      [mvn] Tests run: 1, Failures: 0, Errors: 0, Skipped: 0, Time elapsed: 0.008 sec - in org.apache.solr.handler.dataimport.TestTemplateTransformer
      [mvn] testTransformRow(org.apache.solr.handler.dataimport.TestTemplateTransformer)  Time elapsed: 0.002 sec
      [mvn] Running org.apache.solr.handler.dataimport.TestContextImpl
      [mvn] Tests run: 4, Failures: 0, Errors: 0, Skipped: 0, Time elapsed: 0.017 sec - in org.apache.solr.handler.dataimport.TestContextImpl
      [mvn] testCoreScope(org.apache.solr.handler.dataimport.TestContextImpl)  Time elapsed: 0.005 sec
      [mvn] testGlobalScope(org.apache.solr.handler.dataimport.TestContextImpl)  Time elapsed: 0.002 sec
      [mvn] testDocumentScope(org.apache.solr.handler.dataimport.TestContextImpl)  Time elapsed: 0.002 sec
      [mvn] testEntityScope(org.apache.solr.handler.dataimport.TestContextImpl)  Time elapsed: 0.002 sec
      [mvn] Running org.apache.solr.handler.dataimport.TestSolrEntityProcessorEndToEnd
      [mvn] Tests run: 6, Failures: 0, Errors: 0, Skipped: 0, Time elapsed: 35.142 sec - in org.apache.solr.handler.dataimport.TestSolrEntityProcessorEndToEnd
      [mvn] testFullImportInnerEntity(org.apache.solr.handler.dataimport.TestSolrEntityProcessorEndToEnd)  Time elapsed: 5.899 sec
      [mvn] testFullImport(org.apache.solr.handler.dataimport.TestSolrEntityProcessorEndToEnd)  Time elapsed: 5.932 sec
      [mvn] testFullImportFqParam(org.apache.solr.handler.dataimport.TestSolrEntityProcessorEndToEnd)  Time elapsed: 6.025 sec
      [mvn] testFullImportWrongSolrUrl(org.apache.solr.handler.dataimport.TestSolrEntityProcessorEndToEnd)  Time elapsed: 5.418 sec
      [mvn] testFullImportFieldsParam(org.apache.solr.handler.dataimport.TestSolrEntityProcessorEndToEnd)  Time elapsed: 5.859 sec
      [mvn] testFullImportBadConfig(org.apache.solr.handler.dataimport.TestSolrEntityProcessorEndToEnd)  Time elapsed: 5.957 sec
      [mvn] Running org.apache.solr.handler.dataimport.TestSqlEntityProcessorDelta
      [mvn] Tests run: 5, Failures: 0, Errors: 0, Skipped: 0, Time elapsed: 5.015 sec - in org.apache.solr.handler.dataimport.TestSqlEntityProcessorDelta
      [mvn] testWithComplexTransformer(org.apache.solr.handler.dataimport.TestSqlEntityProcessorDelta)  Time elapsed: 1.425 sec
      [mvn] testWithSimpleTransformer(org.apache.solr.handler.dataimport.TestSqlEntityProcessorDelta)  Time elapsed: 1.301 sec
      [mvn] testSingleEntity(org.apache.solr.handler.dataimport.TestSqlEntityProcessorDelta)  Time elapsed: 0.263 sec
      [mvn] testDeltaImportWithoutInitialFullImport(org.apache.solr.handler.dataimport.TestSqlEntityProcessorDelta)  Time elapsed: 0.134 sec
      [mvn] testChildEntities(org.apache.solr.handler.dataimport.TestSqlEntityProcessorDelta)  Time elapsed: 1.355 sec
      [mvn] Running org.apache.solr.handler.dataimport.TestURLDataSource
      [mvn] Tests run: 1, Failures: 0, Errors: 0, Skipped: 0, Time elapsed: 0.014 sec - in org.apache.solr.handler.dataimport.TestURLDataSource
      [mvn] substitutionsOnBaseUrl(org.apache.solr.handler.dataimport.TestURLDataSource)  Time elapsed: 0.002 sec
      [mvn] Running org.apache.solr.handler.dataimport.TestClobTransformer
      [mvn] Tests run: 1, Failures: 0, Errors: 0, Skipped: 0, Time elapsed: 0.035 sec - in org.apache.solr.handler.dataimport.TestClobTransformer
      [mvn] simple(org.apache.solr.handler.dataimport.TestClobTransformer)  Time elapsed: 0.006 sec
      [mvn] Running org.apache.solr.handler.dataimport.TestDocBuilder2
      [mvn] Tests run: 12, Failures: 0, Errors: 0, Skipped: 1, Time elapsed: 1.615 sec - in org.apache.solr.handler.dataimport.TestDocBuilder2
      [mvn] testDynamicFields(org.apache.solr.handler.dataimport.TestDocBuilder2)  Time elapsed: 0.063 sec
      [mvn] testContext(org.apache.solr.handler.dataimport.TestDocBuilder2)  Time elapsed: 0.056 sec
      [mvn] testSkipRow(org.apache.solr.handler.dataimport.TestDocBuilder2)  Time elapsed: 0.124 sec
      [mvn] testSingleEntity(org.apache.solr.handler.dataimport.TestDocBuilder2)  Time elapsed: 0.057 sec
      [mvn] testRequestParamsAsVariable(org.apache.solr.handler.dataimport.TestDocBuilder2)  Time elapsed: 0.058 sec
      [mvn] testSingleEntity_CaseInsensitive(org.apache.solr.handler.dataimport.TestDocBuilder2)  Time elapsed: 0.059 sec
      [mvn] testFileListEntityProcessor_lastIndexTime(org.apache.solr.handler.dataimport.TestDocBuilder2) skipped
      [mvn] testErrorHandler(org.apache.solr.handler.dataimport.TestDocBuilder2)  Time elapsed: 0.217 sec
      [mvn] testStopTransform(org.apache.solr.handler.dataimport.TestDocBuilder2)  Time elapsed: 0.041 sec
      [mvn] testSkipDoc(org.apache.solr.handler.dataimport.TestDocBuilder2)  Time elapsed: 0.079 sec
      [mvn] testRequestParamsAsFieldName(org.apache.solr.handler.dataimport.TestDocBuilder2)  Time elapsed: 0.065 sec
      [mvn] testDeleteDocs(org.apache.solr.handler.dataimport.TestDocBuilder2)  Time elapsed: 0.282 sec
      [mvn] Running org.apache.solr.handler.dataimport.TestFieldReader
      [mvn] Tests run: 1, Failures: 0, Errors: 0, Skipped: 0, Time elapsed: 0.035 sec - in org.apache.solr.handler.dataimport.TestFieldReader
      [mvn] simple(org.apache.solr.handler.dataimport.TestFieldReader)  Time elapsed: 0.028 sec
      [mvn] Running org.apache.solr.handler.dataimport.TestNumberFormatTransformer
      [mvn] Tests run: 9, Failures: 0, Errors: 0, Skipped: 0, Time elapsed: 0.031 sec - in org.apache.solr.handler.dataimport.TestNumberFormatTransformer
      [mvn] testTransformRow_InvalidInput1_Number(org.apache.solr.handler.dataimport.TestNumberFormatTransformer)  Time elapsed: 0.003 sec
      [mvn] testTransformRow_InvalidInput3_Number(org.apache.solr.handler.dataimport.TestNumberFormatTransformer)  Time elapsed: 0.003 sec
      [mvn] testTransformRow_InvalidInput1_Percent(org.apache.solr.handler.dataimport.TestNumberFormatTransformer)  Time elapsed: 0.003 sec
      [mvn] testTransformRow_InvalidInput2_Number(org.apache.solr.handler.dataimport.TestNumberFormatTransformer)  Time elapsed: 0.003 sec
      [mvn] testTransformRow_MalformedInput_Number(org.apache.solr.handler.dataimport.TestNumberFormatTransformer)  Time elapsed: 0.002 sec
      [mvn] testTransformRow_SingleNumber(org.apache.solr.handler.dataimport.TestNumberFormatTransformer)  Time elapsed: 0.003 sec
      [mvn] testTransformRow_InvalidInput2_Currency(org.apache.solr.handler.dataimport.TestNumberFormatTransformer)  Time elapsed: 0.003 sec
      [mvn] testTransformRow_MultipleNumbers(org.apache.solr.handler.dataimport.TestNumberFormatTransformer)  Time elapsed: 0.002 sec
      [mvn] testTransformRow_InvalidInput3_Currency(org.apache.solr.handler.dataimport.TestNumberFormatTransformer)  Time elapsed: 0.003 sec
      [mvn] Running org.apache.solr.handler.dataimport.TestZKPropertiesWriter
      [mvn] Tests run: 1, Failures: 0, Errors: 0, Skipped: 0, Time elapsed: 

[...truncated too long message...]

nkins-slave/workspace/Lucene-Solr-Maven-4.x/maven-build/solr/contrib/velocity/target/surefire-reports
      [mvn] 
      [mvn] -------------------------------------------------------
      [mvn]  T E S T S
      [mvn] -------------------------------------------------------
      [mvn] Running org.apache.solr.velocity.VelocityResponseWriterTest
      [mvn] Tests run: 3, Failures: 0, Errors: 0, Skipped: 0, Time elapsed: 3.293 sec - in org.apache.solr.velocity.VelocityResponseWriterTest
      [mvn] testVelocityResponseWriterRegistered(org.apache.solr.velocity.VelocityResponseWriterTest)  Time elapsed: 0.075 sec
      [mvn] testSolrResourceLoaderTemplate(org.apache.solr.velocity.VelocityResponseWriterTest)  Time elapsed: 0.251 sec
      [mvn] testCustomParamTemplate(org.apache.solr.velocity.VelocityResponseWriterTest)  Time elapsed: 0.037 sec
      [mvn] 
      [mvn] Results :
      [mvn] 
      [mvn] Tests run: 3, Failures: 0, Errors: 0, Skipped: 0
      [mvn] 
      [mvn] [INFO] [jar:jar {execution: default-jar}]
      [mvn] [INFO] Building jar: /usr/home/jenkins/jenkins-slave/workspace/Lucene-Solr-Maven-4.x/maven-build/solr/contrib/velocity/target/solr-velocity-4.11.0-SNAPSHOT.jar
      [mvn] [INFO] [install:install {execution: default-install}]
      [mvn] [INFO] Installing /usr/home/jenkins/jenkins-slave/workspace/Lucene-Solr-Maven-4.x/maven-build/solr/contrib/velocity/target/solr-velocity-4.11.0-SNAPSHOT.jar to /home/jenkins/.m2/repository/org/apache/solr/solr-velocity/4.11.0-SNAPSHOT/solr-velocity-4.11.0-SNAPSHOT.jar
      [mvn] [INFO] ------------------------------------------------------------------------
      [mvn] [INFO] Building Apache Solr Contrib aggregator POM
      [mvn] [INFO]    task-segment: [install]
      [mvn] [INFO] ------------------------------------------------------------------------
      [mvn] [INFO] [groovy:execute {execution: generate-timestamps-and-get-top-level-basedir}]
      [mvn] [INFO] [buildnumber:create {execution: default}]
      [mvn] [INFO] [enforcer:enforce {execution: enforce-java-compat-version-and-maven-2.2.1}]
      [mvn] [INFO] [remote-resources:process {execution: default}]
      [mvn] [INFO] [bundle:manifest {execution: bundle-manifest}]
      [mvn] [WARNING] Ignoring project type pom - supportedProjectTypes = [jar, bundle]
      [mvn] [INFO] [forbiddenapis:check {execution: solr-shared-check-forbidden-apis}]
      [mvn] [INFO] Skipping execution for packaging "pom"
      [mvn] [INFO] [forbiddenapis:testCheck {execution: solr-shared-test-check-forbidden-apis}]
      [mvn] [INFO] Skipping execution for packaging "pom"
      [mvn] [INFO] [site:attach-descriptor {execution: default-attach-descriptor}]
      [mvn] [INFO] [install:install {execution: default-install}]
      [mvn] [INFO] Installing /usr/home/jenkins/jenkins-slave/workspace/Lucene-Solr-Maven-4.x/maven-build/solr/contrib/pom.xml to /home/jenkins/.m2/repository/org/apache/solr/solr-contrib-aggregator/4.11.0-SNAPSHOT/solr-contrib-aggregator-4.11.0-SNAPSHOT.pom
      [mvn] [INFO] 
      [mvn] [INFO] 
      [mvn] [INFO] ------------------------------------------------------------------------
      [mvn] [INFO] Reactor Summary:
      [mvn] [INFO] ------------------------------------------------------------------------
      [mvn] [INFO] Grandparent POM for Apache Lucene Core and Apache Solr  SUCCESS [12.224s]
      [mvn] [INFO] Lucene parent POM ..................................... SUCCESS [0.244s]
      [mvn] [INFO] Lucene Core ........................................... SUCCESS [30.382s]
      [mvn] [INFO] Lucene codecs ......................................... SUCCESS [4.081s]
      [mvn] [INFO] Lucene Test Framework ................................. SUCCESS [6.405s]
      [mvn] [INFO] Lucene Core tests ..................................... SUCCESS [27:04.621s]
      [mvn] [INFO] Lucene Core aggregator POM ............................ SUCCESS [0.132s]
      [mvn] [INFO] Lucene codecs tests ................................... SUCCESS [5:16.747s]
      [mvn] [INFO] Lucene codecs aggregator POM .......................... SUCCESS [0.118s]
      [mvn] [INFO] Lucene Common Analyzers ............................... SUCCESS [4:56.981s]
      [mvn] [INFO] Lucene ICU Analysis Components ........................ SUCCESS [31.113s]
      [mvn] [INFO] Lucene Kuromoji Japanese Morphological Analyzer ....... SUCCESS [32.338s]
      [mvn] [INFO] Lucene Morfologik Polish Lemmatizer ................... SUCCESS [3.101s]
      [mvn] [INFO] Lucene Phonetic Filters ............................... SUCCESS [15.505s]
      [mvn] [INFO] Lucene Smart Chinese Analyzer ......................... SUCCESS [9.382s]
      [mvn] [INFO] Lucene Stempel Analyzer ............................... SUCCESS [3.948s]
      [mvn] [INFO] Lucene UIMA Analysis Components ....................... SUCCESS [15.720s]
      [mvn] [INFO] Lucene Analysis Modules aggregator POM ................ SUCCESS [0.113s]
      [mvn] [INFO] Lucene Queries ........................................ SUCCESS [12.437s]
      [mvn] [INFO] Lucene Facets ......................................... SUCCESS [1:08.725s]
      [mvn] [INFO] Lucene Sandbox ........................................ SUCCESS [26.945s]
      [mvn] [INFO] Lucene QueryParsers ................................... SUCCESS [13.008s]
      [mvn] [INFO] Lucene Memory ......................................... SUCCESS [14.664s]
      [mvn] [INFO] Lucene Highlighter .................................... SUCCESS [22.732s]
      [mvn] [INFO] Lucene Spatial ........................................ SUCCESS [15.406s]
      [mvn] [INFO] Lucene Benchmark ...................................... SUCCESS [21.396s]
      [mvn] [INFO] Lucene Classification ................................. SUCCESS [8.240s]
      [mvn] [INFO] Lucene Expressions .................................... SUCCESS [10.832s]
      [mvn] [INFO] Lucene Demo ........................................... SUCCESS [3.562s]
      [mvn] [INFO] Lucene Grouping ....................................... SUCCESS [17.790s]
      [mvn] [INFO] Lucene Join ........................................... SUCCESS [25.374s]
      [mvn] [INFO] Lucene Miscellaneous .................................. SUCCESS [36.821s]
      [mvn] [INFO] Lucene Replicator ..................................... SUCCESS [22.800s]
      [mvn] [INFO] Lucene Suggest ........................................ SUCCESS [55.402s]
      [mvn] [INFO] Apache Solr parent POM ................................ SUCCESS [0.075s]
      [mvn] [INFO] Apache Solr Solrj ..................................... SUCCESS [2.708s]
      [mvn] [INFO] Apache Solr Core ...................................... SUCCESS [12.511s]
      [mvn] [INFO] Apache Solr Test Framework ............................ SUCCESS [2.317s]
      [mvn] [INFO] Apache Solr Analysis Extras ........................... SUCCESS [9.972s]
      [mvn] [INFO] Apache Solr Core tests ................................ SUCCESS [2:32:33.398s]
      [mvn] [INFO] Apache Solr Core aggregator POM ....................... SUCCESS [0.065s]
      [mvn] [INFO] Apache Solr Solrj tests ............................... FAILED [6:10.913s]
      [mvn] [INFO] Apache Solr Solrj aggregator POM ...................... SUCCESS [0.063s]
      [mvn] [INFO] Apache Solr Search Server ............................. SUCCESS [2.571s]
      [mvn] [INFO] Apache Solr Clustering ................................ SUCCESS [59.813s]
      [mvn] [INFO] Apache Solr DataImportHandler ......................... SUCCESS [1:16.873s]
      [mvn] [INFO] Apache Solr DataImportHandler Extras .................. SUCCESS [6.779s]
      [mvn] [INFO] Apache Solr Content Extraction Library ................ SUCCESS [10.209s]
      [mvn] [INFO] Apache Solr Language Identifier ....................... SUCCESS [7.665s]
      [mvn] [INFO] Apache Solr Morphlines Core ........................... SUCCESS [2:21.954s]
      [mvn] [INFO] Apache Solr Cell Morphlines ........................... SUCCESS [3.283s]
      [mvn] [INFO] Apache Solr map-reduce index construction ............. SUCCESS [15:34.432s]
      [mvn] [INFO] Apache Solr UIMA integration .......................... SUCCESS [24.966s]
      [mvn] [INFO] Apache Solr Velocity .................................. SUCCESS [4.851s]
      [mvn] [INFO] Apache Solr Contrib aggregator POM .................... SUCCESS [0.093s]
      [mvn] [INFO] ------------------------------------------------------------------------
      [mvn] [INFO] Error for project: Apache Solr Solrj tests (during install)
      [mvn] [INFO] ------------------------------------------------------------------------
      [mvn] [INFO] There are test failures.
      [mvn] 
      [mvn] Please refer to /usr/home/jenkins/jenkins-slave/workspace/Lucene-Solr-Maven-4.x/maven-build/solr/solrj/src/test/target/surefire-reports for the individual test results.
      [mvn] [INFO] ------------------------------------------------------------------------
      [mvn] [INFO] For more information, run Maven with the -e switch
      [mvn] [INFO] ------------------------------------------------------------------------
      [mvn] [INFO] BUILD ERRORS
      [mvn] [INFO] ------------------------------------------------------------------------
      [mvn] [INFO] Total time: 226 minutes 47 seconds
      [mvn] [INFO] Finished at: Mon Sep 15 07:46:15 GMT 2014
      [mvn] [INFO] Final Memory: 263M/843M
      [mvn] [INFO] ------------------------------------------------------------------------

BUILD FAILED
/usr/home/jenkins/jenkins-slave/workspace/Lucene-Solr-Maven-4.x/build.xml:514: The following error occurred while executing this line:
/usr/home/jenkins/jenkins-slave/workspace/Lucene-Solr-Maven-4.x/build.xml:198: The following error occurred while executing this line:
: Java returned: 1

Total time: 253 minutes 21 seconds
Build step 'Invoke Ant' marked build as failure
Recording test results
Email was triggered for: Failure
Sending email for trigger: Failure



Mime
View raw message