lucene-dev mailing list archives

Site index · List index
Message view « Date » · « Thread »
Top « Date » · « Thread »
From Policeman Jenkins Server <jenk...@thetaphi.de>
Subject [JENKINS] Lucene-Solr-4.x-Linux (32bit/jdk1.9.0-ea-b26) - Build # 11024 - Failure!
Date Mon, 01 Sep 2014 21:10:09 GMT
Build: http://jenkins.thetaphi.de/job/Lucene-Solr-4.x-Linux/11024/
Java: 32bit/jdk1.9.0-ea-b26 -client -XX:+UseConcMarkSweepGC

6 tests failed.
REGRESSION:  org.apache.solr.client.solrj.SolrExampleBinaryTest.testChildDoctransformer

Error Message:
Expected mime type application/octet-stream but got text/html. <html> <head> <meta http-equiv="Content-Type" content="text/html;charset=ISO-8859-1"/> <title>Error 500 Server Error</title> </head> <body> <h2>HTTP ERROR: 500</h2> <p>Problem accessing /solr/collection1/select. Reason: <pre>    Server Error</pre></p> <hr /><i><small>Powered by Jetty://</small></i>                                                                                                                                                                                                                                                                                                                                                                                                                                                                                                                                                                                                                                                                                                                                                                                                                                                                                                                                                                                                                     </body> </html> 

Stack Trace:
org.apache.solr.client.solrj.impl.HttpSolrServer$RemoteSolrException: Expected mime type application/octet-stream but got text/html. <html>
<head>
<meta http-equiv="Content-Type" content="text/html;charset=ISO-8859-1"/>
<title>Error 500 Server Error</title>
</head>
<body>
<h2>HTTP ERROR: 500</h2>
<p>Problem accessing /solr/collection1/select. Reason:
<pre>    Server Error</pre></p>
<hr /><i><small>Powered by Jetty://</small></i>
                                                
                                                
                                                
                                                
                                                
                                                
                                                
                                                
                                                
                                                
                                                
                                                
                                                
                                                
                                                
                                                
                                                
                                                
                                                
                                                
</body>
</html>

	at __randomizedtesting.SeedInfo.seed([C6876002C09159DD:B55D7F984C892EDB]:0)
	at org.apache.solr.client.solrj.impl.HttpSolrServer.executeMethod(HttpSolrServer.java:512)
	at org.apache.solr.client.solrj.impl.HttpSolrServer.request(HttpSolrServer.java:210)
	at org.apache.solr.client.solrj.impl.HttpSolrServer.request(HttpSolrServer.java:206)
	at org.apache.solr.client.solrj.request.QueryRequest.process(QueryRequest.java:91)
	at org.apache.solr.client.solrj.SolrServer.query(SolrServer.java:301)
	at org.apache.solr.client.solrj.SolrExampleTests.testChildDoctransformer(SolrExampleTests.java:1373)
	at sun.reflect.NativeMethodAccessorImpl.invoke0(Native Method)
	at sun.reflect.NativeMethodAccessorImpl.invoke(NativeMethodAccessorImpl.java:62)
	at sun.reflect.DelegatingMethodAccessorImpl.invoke(DelegatingMethodAccessorImpl.java:43)
	at java.lang.reflect.Method.invoke(Method.java:484)
	at com.carrotsearch.randomizedtesting.RandomizedRunner.invoke(RandomizedRunner.java:1618)
	at com.carrotsearch.randomizedtesting.RandomizedRunner$6.evaluate(RandomizedRunner.java:827)
	at com.carrotsearch.randomizedtesting.RandomizedRunner$7.evaluate(RandomizedRunner.java:863)
	at com.carrotsearch.randomizedtesting.RandomizedRunner$8.evaluate(RandomizedRunner.java:877)
	at com.carrotsearch.randomizedtesting.rules.SystemPropertiesRestoreRule$1.evaluate(SystemPropertiesRestoreRule.java:53)
	at org.apache.lucene.util.TestRuleSetupTeardownChained$1.evaluate(TestRuleSetupTeardownChained.java:50)
	at org.apache.lucene.util.TestRuleFieldCacheSanity$1.evaluate(TestRuleFieldCacheSanity.java:51)
	at org.apache.lucene.util.AbstractBeforeAfterRule$1.evaluate(AbstractBeforeAfterRule.java:46)
	at com.carrotsearch.randomizedtesting.rules.SystemPropertiesInvariantRule$1.evaluate(SystemPropertiesInvariantRule.java:55)
	at org.apache.lucene.util.TestRuleThreadAndTestName$1.evaluate(TestRuleThreadAndTestName.java:49)
	at org.apache.lucene.util.TestRuleIgnoreAfterMaxFailures$1.evaluate(TestRuleIgnoreAfterMaxFailures.java:65)
	at org.apache.lucene.util.TestRuleMarkFailure$1.evaluate(TestRuleMarkFailure.java:48)
	at com.carrotsearch.randomizedtesting.rules.StatementAdapter.evaluate(StatementAdapter.java:36)
	at com.carrotsearch.randomizedtesting.ThreadLeakControl$StatementRunner.run(ThreadLeakControl.java:365)
	at com.carrotsearch.randomizedtesting.ThreadLeakControl.forkTimeoutingTask(ThreadLeakControl.java:798)
	at com.carrotsearch.randomizedtesting.ThreadLeakControl$3.evaluate(ThreadLeakControl.java:458)
	at com.carrotsearch.randomizedtesting.RandomizedRunner.runSingleTest(RandomizedRunner.java:836)
	at com.carrotsearch.randomizedtesting.RandomizedRunner$3.evaluate(RandomizedRunner.java:738)
	at com.carrotsearch.randomizedtesting.RandomizedRunner$4.evaluate(RandomizedRunner.java:772)
	at com.carrotsearch.randomizedtesting.RandomizedRunner$5.evaluate(RandomizedRunner.java:783)
	at com.carrotsearch.randomizedtesting.rules.StatementAdapter.evaluate(StatementAdapter.java:36)
	at com.carrotsearch.randomizedtesting.rules.SystemPropertiesRestoreRule$1.evaluate(SystemPropertiesRestoreRule.java:53)
	at org.apache.lucene.util.AbstractBeforeAfterRule$1.evaluate(AbstractBeforeAfterRule.java:46)
	at org.apache.lucene.util.TestRuleStoreClassName$1.evaluate(TestRuleStoreClassName.java:42)
	at com.carrotsearch.randomizedtesting.rules.SystemPropertiesInvariantRule$1.evaluate(SystemPropertiesInvariantRule.java:55)
	at com.carrotsearch.randomizedtesting.rules.NoShadowingOrOverridesOnMethodsRule$1.evaluate(NoShadowingOrOverridesOnMethodsRule.java:39)
	at com.carrotsearch.randomizedtesting.rules.NoShadowingOrOverridesOnMethodsRule$1.evaluate(NoShadowingOrOverridesOnMethodsRule.java:39)
	at com.carrotsearch.randomizedtesting.rules.StatementAdapter.evaluate(StatementAdapter.java:36)
	at com.carrotsearch.randomizedtesting.rules.StatementAdapter.evaluate(StatementAdapter.java:36)
	at com.carrotsearch.randomizedtesting.rules.StatementAdapter.evaluate(StatementAdapter.java:36)
	at org.apache.lucene.util.TestRuleAssertionsRequired$1.evaluate(TestRuleAssertionsRequired.java:43)
	at org.apache.lucene.util.TestRuleMarkFailure$1.evaluate(TestRuleMarkFailure.java:48)
	at org.apache.lucene.util.TestRuleIgnoreAfterMaxFailures$1.evaluate(TestRuleIgnoreAfterMaxFailures.java:65)
	at org.apache.lucene.util.TestRuleIgnoreTestSuites$1.evaluate(TestRuleIgnoreTestSuites.java:55)
	at com.carrotsearch.randomizedtesting.rules.StatementAdapter.evaluate(StatementAdapter.java:36)
	at com.carrotsearch.randomizedtesting.ThreadLeakControl$StatementRunner.run(ThreadLeakControl.java:365)
	at java.lang.Thread.run(Thread.java:745)


REGRESSION:  org.apache.solr.client.solrj.SolrExampleXMLTest.testChildDoctransformer

Error Message:
java.lang.AssertionError

Stack Trace:
org.apache.solr.client.solrj.impl.HttpSolrServer$RemoteSolrException: java.lang.AssertionError
	at __randomizedtesting.SeedInfo.seed([C6876002C09159DD:B55D7F984C892EDB]:0)
	at org.apache.solr.client.solrj.impl.HttpSolrServer.executeMethod(HttpSolrServer.java:550)
	at org.apache.solr.client.solrj.impl.HttpSolrServer.request(HttpSolrServer.java:210)
	at org.apache.solr.client.solrj.impl.HttpSolrServer.request(HttpSolrServer.java:206)
	at org.apache.solr.client.solrj.request.QueryRequest.process(QueryRequest.java:91)
	at org.apache.solr.client.solrj.SolrServer.query(SolrServer.java:301)
	at org.apache.solr.client.solrj.SolrExampleTests.testChildDoctransformer(SolrExampleTests.java:1373)
	at sun.reflect.NativeMethodAccessorImpl.invoke0(Native Method)
	at sun.reflect.NativeMethodAccessorImpl.invoke(NativeMethodAccessorImpl.java:62)
	at sun.reflect.DelegatingMethodAccessorImpl.invoke(DelegatingMethodAccessorImpl.java:43)
	at java.lang.reflect.Method.invoke(Method.java:484)
	at com.carrotsearch.randomizedtesting.RandomizedRunner.invoke(RandomizedRunner.java:1618)
	at com.carrotsearch.randomizedtesting.RandomizedRunner$6.evaluate(RandomizedRunner.java:827)
	at com.carrotsearch.randomizedtesting.RandomizedRunner$7.evaluate(RandomizedRunner.java:863)
	at com.carrotsearch.randomizedtesting.RandomizedRunner$8.evaluate(RandomizedRunner.java:877)
	at com.carrotsearch.randomizedtesting.rules.SystemPropertiesRestoreRule$1.evaluate(SystemPropertiesRestoreRule.java:53)
	at org.apache.lucene.util.TestRuleSetupTeardownChained$1.evaluate(TestRuleSetupTeardownChained.java:50)
	at org.apache.lucene.util.TestRuleFieldCacheSanity$1.evaluate(TestRuleFieldCacheSanity.java:51)
	at org.apache.lucene.util.AbstractBeforeAfterRule$1.evaluate(AbstractBeforeAfterRule.java:46)
	at com.carrotsearch.randomizedtesting.rules.SystemPropertiesInvariantRule$1.evaluate(SystemPropertiesInvariantRule.java:55)
	at org.apache.lucene.util.TestRuleThreadAndTestName$1.evaluate(TestRuleThreadAndTestName.java:49)
	at org.apache.lucene.util.TestRuleIgnoreAfterMaxFailures$1.evaluate(TestRuleIgnoreAfterMaxFailures.java:65)
	at org.apache.lucene.util.TestRuleMarkFailure$1.evaluate(TestRuleMarkFailure.java:48)
	at com.carrotsearch.randomizedtesting.rules.StatementAdapter.evaluate(StatementAdapter.java:36)
	at com.carrotsearch.randomizedtesting.ThreadLeakControl$StatementRunner.run(ThreadLeakControl.java:365)
	at com.carrotsearch.randomizedtesting.ThreadLeakControl.forkTimeoutingTask(ThreadLeakControl.java:798)
	at com.carrotsearch.randomizedtesting.ThreadLeakControl$3.evaluate(ThreadLeakControl.java:458)
	at com.carrotsearch.randomizedtesting.RandomizedRunner.runSingleTest(RandomizedRunner.java:836)
	at com.carrotsearch.randomizedtesting.RandomizedRunner$3.evaluate(RandomizedRunner.java:738)
	at com.carrotsearch.randomizedtesting.RandomizedRunner$4.evaluate(RandomizedRunner.java:772)
	at com.carrotsearch.randomizedtesting.RandomizedRunner$5.evaluate(RandomizedRunner.java:783)
	at com.carrotsearch.randomizedtesting.rules.StatementAdapter.evaluate(StatementAdapter.java:36)
	at com.carrotsearch.randomizedtesting.rules.SystemPropertiesRestoreRule$1.evaluate(SystemPropertiesRestoreRule.java:53)
	at org.apache.lucene.util.AbstractBeforeAfterRule$1.evaluate(AbstractBeforeAfterRule.java:46)
	at org.apache.lucene.util.TestRuleStoreClassName$1.evaluate(TestRuleStoreClassName.java:42)
	at com.carrotsearch.randomizedtesting.rules.SystemPropertiesInvariantRule$1.evaluate(SystemPropertiesInvariantRule.java:55)
	at com.carrotsearch.randomizedtesting.rules.NoShadowingOrOverridesOnMethodsRule$1.evaluate(NoShadowingOrOverridesOnMethodsRule.java:39)
	at com.carrotsearch.randomizedtesting.rules.NoShadowingOrOverridesOnMethodsRule$1.evaluate(NoShadowingOrOverridesOnMethodsRule.java:39)
	at com.carrotsearch.randomizedtesting.rules.StatementAdapter.evaluate(StatementAdapter.java:36)
	at com.carrotsearch.randomizedtesting.rules.StatementAdapter.evaluate(StatementAdapter.java:36)
	at com.carrotsearch.randomizedtesting.rules.StatementAdapter.evaluate(StatementAdapter.java:36)
	at org.apache.lucene.util.TestRuleAssertionsRequired$1.evaluate(TestRuleAssertionsRequired.java:43)
	at org.apache.lucene.util.TestRuleMarkFailure$1.evaluate(TestRuleMarkFailure.java:48)
	at org.apache.lucene.util.TestRuleIgnoreAfterMaxFailures$1.evaluate(TestRuleIgnoreAfterMaxFailures.java:65)
	at org.apache.lucene.util.TestRuleIgnoreTestSuites$1.evaluate(TestRuleIgnoreTestSuites.java:55)
	at com.carrotsearch.randomizedtesting.rules.StatementAdapter.evaluate(StatementAdapter.java:36)
	at com.carrotsearch.randomizedtesting.ThreadLeakControl$StatementRunner.run(ThreadLeakControl.java:365)
	at java.lang.Thread.run(Thread.java:745)


REGRESSION:  org.apache.solr.client.solrj.embedded.SolrExampleEmbeddedTest.testChildDoctransformer

Error Message:


Stack Trace:
java.lang.AssertionError
	at __randomizedtesting.SeedInfo.seed([C6876002C09159DD:B55D7F984C892EDB]:0)
	at org.apache.lucene.search.join.ToChildBlockJoinQuery$ToChildBlockJoinScorer.advance(ToChildBlockJoinQuery.java:286)
	at org.apache.lucene.search.FilteredQuery$LeapFrogScorer.advanceToNextCommonDoc(FilteredQuery.java:274)
	at org.apache.lucene.search.FilteredQuery$LeapFrogScorer.nextDoc(FilteredQuery.java:286)
	at org.apache.lucene.search.Weight$DefaultBulkScorer.scoreAll(Weight.java:192)
	at org.apache.lucene.search.Weight$DefaultBulkScorer.score(Weight.java:163)
	at org.apache.lucene.search.BulkScorer.score(BulkScorer.java:35)
	at org.apache.lucene.search.IndexSearcher.search(IndexSearcher.java:621)
	at org.apache.lucene.search.IndexSearcher.search(IndexSearcher.java:297)
	at org.apache.solr.search.SolrIndexSearcher.buildAndRunCollectorChain(SolrIndexSearcher.java:209)
	at org.apache.solr.search.SolrIndexSearcher.getDocListNC(SolrIndexSearcher.java:1619)
	at org.apache.solr.search.SolrIndexSearcher.getDocListC(SolrIndexSearcher.java:1433)
	at org.apache.solr.search.SolrIndexSearcher.search(SolrIndexSearcher.java:514)
	at org.apache.solr.search.SolrIndexSearcher.getDocList(SolrIndexSearcher.java:1268)
	at org.apache.solr.response.transform.ChildDocTransformer.transform(ChildDocTransformerFactory.java:144)
	at org.apache.solr.response.BinaryResponseWriter$Resolver.writeResultsBody(BinaryResponseWriter.java:159)
	at org.apache.solr.response.BinaryResponseWriter$Resolver.writeResults(BinaryResponseWriter.java:183)
	at org.apache.solr.response.BinaryResponseWriter$Resolver.resolve(BinaryResponseWriter.java:88)
	at org.apache.solr.common.util.JavaBinCodec.writeVal(JavaBinCodec.java:158)
	at org.apache.solr.common.util.JavaBinCodec.writeNamedList(JavaBinCodec.java:148)
	at org.apache.solr.common.util.JavaBinCodec.writeKnownType(JavaBinCodec.java:242)
	at org.apache.solr.common.util.JavaBinCodec.writeVal(JavaBinCodec.java:153)
	at org.apache.solr.common.util.JavaBinCodec.marshal(JavaBinCodec.java:96)
	at org.apache.solr.response.BinaryResponseWriter.getParsedResponse(BinaryResponseWriter.java:256)
	at org.apache.solr.client.solrj.embedded.EmbeddedSolrServer.getParsedResponse(EmbeddedSolrServer.java:241)
	at org.apache.solr.client.solrj.embedded.EmbeddedSolrServer.request(EmbeddedSolrServer.java:213)
	at org.apache.solr.client.solrj.request.QueryRequest.process(QueryRequest.java:91)
	at org.apache.solr.client.solrj.SolrServer.query(SolrServer.java:301)
	at org.apache.solr.client.solrj.SolrExampleTests.testChildDoctransformer(SolrExampleTests.java:1373)
	at sun.reflect.NativeMethodAccessorImpl.invoke0(Native Method)
	at sun.reflect.NativeMethodAccessorImpl.invoke(NativeMethodAccessorImpl.java:62)
	at sun.reflect.DelegatingMethodAccessorImpl.invoke(DelegatingMethodAccessorImpl.java:43)
	at java.lang.reflect.Method.invoke(Method.java:484)
	at com.carrotsearch.randomizedtesting.RandomizedRunner.invoke(RandomizedRunner.java:1618)
	at com.carrotsearch.randomizedtesting.RandomizedRunner$6.evaluate(RandomizedRunner.java:827)
	at com.carrotsearch.randomizedtesting.RandomizedRunner$7.evaluate(RandomizedRunner.java:863)
	at com.carrotsearch.randomizedtesting.RandomizedRunner$8.evaluate(RandomizedRunner.java:877)
	at com.carrotsearch.randomizedtesting.rules.SystemPropertiesRestoreRule$1.evaluate(SystemPropertiesRestoreRule.java:53)
	at org.apache.lucene.util.TestRuleSetupTeardownChained$1.evaluate(TestRuleSetupTeardownChained.java:50)
	at org.apache.lucene.util.TestRuleFieldCacheSanity$1.evaluate(TestRuleFieldCacheSanity.java:51)
	at org.apache.lucene.util.AbstractBeforeAfterRule$1.evaluate(AbstractBeforeAfterRule.java:46)
	at com.carrotsearch.randomizedtesting.rules.SystemPropertiesInvariantRule$1.evaluate(SystemPropertiesInvariantRule.java:55)
	at org.apache.lucene.util.TestRuleThreadAndTestName$1.evaluate(TestRuleThreadAndTestName.java:49)
	at org.apache.lucene.util.TestRuleIgnoreAfterMaxFailures$1.evaluate(TestRuleIgnoreAfterMaxFailures.java:65)
	at org.apache.lucene.util.TestRuleMarkFailure$1.evaluate(TestRuleMarkFailure.java:48)
	at com.carrotsearch.randomizedtesting.rules.StatementAdapter.evaluate(StatementAdapter.java:36)
	at com.carrotsearch.randomizedtesting.ThreadLeakControl$StatementRunner.run(ThreadLeakControl.java:365)
	at com.carrotsearch.randomizedtesting.ThreadLeakControl.forkTimeoutingTask(ThreadLeakControl.java:798)
	at com.carrotsearch.randomizedtesting.ThreadLeakControl$3.evaluate(ThreadLeakControl.java:458)
	at com.carrotsearch.randomizedtesting.RandomizedRunner.runSingleTest(RandomizedRunner.java:836)
	at com.carrotsearch.randomizedtesting.RandomizedRunner$3.evaluate(RandomizedRunner.java:738)
	at com.carrotsearch.randomizedtesting.RandomizedRunner$4.evaluate(RandomizedRunner.java:772)
	at com.carrotsearch.randomizedtesting.RandomizedRunner$5.evaluate(RandomizedRunner.java:783)
	at com.carrotsearch.randomizedtesting.rules.StatementAdapter.evaluate(StatementAdapter.java:36)
	at com.carrotsearch.randomizedtesting.rules.SystemPropertiesRestoreRule$1.evaluate(SystemPropertiesRestoreRule.java:53)
	at org.apache.lucene.util.AbstractBeforeAfterRule$1.evaluate(AbstractBeforeAfterRule.java:46)
	at org.apache.lucene.util.TestRuleStoreClassName$1.evaluate(TestRuleStoreClassName.java:42)
	at com.carrotsearch.randomizedtesting.rules.SystemPropertiesInvariantRule$1.evaluate(SystemPropertiesInvariantRule.java:55)
	at com.carrotsearch.randomizedtesting.rules.NoShadowingOrOverridesOnMethodsRule$1.evaluate(NoShadowingOrOverridesOnMethodsRule.java:39)
	at com.carrotsearch.randomizedtesting.rules.NoShadowingOrOverridesOnMethodsRule$1.evaluate(NoShadowingOrOverridesOnMethodsRule.java:39)
	at com.carrotsearch.randomizedtesting.rules.StatementAdapter.evaluate(StatementAdapter.java:36)
	at com.carrotsearch.randomizedtesting.rules.StatementAdapter.evaluate(StatementAdapter.java:36)
	at com.carrotsearch.randomizedtesting.rules.StatementAdapter.evaluate(StatementAdapter.java:36)
	at org.apache.lucene.util.TestRuleAssertionsRequired$1.evaluate(TestRuleAssertionsRequired.java:43)
	at org.apache.lucene.util.TestRuleMarkFailure$1.evaluate(TestRuleMarkFailure.java:48)
	at org.apache.lucene.util.TestRuleIgnoreAfterMaxFailures$1.evaluate(TestRuleIgnoreAfterMaxFailures.java:65)
	at org.apache.lucene.util.TestRuleIgnoreTestSuites$1.evaluate(TestRuleIgnoreTestSuites.java:55)
	at com.carrotsearch.randomizedtesting.rules.StatementAdapter.evaluate(StatementAdapter.java:36)
	at com.carrotsearch.randomizedtesting.ThreadLeakControl$StatementRunner.run(ThreadLeakControl.java:365)
	at java.lang.Thread.run(Thread.java:745)


REGRESSION:  org.apache.solr.client.solrj.embedded.SolrExampleJettyTest.testChildDoctransformer

Error Message:
Expected mime type application/octet-stream but got text/html. <html> <head> <meta http-equiv="Content-Type" content="text/html;charset=ISO-8859-1"/> <title>Error 500 Server Error</title> </head> <body> <h2>HTTP ERROR: 500</h2> <p>Problem accessing /solr/collection1/select. Reason: <pre>    Server Error</pre></p> <hr /><i><small>Powered by Jetty://</small></i>                                                                                                                                                                                                                                                                                                                                                                                                                                                                                                                                                                                                                                                                                                                                                                                                                                                                                                                                                                                                                     </body> </html> 

Stack Trace:
org.apache.solr.client.solrj.impl.HttpSolrServer$RemoteSolrException: Expected mime type application/octet-stream but got text/html. <html>
<head>
<meta http-equiv="Content-Type" content="text/html;charset=ISO-8859-1"/>
<title>Error 500 Server Error</title>
</head>
<body>
<h2>HTTP ERROR: 500</h2>
<p>Problem accessing /solr/collection1/select. Reason:
<pre>    Server Error</pre></p>
<hr /><i><small>Powered by Jetty://</small></i>
                                                
                                                
                                                
                                                
                                                
                                                
                                                
                                                
                                                
                                                
                                                
                                                
                                                
                                                
                                                
                                                
                                                
                                                
                                                
                                                
</body>
</html>

	at __randomizedtesting.SeedInfo.seed([C6876002C09159DD:B55D7F984C892EDB]:0)
	at org.apache.solr.client.solrj.impl.HttpSolrServer.executeMethod(HttpSolrServer.java:512)
	at org.apache.solr.client.solrj.impl.HttpSolrServer.request(HttpSolrServer.java:210)
	at org.apache.solr.client.solrj.impl.HttpSolrServer.request(HttpSolrServer.java:206)
	at org.apache.solr.client.solrj.request.QueryRequest.process(QueryRequest.java:91)
	at org.apache.solr.client.solrj.SolrServer.query(SolrServer.java:301)
	at org.apache.solr.client.solrj.SolrExampleTests.testChildDoctransformer(SolrExampleTests.java:1373)
	at sun.reflect.NativeMethodAccessorImpl.invoke0(Native Method)
	at sun.reflect.NativeMethodAccessorImpl.invoke(NativeMethodAccessorImpl.java:62)
	at sun.reflect.DelegatingMethodAccessorImpl.invoke(DelegatingMethodAccessorImpl.java:43)
	at java.lang.reflect.Method.invoke(Method.java:484)
	at com.carrotsearch.randomizedtesting.RandomizedRunner.invoke(RandomizedRunner.java:1618)
	at com.carrotsearch.randomizedtesting.RandomizedRunner$6.evaluate(RandomizedRunner.java:827)
	at com.carrotsearch.randomizedtesting.RandomizedRunner$7.evaluate(RandomizedRunner.java:863)
	at com.carrotsearch.randomizedtesting.RandomizedRunner$8.evaluate(RandomizedRunner.java:877)
	at com.carrotsearch.randomizedtesting.rules.SystemPropertiesRestoreRule$1.evaluate(SystemPropertiesRestoreRule.java:53)
	at org.apache.lucene.util.TestRuleSetupTeardownChained$1.evaluate(TestRuleSetupTeardownChained.java:50)
	at org.apache.lucene.util.TestRuleFieldCacheSanity$1.evaluate(TestRuleFieldCacheSanity.java:51)
	at org.apache.lucene.util.AbstractBeforeAfterRule$1.evaluate(AbstractBeforeAfterRule.java:46)
	at com.carrotsearch.randomizedtesting.rules.SystemPropertiesInvariantRule$1.evaluate(SystemPropertiesInvariantRule.java:55)
	at org.apache.lucene.util.TestRuleThreadAndTestName$1.evaluate(TestRuleThreadAndTestName.java:49)
	at org.apache.lucene.util.TestRuleIgnoreAfterMaxFailures$1.evaluate(TestRuleIgnoreAfterMaxFailures.java:65)
	at org.apache.lucene.util.TestRuleMarkFailure$1.evaluate(TestRuleMarkFailure.java:48)
	at com.carrotsearch.randomizedtesting.rules.StatementAdapter.evaluate(StatementAdapter.java:36)
	at com.carrotsearch.randomizedtesting.ThreadLeakControl$StatementRunner.run(ThreadLeakControl.java:365)
	at com.carrotsearch.randomizedtesting.ThreadLeakControl.forkTimeoutingTask(ThreadLeakControl.java:798)
	at com.carrotsearch.randomizedtesting.ThreadLeakControl$3.evaluate(ThreadLeakControl.java:458)
	at com.carrotsearch.randomizedtesting.RandomizedRunner.runSingleTest(RandomizedRunner.java:836)
	at com.carrotsearch.randomizedtesting.RandomizedRunner$3.evaluate(RandomizedRunner.java:738)
	at com.carrotsearch.randomizedtesting.RandomizedRunner$4.evaluate(RandomizedRunner.java:772)
	at com.carrotsearch.randomizedtesting.RandomizedRunner$5.evaluate(RandomizedRunner.java:783)
	at com.carrotsearch.randomizedtesting.rules.StatementAdapter.evaluate(StatementAdapter.java:36)
	at com.carrotsearch.randomizedtesting.rules.SystemPropertiesRestoreRule$1.evaluate(SystemPropertiesRestoreRule.java:53)
	at org.apache.lucene.util.AbstractBeforeAfterRule$1.evaluate(AbstractBeforeAfterRule.java:46)
	at org.apache.lucene.util.TestRuleStoreClassName$1.evaluate(TestRuleStoreClassName.java:42)
	at com.carrotsearch.randomizedtesting.rules.SystemPropertiesInvariantRule$1.evaluate(SystemPropertiesInvariantRule.java:55)
	at com.carrotsearch.randomizedtesting.rules.NoShadowingOrOverridesOnMethodsRule$1.evaluate(NoShadowingOrOverridesOnMethodsRule.java:39)
	at com.carrotsearch.randomizedtesting.rules.NoShadowingOrOverridesOnMethodsRule$1.evaluate(NoShadowingOrOverridesOnMethodsRule.java:39)
	at com.carrotsearch.randomizedtesting.rules.StatementAdapter.evaluate(StatementAdapter.java:36)
	at com.carrotsearch.randomizedtesting.rules.StatementAdapter.evaluate(StatementAdapter.java:36)
	at com.carrotsearch.randomizedtesting.rules.StatementAdapter.evaluate(StatementAdapter.java:36)
	at org.apache.lucene.util.TestRuleAssertionsRequired$1.evaluate(TestRuleAssertionsRequired.java:43)
	at org.apache.lucene.util.TestRuleMarkFailure$1.evaluate(TestRuleMarkFailure.java:48)
	at org.apache.lucene.util.TestRuleIgnoreAfterMaxFailures$1.evaluate(TestRuleIgnoreAfterMaxFailures.java:65)
	at org.apache.lucene.util.TestRuleIgnoreTestSuites$1.evaluate(TestRuleIgnoreTestSuites.java:55)
	at com.carrotsearch.randomizedtesting.rules.StatementAdapter.evaluate(StatementAdapter.java:36)
	at com.carrotsearch.randomizedtesting.ThreadLeakControl$StatementRunner.run(ThreadLeakControl.java:365)
	at java.lang.Thread.run(Thread.java:745)


REGRESSION:  org.apache.solr.client.solrj.embedded.SolrExampleStreamingBinaryTest.testChildDoctransformer

Error Message:
Expected mime type application/octet-stream but got text/html. <html> <head> <meta http-equiv="Content-Type" content="text/html;charset=ISO-8859-1"/> <title>Error 500 Server Error</title> </head> <body> <h2>HTTP ERROR: 500</h2> <p>Problem accessing /solr/collection1/select. Reason: <pre>    Server Error</pre></p> <hr /><i><small>Powered by Jetty://</small></i>                                                                                                                                                                                                                                                                                                                                                                                                                                                                                                                                                                                                                                                                                                                                                                                                                                                                                                                                                                                                                     </body> </html> 

Stack Trace:
org.apache.solr.client.solrj.impl.HttpSolrServer$RemoteSolrException: Expected mime type application/octet-stream but got text/html. <html>
<head>
<meta http-equiv="Content-Type" content="text/html;charset=ISO-8859-1"/>
<title>Error 500 Server Error</title>
</head>
<body>
<h2>HTTP ERROR: 500</h2>
<p>Problem accessing /solr/collection1/select. Reason:
<pre>    Server Error</pre></p>
<hr /><i><small>Powered by Jetty://</small></i>
                                                
                                                
                                                
                                                
                                                
                                                
                                                
                                                
                                                
                                                
                                                
                                                
                                                
                                                
                                                
                                                
                                                
                                                
                                                
                                                
</body>
</html>

	at __randomizedtesting.SeedInfo.seed([C6876002C09159DD:B55D7F984C892EDB]:0)
	at org.apache.solr.client.solrj.impl.HttpSolrServer.executeMethod(HttpSolrServer.java:512)
	at org.apache.solr.client.solrj.impl.HttpSolrServer.request(HttpSolrServer.java:210)
	at org.apache.solr.client.solrj.impl.HttpSolrServer.request(HttpSolrServer.java:206)
	at org.apache.solr.client.solrj.impl.ConcurrentUpdateSolrServer.request(ConcurrentUpdateSolrServer.java:281)
	at org.apache.solr.client.solrj.request.QueryRequest.process(QueryRequest.java:91)
	at org.apache.solr.client.solrj.SolrServer.query(SolrServer.java:301)
	at org.apache.solr.client.solrj.SolrExampleTests.testChildDoctransformer(SolrExampleTests.java:1373)
	at sun.reflect.NativeMethodAccessorImpl.invoke0(Native Method)
	at sun.reflect.NativeMethodAccessorImpl.invoke(NativeMethodAccessorImpl.java:62)
	at sun.reflect.DelegatingMethodAccessorImpl.invoke(DelegatingMethodAccessorImpl.java:43)
	at java.lang.reflect.Method.invoke(Method.java:484)
	at com.carrotsearch.randomizedtesting.RandomizedRunner.invoke(RandomizedRunner.java:1618)
	at com.carrotsearch.randomizedtesting.RandomizedRunner$6.evaluate(RandomizedRunner.java:827)
	at com.carrotsearch.randomizedtesting.RandomizedRunner$7.evaluate(RandomizedRunner.java:863)
	at com.carrotsearch.randomizedtesting.RandomizedRunner$8.evaluate(RandomizedRunner.java:877)
	at com.carrotsearch.randomizedtesting.rules.SystemPropertiesRestoreRule$1.evaluate(SystemPropertiesRestoreRule.java:53)
	at org.apache.lucene.util.TestRuleSetupTeardownChained$1.evaluate(TestRuleSetupTeardownChained.java:50)
	at org.apache.lucene.util.TestRuleFieldCacheSanity$1.evaluate(TestRuleFieldCacheSanity.java:51)
	at org.apache.lucene.util.AbstractBeforeAfterRule$1.evaluate(AbstractBeforeAfterRule.java:46)
	at com.carrotsearch.randomizedtesting.rules.SystemPropertiesInvariantRule$1.evaluate(SystemPropertiesInvariantRule.java:55)
	at org.apache.lucene.util.TestRuleThreadAndTestName$1.evaluate(TestRuleThreadAndTestName.java:49)
	at org.apache.lucene.util.TestRuleIgnoreAfterMaxFailures$1.evaluate(TestRuleIgnoreAfterMaxFailures.java:65)
	at org.apache.lucene.util.TestRuleMarkFailure$1.evaluate(TestRuleMarkFailure.java:48)
	at com.carrotsearch.randomizedtesting.rules.StatementAdapter.evaluate(StatementAdapter.java:36)
	at com.carrotsearch.randomizedtesting.ThreadLeakControl$StatementRunner.run(ThreadLeakControl.java:365)
	at com.carrotsearch.randomizedtesting.ThreadLeakControl.forkTimeoutingTask(ThreadLeakControl.java:798)
	at com.carrotsearch.randomizedtesting.ThreadLeakControl$3.evaluate(ThreadLeakControl.java:458)
	at com.carrotsearch.randomizedtesting.RandomizedRunner.runSingleTest(RandomizedRunner.java:836)
	at com.carrotsearch.randomizedtesting.RandomizedRunner$3.evaluate(RandomizedRunner.java:738)
	at com.carrotsearch.randomizedtesting.RandomizedRunner$4.evaluate(RandomizedRunner.java:772)
	at com.carrotsearch.randomizedtesting.RandomizedRunner$5.evaluate(RandomizedRunner.java:783)
	at com.carrotsearch.randomizedtesting.rules.StatementAdapter.evaluate(StatementAdapter.java:36)
	at com.carrotsearch.randomizedtesting.rules.SystemPropertiesRestoreRule$1.evaluate(SystemPropertiesRestoreRule.java:53)
	at org.apache.lucene.util.AbstractBeforeAfterRule$1.evaluate(AbstractBeforeAfterRule.java:46)
	at org.apache.lucene.util.TestRuleStoreClassName$1.evaluate(TestRuleStoreClassName.java:42)
	at com.carrotsearch.randomizedtesting.rules.SystemPropertiesInvariantRule$1.evaluate(SystemPropertiesInvariantRule.java:55)
	at com.carrotsearch.randomizedtesting.rules.NoShadowingOrOverridesOnMethodsRule$1.evaluate(NoShadowingOrOverridesOnMethodsRule.java:39)
	at com.carrotsearch.randomizedtesting.rules.NoShadowingOrOverridesOnMethodsRule$1.evaluate(NoShadowingOrOverridesOnMethodsRule.java:39)
	at com.carrotsearch.randomizedtesting.rules.StatementAdapter.evaluate(StatementAdapter.java:36)
	at com.carrotsearch.randomizedtesting.rules.StatementAdapter.evaluate(StatementAdapter.java:36)
	at com.carrotsearch.randomizedtesting.rules.StatementAdapter.evaluate(StatementAdapter.java:36)
	at org.apache.lucene.util.TestRuleAssertionsRequired$1.evaluate(TestRuleAssertionsRequired.java:43)
	at org.apache.lucene.util.TestRuleMarkFailure$1.evaluate(TestRuleMarkFailure.java:48)
	at org.apache.lucene.util.TestRuleIgnoreAfterMaxFailures$1.evaluate(TestRuleIgnoreAfterMaxFailures.java:65)
	at org.apache.lucene.util.TestRuleIgnoreTestSuites$1.evaluate(TestRuleIgnoreTestSuites.java:55)
	at com.carrotsearch.randomizedtesting.rules.StatementAdapter.evaluate(StatementAdapter.java:36)
	at com.carrotsearch.randomizedtesting.ThreadLeakControl$StatementRunner.run(ThreadLeakControl.java:365)
	at java.lang.Thread.run(Thread.java:745)


REGRESSION:  org.apache.solr.client.solrj.embedded.SolrExampleStreamingTest.testChildDoctransformer

Error Message:
java.lang.AssertionError

Stack Trace:
org.apache.solr.client.solrj.impl.HttpSolrServer$RemoteSolrException: java.lang.AssertionError
	at __randomizedtesting.SeedInfo.seed([C6876002C09159DD:B55D7F984C892EDB]:0)
	at org.apache.solr.client.solrj.impl.HttpSolrServer.executeMethod(HttpSolrServer.java:550)
	at org.apache.solr.client.solrj.impl.HttpSolrServer.request(HttpSolrServer.java:210)
	at org.apache.solr.client.solrj.impl.HttpSolrServer.request(HttpSolrServer.java:206)
	at org.apache.solr.client.solrj.impl.ConcurrentUpdateSolrServer.request(ConcurrentUpdateSolrServer.java:281)
	at org.apache.solr.client.solrj.request.QueryRequest.process(QueryRequest.java:91)
	at org.apache.solr.client.solrj.SolrServer.query(SolrServer.java:301)
	at org.apache.solr.client.solrj.SolrExampleTests.testChildDoctransformer(SolrExampleTests.java:1373)
	at sun.reflect.NativeMethodAccessorImpl.invoke0(Native Method)
	at sun.reflect.NativeMethodAccessorImpl.invoke(NativeMethodAccessorImpl.java:62)
	at sun.reflect.DelegatingMethodAccessorImpl.invoke(DelegatingMethodAccessorImpl.java:43)
	at java.lang.reflect.Method.invoke(Method.java:484)
	at com.carrotsearch.randomizedtesting.RandomizedRunner.invoke(RandomizedRunner.java:1618)
	at com.carrotsearch.randomizedtesting.RandomizedRunner$6.evaluate(RandomizedRunner.java:827)
	at com.carrotsearch.randomizedtesting.RandomizedRunner$7.evaluate(RandomizedRunner.java:863)
	at com.carrotsearch.randomizedtesting.RandomizedRunner$8.evaluate(RandomizedRunner.java:877)
	at com.carrotsearch.randomizedtesting.rules.SystemPropertiesRestoreRule$1.evaluate(SystemPropertiesRestoreRule.java:53)
	at org.apache.lucene.util.TestRuleSetupTeardownChained$1.evaluate(TestRuleSetupTeardownChained.java:50)
	at org.apache.lucene.util.TestRuleFieldCacheSanity$1.evaluate(TestRuleFieldCacheSanity.java:51)
	at org.apache.lucene.util.AbstractBeforeAfterRule$1.evaluate(AbstractBeforeAfterRule.java:46)
	at com.carrotsearch.randomizedtesting.rules.SystemPropertiesInvariantRule$1.evaluate(SystemPropertiesInvariantRule.java:55)
	at org.apache.lucene.util.TestRuleThreadAndTestName$1.evaluate(TestRuleThreadAndTestName.java:49)
	at org.apache.lucene.util.TestRuleIgnoreAfterMaxFailures$1.evaluate(TestRuleIgnoreAfterMaxFailures.java:65)
	at org.apache.lucene.util.TestRuleMarkFailure$1.evaluate(TestRuleMarkFailure.java:48)
	at com.carrotsearch.randomizedtesting.rules.StatementAdapter.evaluate(StatementAdapter.java:36)
	at com.carrotsearch.randomizedtesting.ThreadLeakControl$StatementRunner.run(ThreadLeakControl.java:365)
	at com.carrotsearch.randomizedtesting.ThreadLeakControl.forkTimeoutingTask(ThreadLeakControl.java:798)
	at com.carrotsearch.randomizedtesting.ThreadLeakControl$3.evaluate(ThreadLeakControl.java:458)
	at com.carrotsearch.randomizedtesting.RandomizedRunner.runSingleTest(RandomizedRunner.java:836)
	at com.carrotsearch.randomizedtesting.RandomizedRunner$3.evaluate(RandomizedRunner.java:738)
	at com.carrotsearch.randomizedtesting.RandomizedRunner$4.evaluate(RandomizedRunner.java:772)
	at com.carrotsearch.randomizedtesting.RandomizedRunner$5.evaluate(RandomizedRunner.java:783)
	at com.carrotsearch.randomizedtesting.rules.StatementAdapter.evaluate(StatementAdapter.java:36)
	at com.carrotsearch.randomizedtesting.rules.SystemPropertiesRestoreRule$1.evaluate(SystemPropertiesRestoreRule.java:53)
	at org.apache.lucene.util.AbstractBeforeAfterRule$1.evaluate(AbstractBeforeAfterRule.java:46)
	at org.apache.lucene.util.TestRuleStoreClassName$1.evaluate(TestRuleStoreClassName.java:42)
	at com.carrotsearch.randomizedtesting.rules.SystemPropertiesInvariantRule$1.evaluate(SystemPropertiesInvariantRule.java:55)
	at com.carrotsearch.randomizedtesting.rules.NoShadowingOrOverridesOnMethodsRule$1.evaluate(NoShadowingOrOverridesOnMethodsRule.java:39)
	at com.carrotsearch.randomizedtesting.rules.NoShadowingOrOverridesOnMethodsRule$1.evaluate(NoShadowingOrOverridesOnMethodsRule.java:39)
	at com.carrotsearch.randomizedtesting.rules.StatementAdapter.evaluate(StatementAdapter.java:36)
	at com.carrotsearch.randomizedtesting.rules.StatementAdapter.evaluate(StatementAdapter.java:36)
	at com.carrotsearch.randomizedtesting.rules.StatementAdapter.evaluate(StatementAdapter.java:36)
	at org.apache.lucene.util.TestRuleAssertionsRequired$1.evaluate(TestRuleAssertionsRequired.java:43)
	at org.apache.lucene.util.TestRuleMarkFailure$1.evaluate(TestRuleMarkFailure.java:48)
	at org.apache.lucene.util.TestRuleIgnoreAfterMaxFailures$1.evaluate(TestRuleIgnoreAfterMaxFailures.java:65)
	at org.apache.lucene.util.TestRuleIgnoreTestSuites$1.evaluate(TestRuleIgnoreTestSuites.java:55)
	at com.carrotsearch.randomizedtesting.rules.StatementAdapter.evaluate(StatementAdapter.java:36)
	at com.carrotsearch.randomizedtesting.ThreadLeakControl$StatementRunner.run(ThreadLeakControl.java:365)
	at java.lang.Thread.run(Thread.java:745)




Build Log:
[...truncated 12643 lines...]
   [junit4] Suite: org.apache.solr.client.solrj.SolrExampleBinaryTest
   [junit4]   2> SLF4J: Class path contains multiple SLF4J bindings.
   [junit4]   2> SLF4J: Found binding in [jar:file:/mnt/ssd/jenkins/workspace/Lucene-Solr-4.x-Linux/solr/solrj/test-lib/slf4j-log4j12-1.7.6.jar!/org/slf4j/impl/StaticLoggerBinder.class]
   [junit4]   2> SLF4J: Found binding in [jar:file:/mnt/ssd/jenkins/workspace/Lucene-Solr-4.x-Linux/solr/core/lib/slf4j-log4j12-1.7.6.jar!/org/slf4j/impl/StaticLoggerBinder.class]
   [junit4]   2> SLF4J: See http://www.slf4j.org/codes.html#multiple_bindings for an explanation.
   [junit4]   2> SLF4J: Actual binding is of type [org.slf4j.impl.Log4jLoggerFactory]
   [junit4]   2> log4j:WARN No such property [conversionPattern] in org.apache.solr.util.SolrLogLayout.
   [junit4]   2> Creating dataDir: /mnt/ssd/jenkins/workspace/Lucene-Solr-4.x-Linux/solr/build/solr-solrj/test/J1/./temp/solr.client.solrj.SolrExampleBinaryTest-C6876002C09159DD-001/init-core-data-001
   [junit4]   2> 296 T15 oas.SolrTestCaseJ4.initCore ####initCore
   [junit4]   2> 300 T15 oas.SolrTestCaseJ4.initCore ####initCore end
   [junit4]   2> 482 T15 oejs.Server.doStart jetty-8.1.10.v20130312
   [junit4]   2> 568 T15 oejs.AbstractConnector.doStart Started SelectChannelConnector@127.0.0.1:44216
   [junit4]   2> 626 T15 oass.SolrDispatchFilter.init SolrDispatchFilter.init()
   [junit4]   2> 659 T15 oasc.SolrResourceLoader.locateSolrHome JNDI not configured for solr (NoInitialContextEx)
   [junit4]   2> 660 T15 oasc.SolrResourceLoader.locateSolrHome using system property solr.solr.home: /mnt/ssd/jenkins/workspace/Lucene-Solr-4.x-Linux/solr/example/solr
   [junit4]   2> 661 T15 oasc.SolrResourceLoader.<init> new SolrResourceLoader for directory: '/mnt/ssd/jenkins/workspace/Lucene-Solr-4.x-Linux/solr/example/solr/'
   [junit4]   2> 808 T15 oasc.ConfigSolr.fromFile Loading container configuration from /mnt/ssd/jenkins/workspace/Lucene-Solr-4.x-Linux/solr/example/solr/solr.xml
   [junit4]   2> 939 T15 oasc.CorePropertiesLocator.<init> Config-defined core root directory: /mnt/ssd/jenkins/workspace/Lucene-Solr-4.x-Linux/solr/example/solr
   [junit4]   2> 947 T15 oasc.CoreContainer.<init> New CoreContainer 19784335
   [junit4]   2> 948 T15 oasc.CoreContainer.load Loading cores into CoreContainer [instanceDir=/mnt/ssd/jenkins/workspace/Lucene-Solr-4.x-Linux/solr/example/solr/]
   [junit4]   2> 994 T15 oashc.HttpShardHandlerFactory.getParameter Setting socketTimeout to: 0
   [junit4]   2> 995 T15 oashc.HttpShardHandlerFactory.getParameter Setting urlScheme to: null
   [junit4]   2> 1000 T15 oashc.HttpShardHandlerFactory.getParameter Setting connTimeout to: 0
   [junit4]   2> 1001 T15 oashc.HttpShardHandlerFactory.getParameter Setting maxConnectionsPerHost to: 20
   [junit4]   2> 1002 T15 oashc.HttpShardHandlerFactory.getParameter Setting corePoolSize to: 0
   [junit4]   2> 1003 T15 oashc.HttpShardHandlerFactory.getParameter Setting maximumPoolSize to: 2147483647
   [junit4]   2> 1003 T15 oashc.HttpShardHandlerFactory.getParameter Setting maxThreadIdleTime to: 5
   [junit4]   2> 1003 T15 oashc.HttpShardHandlerFactory.getParameter Setting sizeOfQueue to: -1
   [junit4]   2> 1004 T15 oashc.HttpShardHandlerFactory.getParameter Setting fairnessPolicy to: false
   [junit4]   2> 1155 T15 oasu.UpdateShardHandler.<init> Creating UpdateShardHandler HTTP client with params: socketTimeout=0&connTimeout=0&retry=false
   [junit4]   2> 1159 T15 oasl.LogWatcher.createWatcher SLF4J impl is org.slf4j.impl.Log4jLoggerFactory
   [junit4]   2> 1161 T15 oasl.LogWatcher.newRegisteredLogWatcher Registering Log Listener [Log4j (org.slf4j.impl.Log4jLoggerFactory)]
   [junit4]   2> 1164 T15 oasc.CoreContainer.load Host Name: 
   [junit4]   2> 1243 T15 oasc.CorePropertiesLocator.discover Looking for core definitions underneath /mnt/ssd/jenkins/workspace/Lucene-Solr-4.x-Linux/solr/example/solr
   [junit4]   2> 1271 T15 oasc.CorePropertiesLocator.discoverUnder Found core collection1 in /mnt/ssd/jenkins/workspace/Lucene-Solr-4.x-Linux/solr/example/solr/collection1/
   [junit4]   2> 1274 T15 oasc.CorePropertiesLocator.discover Found 1 core definitions
   [junit4]   2> 1278 T27 oasc.SolrResourceLoader.<init> new SolrResourceLoader for directory: '/mnt/ssd/jenkins/workspace/Lucene-Solr-4.x-Linux/solr/example/solr/collection1/'
   [junit4]   2> 1354 T27 oasc.SolrConfig.initLibs Adding specified lib dirs to ClassLoader
   [junit4]   2> 1356 T27 oasc.SolrResourceLoader.addToClassLoader WARN No files added to classloader from lib: ../../../contrib/extraction/lib (resolved as: /mnt/ssd/jenkins/workspace/Lucene-Solr-4.x-Linux/solr/example/solr/collection1/../../../contrib/extraction/lib).
   [junit4]   2> 1356 T27 oasc.SolrResourceLoader.addToClassLoader WARN Can't find (or read) directory to add to classloader: ../../../dist/ (resolved as: /mnt/ssd/jenkins/workspace/Lucene-Solr-4.x-Linux/solr/example/solr/collection1/../../../dist).
   [junit4]   2> 1357 T27 oasc.SolrResourceLoader.addToClassLoader WARN No files added to classloader from lib: ../../../contrib/clustering/lib/ (resolved as: /mnt/ssd/jenkins/workspace/Lucene-Solr-4.x-Linux/solr/example/solr/collection1/../../../contrib/clustering/lib).
   [junit4]   2> 1357 T27 oasc.SolrResourceLoader.addToClassLoader WARN Can't find (or read) directory to add to classloader: ../../../dist/ (resolved as: /mnt/ssd/jenkins/workspace/Lucene-Solr-4.x-Linux/solr/example/solr/collection1/../../../dist).
   [junit4]   2> 1358 T27 oasc.SolrResourceLoader.addToClassLoader WARN No files added to classloader from lib: ../../../contrib/langid/lib/ (resolved as: /mnt/ssd/jenkins/workspace/Lucene-Solr-4.x-Linux/solr/example/solr/collection1/../../../contrib/langid/lib).
   [junit4]   2> 1358 T27 oasc.SolrResourceLoader.addToClassLoader WARN Can't find (or read) directory to add to classloader: ../../../dist/ (resolved as: /mnt/ssd/jenkins/workspace/Lucene-Solr-4.x-Linux/solr/example/solr/collection1/../../../dist).
   [junit4]   2> 1358 T27 oasc.SolrResourceLoader.addToClassLoader WARN No files added to classloader from lib: ../../../contrib/velocity/lib (resolved as: /mnt/ssd/jenkins/workspace/Lucene-Solr-4.x-Linux/solr/example/solr/collection1/../../../contrib/velocity/lib).
   [junit4]   2> 1359 T27 oasc.SolrResourceLoader.addToClassLoader WARN Can't find (or read) directory to add to classloader: ../../../dist/ (resolved as: /mnt/ssd/jenkins/workspace/Lucene-Solr-4.x-Linux/solr/example/solr/collection1/../../../dist).
   [junit4]   2> 1405 T27 oasu.SolrIndexConfig.<init> IndexWriter infoStream solr logging is enabled
   [junit4]   2> 1408 T27 oasc.SolrConfig.<init> Using Lucene MatchVersion: 4.11.0
   [junit4]   2> 1534 T27 oasc.SolrConfig.<init> Loaded SolrConfig: solrconfig.xml
   [junit4]   2> 1544 T27 oass.IndexSchema.readSchema Reading Solr Schema from schema.xml
   [junit4]   2> 1584 T27 oass.IndexSchema.readSchema [collection1] Schema name=example
   [junit4]   2> 2520 T27 oass.IndexSchema.readSchema unique key field: id
   [junit4]   2> 2549 T27 oasr.RestManager$Registry.registerManagedResource Registered ManagedResource impl org.apache.solr.rest.schema.analysis.ManagedWordSetResource for path /schema/analysis/stopwords/english
   [junit4]   2> 2551 T27 oasr.RestManager$Registry.registerManagedResource Registered ManagedResource impl org.apache.solr.rest.schema.analysis.ManagedSynonymFilterFactory$SynonymManager for path /schema/analysis/synonyms/english
   [junit4]   2> 2729 T27 oass.FileExchangeRateProvider.reload Reloading exchange rates from file currency.xml
   [junit4]   2> 2736 T27 oass.FileExchangeRateProvider.reload Reloading exchange rates from file currency.xml
   [junit4]   2> 2848 T27 oasc.CoreContainer.create Creating SolrCore 'collection1' using configuration from instancedir /mnt/ssd/jenkins/workspace/Lucene-Solr-4.x-Linux/solr/example/solr/collection1/
   [junit4]   2> 2912 T27 oasc.SolrCore.initDirectoryFactory org.apache.solr.core.MockDirectoryFactory
   [junit4]   2> 2924 T27 oasc.SolrCore.<init> [collection1] Opening new SolrCore at /mnt/ssd/jenkins/workspace/Lucene-Solr-4.x-Linux/solr/example/solr/collection1/, dataDir=/mnt/ssd/jenkins/workspace/Lucene-Solr-4.x-Linux/solr/build/solr-solrj/test/J1/temp/solr.client.solrj.SolrExampleBinaryTest-C6876002C09159DD-001/tempDir-001/
   [junit4]   2> 2926 T27 oasc.JmxMonitoredMap.<init> No JMX servers found, not exposing Solr information with JMX.
   [junit4]   2> 2936 T27 oasc.SolrCore.initListeners [collection1] Added SolrEventListener for newSearcher: org.apache.solr.core.QuerySenderListener{queries=[]}
   [junit4]   2> 2937 T27 oasc.SolrCore.initListeners [collection1] Added SolrEventListener for firstSearcher: org.apache.solr.core.QuerySenderListener{queries=[{q=static firstSearcher warming in solrconfig.xml}]}
   [junit4]   2> 2974 T27 oasc.CachingDirectoryFactory.get return new directory for /mnt/ssd/jenkins/workspace/Lucene-Solr-4.x-Linux/solr/build/solr-solrj/test/J1/temp/solr.client.solrj.SolrExampleBinaryTest-C6876002C09159DD-001/tempDir-001
   [junit4]   2> 2974 T27 oasc.SolrCore.getNewIndexDir New index directory detected: old=null new=/mnt/ssd/jenkins/workspace/Lucene-Solr-4.x-Linux/solr/build/solr-solrj/test/J1/temp/solr.client.solrj.SolrExampleBinaryTest-C6876002C09159DD-001/tempDir-001/index/
   [junit4]   2> 2975 T27 oasc.SolrCore.initIndex WARN [collection1] Solr index directory '/mnt/ssd/jenkins/workspace/Lucene-Solr-4.x-Linux/solr/build/solr-solrj/test/J1/temp/solr.client.solrj.SolrExampleBinaryTest-C6876002C09159DD-001/tempDir-001/index' doesn't exist. Creating new index...
   [junit4]   2> 2976 T27 oasc.CachingDirectoryFactory.get return new directory for /mnt/ssd/jenkins/workspace/Lucene-Solr-4.x-Linux/solr/build/solr-solrj/test/J1/temp/solr.client.solrj.SolrExampleBinaryTest-C6876002C09159DD-001/tempDir-001/index
   [junit4]   2> 3020 T27 oasu.LoggingInfoStream.message [IFD][coreLoadExecutor-5-thread-1]: init: current segments file is "null"; deletionPolicy=org.apache.solr.core.IndexDeletionPolicyWrapper@17d1faf
   [junit4]   2> 3023 T27 oasu.LoggingInfoStream.message [IFD][coreLoadExecutor-5-thread-1]: now checkpoint "" [0 segments ; isCommit = false]
   [junit4]   2> 3023 T27 oasu.LoggingInfoStream.message [IFD][coreLoadExecutor-5-thread-1]: 0 msec to checkpoint
   [junit4]   2> 3023 T27 oasu.LoggingInfoStream.message [IW][coreLoadExecutor-5-thread-1]: init: create=true
   [junit4]   2> 3024 T27 oasu.LoggingInfoStream.message [IW][coreLoadExecutor-5-thread-1]: 
   [junit4]   2> 	dir=MockDirectoryWrapper(RAMDirectory@eccaa2 lockFactory=NativeFSLockFactory@/mnt/ssd/jenkins/workspace/Lucene-Solr-4.x-Linux/solr/build/solr-solrj/test/J1/temp/solr.client.solrj.SolrExampleBinaryTest-C6876002C09159DD-001/tempDir-001/index)
   [junit4]   2> 	index=
   [junit4]   2> 	version=4.11.0
   [junit4]   2> 	matchVersion=4.11.0
   [junit4]   2> 	analyzer=null
   [junit4]   2> 	ramBufferSizeMB=100.0
   [junit4]   2> 	maxBufferedDocs=-1
   [junit4]   2> 	maxBufferedDeleteTerms=-1
   [junit4]   2> 	mergedSegmentWarmer=null
   [junit4]   2> 	readerTermsIndexDivisor=1
   [junit4]   2> 	termIndexInterval=32
   [junit4]   2> 	delPolicy=org.apache.solr.core.IndexDeletionPolicyWrapper
   [junit4]   2> 	commit=null
   [junit4]   2> 	openMode=CREATE
   [junit4]   2> 	similarity=org.apache.lucene.search.similarities.DefaultSimilarity
   [junit4]   2> 	mergeScheduler=ConcurrentMergeScheduler: maxThreadCount=1, maxMergeCount=2, mergeThreadPriority=-1
   [junit4]   2> 	default WRITE_LOCK_TIMEOUT=1000
   [junit4]   2> 	writeLockTimeout=1000
   [junit4]   2> 	codec=Lucene410
   [junit4]   2> 	infoStream=org.apache.solr.update.LoggingInfoStream
   [junit4]   2> 	mergePolicy=[TieredMergePolicy: maxMergeAtOnce=10, maxMergeAtOnceExplicit=30, maxMergedSegmentMB=5120.0, floorSegmentMB=2.0, forceMergeDeletesPctAllowed=10.0, segmentsPerTier=10.0, maxCFSSegmentSizeMB=8.796093022207999E12, noCFSRatio=0.0
   [junit4]   2> 	indexerThreadPool=org.apache.lucene.index.DocumentsWriterPerThreadPool@ee1eb1
   [junit4]   2> 	readerPooling=false
   [junit4]   2> 	perThreadHardLimitMB=1945
   [junit4]   2> 	useCompoundFile=false
   [junit4]   2> 	checkIntegrityAtMerge=false
   [junit4]   2> 	writer=org.apache.lucene.util.SetOnce@af5014
   [junit4]   2> 	
   [junit4]   2> 3025 T27 oasu.LoggingInfoStream.message [IW][coreLoadExecutor-5-thread-1]: now flush at close
   [junit4]   2> 3026 T27 oasu.LoggingInfoStream.message [IW][coreLoadExecutor-5-thread-1]:   start flush: applyAllDeletes=true
   [junit4]   2> 3026 T27 oasu.LoggingInfoStream.message [IW][coreLoadExecutor-5-thread-1]:   index before flush 
   [junit4]   2> 3026 T27 oasu.LoggingInfoStream.message [DW][coreLoadExecutor-5-thread-1]: startFullFlush
   [junit4]   2> 3027 T27 oasu.LoggingInfoStream.message [DW][coreLoadExecutor-5-thread-1]: anyChanges? numDocsInRam=0 deletes=false hasTickets:false pendingChangesInFullFlush: false
   [junit4]   2> 3027 T27 oasu.LoggingInfoStream.message [DW][coreLoadExecutor-5-thread-1]: coreLoadExecutor-5-thread-1 finishFullFlush success=true
   [junit4]   2> 3028 T27 oasu.LoggingInfoStream.message [IW][coreLoadExecutor-5-thread-1]: apply all deletes during flush
   [junit4]   2> 3029 T27 oasu.LoggingInfoStream.message [BD][coreLoadExecutor-5-thread-1]: prune sis=null:  minGen=9223372036854775807 packetCount=0
   [junit4]   2> 3030 T27 oasu.LoggingInfoStream.message [CMS][coreLoadExecutor-5-thread-1]: now merge
   [junit4]   2> 3030 T27 oasu.LoggingInfoStream.message [CMS][coreLoadExecutor-5-thread-1]:   index: 
   [junit4]   2> 3031 T27 oasu.LoggingInfoStream.message [CMS][coreLoadExecutor-5-thread-1]:   no more merges pending; now return
   [junit4]   2> 3031 T27 oasu.LoggingInfoStream.message [IW][coreLoadExecutor-5-thread-1]: waitForMerges
   [junit4]   2> 3032 T27 oasu.LoggingInfoStream.message [IW][coreLoadExecutor-5-thread-1]: waitForMerges done
   [junit4]   2> 3032 T27 oasu.LoggingInfoStream.message [IW][coreLoadExecutor-5-thread-1]: commit: start
   [junit4]   2> 3032 T27 oasu.LoggingInfoStream.message [IW][coreLoadExecutor-5-thread-1]: commit: enter lock
   [junit4]   2> 3033 T27 oasu.LoggingInfoStream.message [IW][coreLoadExecutor-5-thread-1]: commit: now prepare
   [junit4]   2> 3033 T27 oasu.LoggingInfoStream.message [IW][coreLoadExecutor-5-thread-1]: prepareCommit: flush
   [junit4]   2> 3033 T27 oasu.LoggingInfoStream.message [IW][coreLoadExecutor-5-thread-1]:   index before flush 
   [junit4]   2> 3034 T27 oasu.LoggingInfoStream.message [DW][coreLoadExecutor-5-thread-1]: startFullFlush
   [junit4]   2> 3034 T27 oasu.LoggingInfoStream.message [DW][coreLoadExecutor-5-thread-1]: anyChanges? numDocsInRam=0 deletes=false hasTickets:false pendingChangesInFullFlush: false
   [junit4]   2> 3034 T27 oasu.LoggingInfoStream.message [IW][coreLoadExecutor-5-thread-1]: apply all deletes during flush
   [junit4]   2> 3035 T27 oasu.LoggingInfoStream.message [BD][coreLoadExecutor-5-thread-1]: prune sis=null:  minGen=9223372036854775807 packetCount=0
   [junit4]   2> 3035 T27 oasu.LoggingInfoStream.message [DW][coreLoadExecutor-5-thread-1]: coreLoadExecutor-5-thread-1 finishFullFlush success=true
   [junit4]   2> 3036 T27 oasu.LoggingInfoStream.message [IW][coreLoadExecutor-5-thread-1]: startCommit(): start
   [junit4]   2> 3036 T27 oasu.LoggingInfoStream.message [IW][coreLoadExecutor-5-thread-1]: startCommit index= changeCount=1
   [junit4]   2> 3044 T27 oasu.LoggingInfoStream.message [IW][coreLoadExecutor-5-thread-1]: done all syncs: []
   [junit4]   2> 3044 T27 oasu.LoggingInfoStream.message [IW][coreLoadExecutor-5-thread-1]: commit: pendingCommit != null
   [junit4]   2> 3044 T27 oasu.LoggingInfoStream.message [IW][coreLoadExecutor-5-thread-1]: commit: wrote segments file "segments_1"
   [junit4]   2> 3045 T27 oasu.LoggingInfoStream.message [IFD][coreLoadExecutor-5-thread-1]: now checkpoint "" [0 segments ; isCommit = true]
   [junit4]   2> 3054 T27 oasc.SolrDeletionPolicy.onCommit SolrDeletionPolicy.onCommit: commits: num=1
   [junit4]   2> 		commit{dir=MockDirectoryWrapper(RAMDirectory@eccaa2 lockFactory=NativeFSLockFactory@/mnt/ssd/jenkins/workspace/Lucene-Solr-4.x-Linux/solr/build/solr-solrj/test/J1/temp/solr.client.solrj.SolrExampleBinaryTest-C6876002C09159DD-001/tempDir-001/index),segFN=segments_1,generation=1}
   [junit4]   2> 3055 T27 oasc.SolrDeletionPolicy.updateCommits newest commit generation = 1
   [junit4]   2> 3055 T27 oasu.LoggingInfoStream.message [IFD][coreLoadExecutor-5-thread-1]: 10 msec to checkpoint
   [junit4]   2> 3056 T27 oasu.LoggingInfoStream.message [IW][coreLoadExecutor-5-thread-1]: commit: took 22.7 msec
   [junit4]   2> 3057 T27 oasu.LoggingInfoStream.message [IW][coreLoadExecutor-5-thread-1]: commit: done
   [junit4]   2> 3057 T27 oasu.LoggingInfoStream.message [IW][coreLoadExecutor-5-thread-1]: rollback
   [junit4]   2> 3057 T27 oasu.LoggingInfoStream.message [IW][coreLoadExecutor-5-thread-1]: all running merges have aborted
   [junit4]   2> 3058 T27 oasu.LoggingInfoStream.message [IW][coreLoadExecutor-5-thread-1]: rollback: done finish merges
   [junit4]   2> 3058 T27 oasu.LoggingInfoStream.message [DW][coreLoadExecutor-5-thread-1]: abort
   [junit4]   2> 3059 T27 oasu.LoggingInfoStream.message [DW][coreLoadExecutor-5-thread-1]: done abort; abortedFiles=[] success=true
   [junit4]   2> 3060 T27 oasu.LoggingInfoStream.message [IW][coreLoadExecutor-5-thread-1]: rollback: infos=
   [junit4]   2> 3060 T27 oasu.LoggingInfoStream.message [IFD][coreLoadExecutor-5-thread-1]: now checkpoint "" [0 segments ; isCommit = false]
   [junit4]   2> 3060 T27 oasu.LoggingInfoStream.message [IFD][coreLoadExecutor-5-thread-1]: 0 msec to checkpoint
   [junit4]   2> 3068 T27 oasc.SolrCore.initWriters created json: solr.JSONResponseWriter
   [junit4]   2> 3068 T27 oasc.SolrCore.initWriters adding lazy queryResponseWriter: solr.VelocityResponseWriter
   [junit4]   2> 3070 T27 oasc.SolrCore.initWriters created velocity: solr.VelocityResponseWriter
   [junit4]   2> 3077 T27 oasc.SolrCore.initWriters created xslt: solr.XSLTResponseWriter
   [junit4]   2> 3078 T27 oasr.XSLTResponseWriter.init xsltCacheLifetimeSeconds=5
   [junit4]   2> 3453 T27 oasc.SolrCore.loadUpdateProcessorChains no updateRequestProcessorChain defined as default, creating implicit default
   [junit4]   2> 3465 T27 oasc.RequestHandlers.initHandlersFromConfig created /update: org.apache.solr.handler.UpdateRequestHandler
   [junit4]   2> 3466 T27 oasc.RequestHandlers.initHandlersFromConfig created /update/json: org.apache.solr.handler.UpdateRequestHandler
   [junit4]   2> 3466 T27 oasc.RequestHandlers.initHandlersFromConfig created /update/csv: org.apache.solr.handler.UpdateRequestHandler
   [junit4]   2> 3466 T27 oasc.RequestHandlers.initHandlersFromConfig created /update/json/docs: org.apache.solr.handler.UpdateRequestHandler
   [junit4]   2> 3480 T27 oasc.RequestHandlers.initHandlersFromConfig created /select: solr.SearchHandler
   [junit4]   2> 3481 T27 oasc.RequestHandlers.initHandlersFromConfig created /query: solr.SearchHandler
   [junit4]   2> 3485 T27 oasc.RequestHandlers.initHandlersFromConfig created /get: solr.RealTimeGetHandler
   [junit4]   2> 3485 T27 oasc.RequestHandlers.initHandlersFromConfig created /export: solr.SearchHandler
   [junit4]   2> 3485 T27 oasc.RequestHandlers.initHandlersFromConfig created /browse: solr.SearchHandler
   [junit4]   2> 3488 T27 oasc.RequestHandlers.initHandlersFromConfig WARN Multiple requestHandler registered to the same name: /update ignoring: org.apache.solr.handler.UpdateRequestHandler
   [junit4]   2> 3489 T27 oasc.RequestHandlers.initHandlersFromConfig created /update: solr.UpdateRequestHandler
   [junit4]   2> 3489 T27 oasc.RequestHandlers.initHandlersFromConfig adding lazy requestHandler: solr.extraction.ExtractingRequestHandler
   [junit4]   2> 3490 T27 oasc.RequestHandlers.initHandlersFromConfig created /update/extract: solr.extraction.ExtractingRequestHandler
   [junit4]   2> 3490 T27 oasc.RequestHandlers.initHandlersFromConfig adding lazy requestHandler: solr.FieldAnalysisRequestHandler
   [junit4]   2> 3490 T27 oasc.RequestHandlers.initHandlersFromConfig created /analysis/field: solr.FieldAnalysisRequestHandler
   [junit4]   2> 3491 T27 oasc.RequestHandlers.initHandlersFromConfig adding lazy requestHandler: solr.DocumentAnalysisRequestHandler
   [junit4]   2> 3491 T27 oasc.RequestHandlers.initHandlersFromConfig created /analysis/document: solr.DocumentAnalysisRequestHandler
   [junit4]   2> 3495 T27 oasc.RequestHandlers.initHandlersFromConfig created /admin/: solr.admin.AdminHandlers
   [junit4]   2> 3499 T27 oasc.RequestHandlers.initHandlersFromConfig created /admin/ping: solr.PingRequestHandler
   [junit4]   2> 3503 T27 oasc.RequestHandlers.initHandlersFromConfig created /debug/dump: solr.DumpRequestHandler
   [junit4]   2> 3522 T27 oasc.RequestHandlers.initHandlersFromConfig created /replication: solr.ReplicationHandler
   [junit4]   2> 3522 T27 oasc.RequestHandlers.initHandlersFromConfig adding lazy requestHandler: solr.SearchHandler
   [junit4]   2> 3522 T27 oasc.RequestHandlers.initHandlersFromConfig created /spell: solr.SearchHandler
   [junit4]   2> 3522 T27 oasc.RequestHandlers.initHandlersFromConfig adding lazy requestHandler: solr.SearchHandler
   [junit4]   2> 3523 T27 oasc.RequestHandlers.initHandlersFromConfig created /suggest: solr.SearchHandler
   [junit4]   2> 3523 T27 oasc.RequestHandlers.initHandlersFromConfig adding lazy requestHandler: solr.SearchHandler
   [junit4]   2> 3523 T27 oasc.RequestHandlers.initHandlersFromConfig created /tvrh: solr.SearchHandler
   [junit4]   2> 3523 T27 oasc.RequestHandlers.initHandlersFromConfig adding lazy requestHandler: solr.SearchHandler
   [junit4]   2> 3523 T27 oasc.RequestHandlers.initHandlersFromConfig created /terms: solr.SearchHandler
   [junit4]   2> 3524 T27 oasc.RequestHandlers.initHandlersFromConfig adding lazy requestHandler: solr.SearchHandler
   [junit4]   2> 3524 T27 oasc.RequestHandlers.initHandlersFromConfig created /elevate: solr.SearchHandler
   [junit4]   2> 3550 T27 oashl.XMLLoader.init xsltCacheLifetimeSeconds=60
   [junit4]   2> 3554 T27 oashl.XMLLoader.init xsltCacheLifetimeSeconds=60
   [junit4]   2> 3555 T27 oashl.XMLLoader.init xsltCacheLifetimeSeconds=60
   [junit4]   2> 3556 T27 oashl.XMLLoader.init xsltCacheLifetimeSeconds=60
   [junit4]   2> 3558 T27 oashl.XMLLoader.init xsltCacheLifetimeSeconds=60
   [junit4]   2> 3583 T27 oasu.CommitTracker.<init> Hard AutoCommit: if uncommited for 15000ms; 
   [junit4]   2> 3584 T27 oasu.CommitTracker.<init> Soft AutoCommit: disabled
   [junit4]   2> 3637 T27 oasu.LoggingInfoStream.message [IFD][coreLoadExecutor-5-thread-1]: init: current segments file is "segments_1"; deletionPolicy=org.apache.solr.core.IndexDeletionPolicyWrapper@17d1faf
   [junit4]   2> 3638 T27 oasu.LoggingInfoStream.message [IFD][coreLoadExecutor-5-thread-1]: init: load commit "segments_1"
   [junit4]   2> 3639 T27 oasc.SolrDeletionPolicy.onInit SolrDeletionPolicy.onInit: commits: num=1
   [junit4]   2> 		commit{dir=MockDirectoryWrapper(RAMDirectory@eccaa2 lockFactory=NativeFSLockFactory@/mnt/ssd/jenkins/workspace/Lucene-Solr-4.x-Linux/solr/build/solr-solrj/test/J1/temp/solr.client.solrj.SolrExampleBinaryTest-C6876002C09159DD-001/tempDir-001/index),segFN=segments_1,generation=1}
   [junit4]   2> 3639 T27 oasc.SolrDeletionPolicy.updateCommits newest commit generation = 1
   [junit4]   2> 3639 T27 oasu.LoggingInfoStream.message [IFD][coreLoadExecutor-5-thread-1]: now checkpoint "" [0 segments ; isCommit = false]
   [junit4]   2> 3640 T27 oasu.LoggingInfoStream.message [IFD][coreLoadExecutor-5-thread-1]: 0 msec to checkpoint
   [junit4]   2> 3640 T27 oasu.LoggingInfoStream.message [IW][coreLoadExecutor-5-thread-1]: init: create=false
   [junit4]   2> 3640 T27 oasu.LoggingInfoStream.message [IW][coreLoadExecutor-5-thread-1]: 
   [junit4]   2> 	dir=MockDirectoryWrapper(RAMDirectory@eccaa2 lockFactory=NativeFSLockFactory@/mnt/ssd/jenkins/workspace/Lucene-Solr-4.x-Linux/solr/build/solr-solrj/test/J1/temp/solr.client.solrj.SolrExampleBinaryTest-C6876002C09159DD-001/tempDir-001/index)
   [junit4]   2> 	index=
   [junit4]   2> 	version=4.11.0
   [junit4]   2> 	matchVersion=4.11.0
   [junit4]   2> 	analyzer=null
   [junit4]   2> 	ramBufferSizeMB=100.0
   [junit4]   2> 	maxBufferedDocs=-1
   [junit4]   2> 	maxBufferedDeleteTerms=-1
   [junit4]   2> 	mergedSegmentWarmer=null
   [junit4]   2> 	readerTermsIndexDivisor=1
   [junit4]   2> 	termIndexInterval=32
   [junit4]   2> 	delPolicy=org.apache.solr.core.IndexDeletionPolicyWrapper
   [junit4]   2> 	commit=null
   [junit4]   2> 	openMode=APPEND
   [junit4]   2> 	similarity=org.apache.lucene.search.similarities.DefaultSimilarity
   [junit4]   2> 	mergeScheduler=ConcurrentMergeScheduler: maxThreadCount=1, maxMergeCount=2, mergeThreadPriority=-1
   [junit4]   2> 	default WRITE_LOCK_TIMEOUT=1000
   [junit4]   2> 	writeLockTimeout=1000
   [junit4]   2> 	codec=Lucene410
   [junit4]   2> 	infoStream=org.apache.solr.update.LoggingInfoStream
   [junit4]   2> 	mergePolicy=[TieredMergePolicy: maxMergeAtOnce=10, maxMergeAtOnceExplicit=30, maxMergedSegmentMB=5120.0, floorSegmentMB=2.0, forceMergeDeletesPctAllowed=10.0, segmentsPerTier=10.0, maxCFSSegmentSizeMB=8.796093022207999E12, noCFSRatio=0.0
   [junit4]   2> 	indexerThreadPool=org.apache.lucene.index.DocumentsWriterPerThreadPool@15ac583
   [junit4]   2> 	readerPooling=false
   [junit4]   2> 	perThreadHardLimitMB=1945
   [junit4]   2> 	useCompoundFile=false
   [junit4]   2> 	checkIntegrityAtMerge=false
   [junit4]   2> 	writer=org.apache.lucene.util.SetOnce@daf671
   [junit4]   2> 	
   [junit4]   2> 3643 T27 oasu.LoggingInfoStream.message [IW][coreLoadExecutor-5-thread-1]: flush at getReader
   [junit4]   2> 3643 T27 oasu.LoggingInfoStream.message [DW][coreLoadExecutor-5-thread-1]: startFullFlush
   [junit4]   2> 3644 T27 oasu.LoggingInfoStream.message [DW][coreLoadExecutor-5-thread-1]: anyChanges? numDocsInRam=0 deletes=false hasTickets:false pendingChangesInFullFlush: false
   [junit4]   2> 3644 T27 oasu.LoggingInfoStream.message [IW][coreLoadExecutor-5-thread-1]: apply all deletes during flush
   [junit4]   2> 3644 T27 oasu.LoggingInfoStream.message [BD][coreLoadExecutor-5-thread-1]: prune sis=segments_1:  minGen=9223372036854775807 packetCount=0
   [junit4]   2> 3647 T27 oasu.LoggingInfoStream.message [IW][coreLoadExecutor-5-thread-1]: return reader version=1 reader=StandardDirectoryReader(segments_1:1:nrt)
   [junit4]   2> 3648 T27 oasu.LoggingInfoStream.message [DW][coreLoadExecutor-5-thread-1]: coreLoadExecutor-5-thread-1 finishFullFlush success=true
   [junit4]   2> 3648 T27 oasu.LoggingInfoStream.message [IW][coreLoadExecutor-5-thread-1]: getReader took 5 msec
   [junit4]   2> 3654 T27 oass.SolrIndexSearcher.<init> Opening Searcher@9efd25[collection1] main
   [junit4]   2> 3670 T27 oasr.ManagedResourceStorage.newStorageIO WARN Cannot write to config directory /mnt/ssd/jenkins/workspace/Lucene-Solr-4.x-Linux/solr/example/solr/collection1/conf; switching to use InMemory storage instead.
   [junit4]   2> 3672 T27 oasr.RestManager.init Initializing RestManager with initArgs: {}
   [junit4]   2> 3678 T27 oasr.ManagedResourceStorage.load Reading _rest_managed.json using InMemoryStorage
   [junit4]   2> 3678 T27 oasr.ManagedResource.reloadFromStorage WARN No stored data found for /rest/managed
   [junit4]   2> 3683 T27 oasr.ManagedResourceStorage$JsonStorage.store Saved JSON object to path _rest_managed.json using InMemoryStorage
   [junit4]   2> 3683 T27 oasr.RestManager.init Initializing 2 registered ManagedResources
   [junit4]   2> 3683 T27 oasr.ManagedResourceStorage.load Reading _schema_analysis_stopwords_english.json using InMemoryStorage
   [junit4]   2> 3684 T27 oasr.ManagedResource.reloadFromStorage WARN No stored data found for /schema/analysis/stopwords/english
   [junit4]   2> 3685 T27 oasr.ManagedResourceStorage$JsonStorage.store Saved JSON object to path _schema_analysis_stopwords_english.json using InMemoryStorage
   [junit4]   2> 3686 T27 oasrsa.ManagedWordSetResource.onManagedDataLoadedFromStorage Loaded 0 words for /schema/analysis/stopwords/english
   [junit4]   2> 3686 T27 oasr.ManagedResource.notifyObserversDuringInit Notified 1 observers of /schema/analysis/stopwords/english
   [junit4]   2> 3687 T27 oasr.ManagedResourceStorage.load Reading _schema_analysis_synonyms_english.json using InMemoryStorage
   [junit4]   2> 3690 T27 oasr.ManagedResource.reloadFromStorage WARN No stored data found for /schema/analysis/synonyms/english
   [junit4]   2> 3690 T27 oasrsa.ManagedSynonymFilterFactory$SynonymManager.onManagedDataLoadedFromStorage Loaded 0 synonym mappings for /schema/analysis/synonyms/english
   [junit4]   2> 3693 T27 oasr.ManagedResource.notifyObserversDuringInit Notified 1 observers of /schema/analysis/synonyms/english
   [junit4]   2> 3694 T27 oashc.SpellCheckComponent.inform Initializing spell checkers
   [junit4]   2> 3711 T27 oass.DirectSolrSpellChecker.init init: {name=default,field=text,classname=solr.DirectSolrSpellChecker,distanceMeasure=internal,accuracy=0.5,maxEdits=2,minPrefix=1,maxInspections=5,minQueryLength=4,maxQueryFrequency=0.01}
   [junit4]   2> 3730 T27 oashc.SpellCheckComponent.inform No queryConverter defined, using default converter
   [junit4]   2> 3731 T27 oashc.SuggestComponent.inform Initializing SuggestComponent
   [junit4]   2> 3736 T27 oasss.SolrSuggester.init init: {name=mySuggester,lookupImpl=FuzzyLookupFactory,dictionaryImpl=DocumentDictionaryFactory,field=cat,weightField=price,suggestAnalyzerFieldType=string}
   [junit4]   2> 3795 T27 oasss.SolrSuggester.init Dictionary loaded with params: {name=mySuggester,lookupImpl=FuzzyLookupFactory,dictionaryImpl=DocumentDictionaryFactory,field=cat,weightField=price,suggestAnalyzerFieldType=string}
   [junit4]   2> 3800 T27 oashc.QueryElevationComponent.inform Loading QueryElevation from: /mnt/ssd/jenkins/workspace/Lucene-Solr-4.x-Linux/solr/example/solr/collection1/conf/elevate.xml
   [junit4]   2> 3864 T27 oash.ReplicationHandler.inform Commits will be reserved for  10000
   [junit4]   2> 3864 T28 oasc.QuerySenderListener.newSearcher QuerySenderListener sending requests to Searcher@9efd25[collection1] main{StandardDirectoryReader(segments_1:1:nrt)}
   [junit4]   2> 3866 T27 oasc.CoreContainer.registerCore registering core: collection1
   [junit4]   2> 3869 T15 oass.SolrDispatchFilter.init user.dir=/mnt/ssd/jenkins/workspace/Lucene-Solr-4.x-Linux/solr/build/solr-solrj/test/J1
   [junit4]   2> 3869 T15 oass.SolrDispatchFilter.init SolrDispatchFilter.init() done
   [junit4]   2> 3870 T15 oas.SolrJettyTestBase.createJetty Jetty Assigned Port#44216
   [junit4]   2> 3883 T15 oas.SolrTestCaseJ4.setUp ###Starting testQueryWithParams
   [junit4]   2> ASYNC  NEW_CORE C0 name=collection1 org.apache.solr.core.SolrCore@516a7c
   [junit4]   2> 3960 T28 C0 oasc.SolrCore.execute [collection1] webapp=null path=null params={q=static+firstSearcher+warming+in+solrconfig.xml&distrib=false&event=firstSearcher} hits=0 status=0 QTime=93 
   [junit4]   2> 3962 T28 oasc.QuerySenderListener.newSearcher QuerySenderListener done.
   [junit4]   2> 3963 T28 oashc.SpellCheckComponent$SpellCheckerListener.newSearcher Loading spell index for spellchecker: default
   [junit4]   2> 3963 T28 oashc.SpellCheckComponent$SpellCheckerListener.newSearcher Loading spell index for spellchecker: wordbreak
   [junit4]   2> 3963 T28 oashc.SuggestComponent$SuggesterListener.newSearcher Loading suggester index for: mySuggester
   [junit4]   2> 3963 T28 oasss.SolrSuggester.reload reload()
   [junit4]   2> 3964 T28 oasss.SolrSuggester.build build()
   [junit4]   2> 4008 T28 oasc.SolrCore.registerSearcher [collection1] Registered new searcher Searcher@9efd25[collection1] main{StandardDirectoryReader(segments_1:1:nrt)}
   [junit4]   2> ASYNC  NEW_CORE C1 name=collection1 org.apache.solr.core.SolrCore@516a7c
   [junit4]   2> 4344 T24 C1 oasc.SolrCore.execute [collection1] webapp=/solr path=/select params={q=query&debug=true&wt=javabin&version=2} hits=0 status=0 QTime=5 
   [junit4]   2> 4385 T15 oas.SolrTestCaseJ4.tearDown ###Ending testQueryWithParams
   [junit4]   2> 4396 T15 oas.SolrTestCaseJ4.setUp ###Starting testUpdateRequestWithParameters
   [junit4]   2> ASYNC  NEW_CORE C2 name=collection1 org.apache.solr.core.SolrCore@516a7c
   [junit4]   2> 4449 T26 C2 oasu.LoggingInfoStream.message [DW][qtp11102203-26]: anyChanges? numDocsInRam=0 deletes=true hasTickets:false pendingChangesInFullFlush: false
   [junit4]   2> 4449 T26 C2 oasu.LoggingInfoStream.message [IW][qtp11102203-26]: nrtIsCurrent: infoVersion matches: true; DW changes: true; BD changes: false
   [junit4]   2> 4450 T26 C2 oasu.LoggingInfoStream.message [DW][qtp11102203-26]: anyChanges? numDocsInRam=0 deletes=true hasTickets:false pendingChangesInFullFlush: false
   [junit4]   2> 4450 T26 C2 oasu.LoggingInfoStream.message [IW][qtp11102203-26]: flush at getReader
   [junit4]   2> 4450 T26 C2 oasu.LoggingInfoStream.message [DW][qtp11102203-26]: startFullFlush
   [junit4]   2> 4451 T26 C2 oasu.LoggingInfoStream.message [DW][qtp11102203-26]: anyChanges? numDocsInRam=0 deletes=true hasTickets:false pendingChangesInFullFlush: false
   [junit4]   2> 4451 T26 C2 oasu.LoggingInfoStream.message [DW][qtp11102203-26]: qtp11102203-26: flush naked frozen global deletes
   [junit4]   2> 4457 T26 C2 oasu.LoggingInfoStream.message [BD][qtp11102203-26]: push deletes  1 deleted queries bytesUsed=64 delGen=2 packetCount=1 totBytesUsed=64
   [junit4]   2> 4458 T26 C2 oasu.LoggingInfoStream.message [DW][qtp11102203-26]: flush: push buffered updates:  1 deleted queries bytesUsed=64
   [junit4]   2> 4458 T26 C2 oasu.LoggingInfoStream.message [IW][qtp11102203-26]: apply all deletes during flush
   [junit4]   2> 4459 T26 C2 oasu.LoggingInfoStream.message [BD][qtp11102203-26]: prune sis=segments_1:  minGen=9223372036854775807 packetCount=1
   [junit4]   2> 4459 T26 C2 oasu.LoggingInfoStream.message [BD][qtp11102203-26]: pruneDeletes: prune 1 packets; 0 packets remain
   [junit4]   2> 4459 T26 C2 oasu.LoggingInfoStream.message [IW][qtp11102203-26]: return reader version=1 reader=StandardDirectoryReader(segments_1:1:nrt)
   [junit4]   2> 4460 T26 C2 oasu.LoggingInfoStream.message [DW][qtp11102203-26]: qtp11102203-26 finishFullFlush success=true
   [junit4]   2> 4460 T26 C2 oasu.LoggingInfoStream.message [IW][qtp11102203-26]: getReader took 10 msec
   [junit4]   2> 4463 T26 C2 oasup.LogUpdateProcessor.finish [collection1] webapp=/solr path=/update params={wt=javabin&version=2} {deleteByQuery=*:* (-1478078627935420416)} 0 47
   [junit4]   2> ASYNC  NEW_CORE C3 name=collection1 org.apache.solr.core.SolrCore@516a7c
   [junit4]   2> 4511 T23 C3 oasu.DirectUpdateHandler2.commit start commit{,optimize=false,openSearcher=true,waitSearcher=true,expungeDeletes=false,softCommit=false,prepareCommit=false}
   [junit4]   2> 4512 T23 C3 oasu.LoggingInfoStream.message [DW][qtp11102203-23]: anyChanges? numDocsInRam=0 deletes=false hasTickets:false pendingChangesInFullFlush: false
   [junit4]   2> 4512 T23 C3 oasu.DirectUpdateHandler2.commit No uncommitted changes. Skipping IW.commit.
   [junit4]   2> 4513 T23 C3 oasu.LoggingInfoStream.message [DW][qtp11102203-23]: anyChanges? numDocsInRam=0 deletes=false hasTickets:false pendingChangesInFullFlush: false
   [junit4]   2> 4513 T23 C3 oasu.LoggingInfoStream.message [IW][qtp11102203-23]: nrtIsCurrent: infoVersion matches: true; DW changes: false; BD changes: false
   [junit4]   2> 4513 T23 C3 oasu.LoggingInfoStream.message [DW][qtp11102203-23]: anyChanges? numDocsInRam=0 deletes=false hasTickets:false pendingChangesInFullFlush: false
   [junit4]   2> 4513 T23 C3 oasc.SolrCore.openNewSearcher SolrIndexSearcher has not changed - not re-opening: org.apache.solr.search.SolrIndexSearcher
   [junit4]   2> 4514 T23 C3 oasu.DirectUpdateHandler2.commit end_commit_flush
   [junit4]   2> 4515 T23 C3 oasup.LogUpdateProcessor.finish [collection1] webapp=/solr path=/update params={waitSearcher=true&commit=true&softCommit=false&wt=javabin&version=2} {commit=} 0 5
   [junit4]   2> ASYNC  NEW_CORE C4 name=collection1 org.apache.solr.core.SolrCore@516a7c
   [junit4]   2> 4591 T24 C4 oasup.LogUpdateProcessor.finish [collection1] webapp=/solr path=/update params={overwrite=false&wt=javabin&version=2} {add=[id1 (1478078628031889408)]} 0 71
   [junit4]   2> 4595 T26 C4 oasup.LogUpdateProcessor.finish [collection1] webapp=/solr path=/update params={overwrite=false&wt=javabin&version=2} {add=[id1 (1478078628108435456)]} 0 1
   [junit4]   2> 4601 T23 C4 oasu.DirectUpdateHandler2.commit start commit{,optimize=false,openSearcher=true,waitSearcher=true,expungeDeletes=false,softCommit=false,prepareCommit=false}
   [junit4]   2> 4601 T23 C4 oasu.LoggingInfoStream.message [IW][qtp11102203-23]: commit: start
   [junit4]   2> 4602 T23 C4 oasu.LoggingInfoStream.message [IW][qtp11102203-23]: commit: enter lock
   [junit4]   2> 4602 T23 C4 oasu.LoggingInfoStream.message [IW][qtp11102203-23]: commit: now prepare
   [junit4]   2> 4602 T23 C4 oasu.LoggingInfoStream.message [IW][qtp11102203-23]: prepareCommit: flush
   [junit4]   2> 4603 T23 C4 oasu.LoggingInfoStream.message [IW][qtp11102203-23]:   index before flush 
   [junit4]   2> 4603 T23 C4 oasu.LoggingInfoStream.message [DW][qtp11102203-23]: startFullFlush
   [junit4]   2> 4603 T23 C4 oasu.LoggingInfoStream.message [DW][qtp11102203-23]: anyChanges? numDocsInRam=2 deletes=false hasTickets:false pendingChangesInFullFlush: false
   [junit4]   2> 4604 T23 C4 oasu.LoggingInfoStream.message [DWFC][qtp11102203-23]: addFlushableState DocumentsWriterPerThread [pendingDeletes=gen=0, segment=_0, aborting=false, numDocsInRAM=2, deleteQueue=DWDQ: [ generation: 2 ]]
   [junit4]   2> 4606 T23 C4 oasu.LoggingInfoStream.message [DWPT][qtp11102203-23]: flush postings as segment _0 numDocs=2
   [junit4]   2> 4641 T23 C4 oasu.LoggingInfoStream.message [DWPT][qtp11102203-23]: new segment has 0 deleted docs
   [junit4]   2> 4642 T23 C4 oasu.LoggingInfoStream.message [DWPT][qtp11102203-23]: new segment has no vectors; no norms; no docValues; no prox; no freqs
   [junit4]   2> 4642 T23 C4 oasu.LoggingInfoStream.message [DWPT][qtp11102203-23]: flushedFiles=[_0_Lucene41_0.tip, _0_Lucene41_0.doc, _0_Lucene41_0.tim, _0.fdx, _0.fdt, _0.fnm]
   [junit4]   2> 4642 T23 C4 oasu.LoggingInfoStream.message [DWPT][qtp11102203-23]: flushed codec=Lucene410
   [junit4]   2> 4646 T23 C4 oasu.LoggingInfoStream.message [DWPT][qtp11102203-23]: flushed: segment=_0 ramUsed=0.063 MB newFlushedSize(includes docstores)=0.001 MB docs/MB=2,796.203
   [junit4]   2> 4649 T23 C4 oasu.LoggingInfoStream.message [DW][qtp11102203-23]: publishFlushedSegment seg-private updates=null
   [junit4]   2> 4650 T23 C4 oasu.LoggingInfoStream.message [IW][qtp11102203-23]: publishFlushedSegment
   [junit4]   2> 4650 T23 C4 oasu.LoggingInfoStream.message [IW][qtp11102203-23]: publish sets newSegment delGen=4 seg=_0(4.11.0):C2
   [junit4]   2> 4650 T23 C4 oasu.LoggingInfoStream.message [IFD][qtp11102203-23]: now checkpoint "_0(4.11.0):C2" [1 segments ; isCommit = false]
   [junit4]   2> 4651 T23 C4 oasu.LoggingInfoStream.message [IFD][qtp11102203-23]: 0 msec to checkpoint
   [junit4]   2> 4651 T23 C4 oasu.LoggingInfoStream.message [IW][qtp11102203-23]: apply all deletes during flush
   [junit4]   2> 4651 T23 C4 oasu.LoggingInfoStream.message [BD][qtp11102203-23]: applyDeletes: no deletes; skipping
   [junit4]   2> ASYNC  NEW_CORE C5 name=collection1 org.apache.solr.core.SolrCore@516a7c
   [junit4]   2> 4654 T23 C5 oasu.LoggingInfoStream.message [BD][qtp11102203-23]: prune sis=segments_1: _0(4.11.0):C2 minGen=4 packetCount=0
   [junit4]   2> 4654 T23 C5 oasu.LoggingInfoStream.message [DW][qtp11102203-23]: qtp11102203-23 finishFullFlush success=true
   [junit4]   2> 4655 T23 C5 oasu.LoggingInfoStream.message [TMP][qtp11102203-23]: findMerges: 1 segments
   [junit4]   2> 4656 T23 C5 oasu.LoggingInfoStream.message [TMP][qtp11102203-23]:   seg=_0(4.11.0):C2 size=0.001 MB [floored]
   [junit4]   2> 4656 T23 C5 oasu.LoggingInfoStream.message [TMP][qtp11102203-23]:   allowedSegmentCount=1 vs count=1 (eligible count=1) tooBigCount=0
   [junit4]   2> 4657 T23 C5 oasu.LoggingInfoStream.message [CMS][qtp11102203-23]: now merge
   [junit4]   2> 4657 T23 C5 oasu.LoggingInfoStream.message [CMS][qtp11102203-23]:   index: _0(4.11.0):C2
   [junit4]   2> 4657 T23 C5 oasu.LoggingInfoStream.message [CMS][qtp11102203-23]:   no more merges pending; now return
   [junit4]   2> 4658 T23 C5 oasu.LoggingInfoStream.message [IW][qtp11102203-23]: startCommit(): start
   [junit4]   2> 4658 T23 C5 oasu.LoggingInfoStream.message [IW][qtp11102203-23]: startCommit index=_0(4.11.0):C2 changeCount=3
   [junit4]   2> 4659 T23 C5 oasu.LoggingInfoStream.message [IW][qtp11102203-23]: done all syncs: [_0_Lucene41_0.tip, _0_Lucene41_0.doc, _0.si, _0_Lucene41_0.tim, _0.fdx, _0.fdt, _0.fnm]
   [junit4]   2> 4659 T23 C5 oasu.LoggingInfoStream.message [IW][qtp11102203-23]: commit: pendingCommit != null
   [junit4]   2> 4660 T23 C5 oasu.LoggingInfoStream.message [IW][qtp11102203-23]: commit: wrote segments file "segments_2"
   [junit4]   2> 4660 T23 C5 oasu.LoggingInfoStream.message [IFD][qtp11102203-23]: now checkpoint "_0(4.11.0):C2" [1 segments ; isCommit = true]
   [junit4]   2> 4660 T23 C5 oasc.SolrDeletionPolicy.onCommit SolrDeletionPolicy.onCommit: commits: num=2
   [junit4]   2> 		commit{dir=MockDirectoryWrapper(RAMDirectory@eccaa2 lockFactory=NativeFSLockFactory@/mnt/ssd/jenkins/workspace/Lucene-Solr-4.x-Linux/solr/build/solr-solrj/test/J1/temp/solr.client.solrj.SolrExampleBinaryTest-C6876002C09159DD-001/tempDir-001/index),segFN=segments_1,generation=1}
   [junit4]   2> 		commit{dir=MockDirectoryWrapper(RAMDirectory@eccaa2 lockFactory=NativeFSLockFactory@/mnt/ssd/jenkins/workspace/Lucene-Solr-4.x-Linux/solr/build/solr-solrj/test/J1/temp/solr.client.solrj.SolrExampleBinaryTest-C6876002C09159DD-001/tempDir-001/index),segFN=segments_2,generation=2}
   [junit4]   2> 4661 T23 C5 oasc.SolrDeletionPolicy.updateCommits newest commit generation = 2
   [junit4]   2> 4661 T23 C5 oasu.LoggingInfoStream.message [IFD][qtp11102203-23]: deleteCommits: now decRef commit "segments_1"
   [junit4]   2> 4662 T23 C5 oasu.LoggingInfoStream.message [IFD][qtp11102203-23]: delete "segments_1"
   [junit4]   2> 4662 T23 C5 oasu.LoggingInfoStream.message [IFD][qtp11102203-23]: 2 msec to checkpoint
   [junit4]   2> 4663 T23 C5 oasu.LoggingInfoStream.message [IW][qtp11102203-23]: commit: took 60.3 msec
   [junit4]   2> 4663 T23 C5 oasu.LoggingInfoStream.message [IW][qtp11102203-23]: commit: done
   [junit4]   2> 4663 T23 C5 oasu.LoggingInfoStream.message [DW][qtp11102203-23]: anyChanges? numDocsInRam=0 deletes=false hasTickets:false pendingChangesInFullFlush: false
   [junit4]   2> 4664 T23 C5 oasu.LoggingInfoStream.message [IW][qtp11102203-23]: nrtIsCurrent: infoVersion matches: false; DW changes: false; BD changes: false
   [junit4]   2> 4664 T23 C5 oasu.LoggingInfoStream.message [IW][qtp11102203-23]: flush at getReader
   [junit4]   2> 4664 T23 C5 oasu.LoggingInfoStream.message [DW][qtp11102203-23]: startFullFlush
   [junit4]   2> 4665 T23 C5 oasu.LoggingInfoStream.message [DW][qtp11102203-23]: anyChanges? numDocsInRam=0 deletes=false hasTickets:false pendingChangesInFullFlush: false
   [junit4]   2> 4665 T23 C5 oasu.LoggingInfoStream.message [IW][qtp11102203-23]: apply all deletes during flush
   [junit4]   2> 4665 T23 C5 oasu.LoggingInfoStream.message [BD][qtp11102203-23]: applyDeletes: no deletes; skipping
   [junit4]   2> 4666 T23 C5 oasu.LoggingInfoStream.message [BD][qtp11102203-23]: prune sis=segments_2: _0(4.11.0):C2 minGen=4 packetCount=0
   [junit4]   2> 4687 T23 C5 oasu.LoggingInfoStream.message [IW][qtp11102203-23]: return reader version=3 reader=StandardDirectoryReader(segments_2:3:nrt _0(4.11.0):C2)
   [junit4]   2> 4688 T23 C5 oasu.LoggingInfoStream.message [DW][qtp11102203-23]: qtp11102203-23 finishFullFlush success=true
   [junit4]   2> 4688 T23 C5 oasu.LoggingInfoStream.message [IW][qtp11102203-23]: getReader took 24 msec
   [junit4]   2> 4688 T23 C5 oass.SolrIndexSearcher.<init> Opening Searcher@70eb11[collection1] main
   [junit4]   2> 4691 T23 C5 oasu.DirectUpdateHandler2.commit end_commit_flush
   [junit4]   2> 4691 T28 oasc.QuerySenderListener.newSearcher QuerySenderListener sending requests to Searcher@70eb11[collection1] main{StandardDirectoryReader(segments_2:3:nrt _0(4.11.0):C2)}
   [junit4]   2> 4691 T28 oasc.QuerySenderListener.newSearcher QuerySenderListener done.
   [junit4]   2> 4691 T28 oasc.SolrCore.registerSearcher [collection1] Registered new searcher Searcher@70eb11[collection1] main{StandardDirectoryReader(segments_2:3:nrt _0(4.11.0):C2)}
   [junit4]   2> 4692 T23 C5 oasup.LogUpdateProcessor.finish [collection1] webapp=/solr path=/update params={waitSearcher=true&commit=true&softCommit=false&wt=javabin&version=2} {commit=} 0 91
   [junit4]   2> 4708 T25 C5 oasc.SolrCore.execute [collection1] webapp=/solr path=/select params={q=*:*&wt=javabin&version=2} hits=2 status=0 QTime=12 
   [junit4]   2> 4715 T15 oas.SolrTestCaseJ4.tearDown ###Ending testUpdateRequestWithParameters
   [junit4]   2> 4726 T15 oas.SolrTestCaseJ4.setUp ###Starting testStatistics
   [junit4]   2> ASYNC  NEW_CORE C6 name=collection1 org.apache.solr.core.SolrCore@516a7c
   [junit4]   2> 4729 T26 C6 oasu.LoggingInfoStream.message [DW][qtp11102203-26]: anyChanges? numDocsInRam=0 deletes=true hasTickets:false pendingChangesInFullFlush: false
   [junit4]   2> 4730 T26 C6 oasu.LoggingInfoStream.message [IW][qtp11102203-26]: nrtIsCurrent: infoVersion matches: true; DW changes: true; BD changes: false
   [junit4]   2> 4730 T26 C6 oasu.LoggingInfoStream.message [DW][qtp11102203-26]: anyChanges? numDocsInRam=0 deletes=true hasTickets:false pendingChangesInFullFlush: false
   [junit4]   2> 4731 T26 C6 oasu.LoggingInfoStream.message [IW][qtp11102203-26]: flush at getReader
   [junit4]   2> 4731 T26 C6 oasu.LoggingInfoStream.message [DW][qtp11102203-26]: startFullFlush
   [junit4]   2> 4731 T26 C6 oasu.LoggingInfoStream.message [DW][qtp11102203-26]: anyChanges? numDocsInRam=0 deletes=true hasTickets:false pendingChangesInFullFlush: false
   [junit4]   2> 4732 T26 C6 oasu.LoggingInfoStream.message [DW][qtp11102203-26]: qtp11102203-26: flush naked frozen global deletes
   [junit4]   2> 4733 T26 C6 oasu.LoggingInfoStream.message [BD][qtp11102203-26]: push deletes  1 deleted queries bytesUsed=64 delGen=7 packetCount=1 totBytesUsed=64
   [junit4]   2> 4733 T26 C6 oasu.LoggingInfoStream.message [DW][qtp11102203-26]: flush: push buffered updates:  1 deleted queries bytesUsed=64
   [junit4]   2> 4734 T26 C6 oasu.LoggingInfoStream.message [IW][qtp11102203-26]: apply all deletes during flush
   [junit4]   2> 4734 T26 C6 oasu.LoggingInfoStream.message [BD][qtp11102203-26]: applyDeletes: infos=[_0(4.11.0):C2] packetCount=1
   [junit4]   2> ASYNC  NEW_CORE C7 name=collection1 org.apache.solr.core.SolrCore@516a7c
   [junit4]   2> 4791 T26 C7 oasu.LoggingInfoStream.message [BD][qtp11102203-26]: seg=_0(4.11.0):C2 segGen=4 coalesced deletes=[CoalescedUpdates(termSets=1,queries=1,numericDVUpdates=0,binaryDVUpdates=0)] newDelCount=2 100% deleted
   [junit4]   2> 4791 T26 C7 oasu.LoggingInfoStream.message [BD][qtp11102203-26]: applyDeletes took 57 msec
   [junit4]   2> 4792 T26 C7 oasu.LoggingInfoStream.message [IFD][qtp11102203-26]: now checkpoint "_0(4.11.0):C2/2" [1 segments ; isCommit = false]
   [junit4]   2> 4792 T26 C7 oasu.LoggingInfoStream.message [IFD][qtp11102203-26]: 0 msec to checkpoint
   [junit4]   2> 4792 T26 C7 oasu.LoggingInfoStream.message [IW][qtp11102203-26]: drop 100% deleted segments: _0(4.11.0):C2/2
   [junit4]   2> 4793 T26 C7 oasu.LoggingInfoStream.message [IFD][qtp11102203-26]: now checkpoint "" [0 segments ; isCommit = false]
   [junit4]   2> 4793 T26 C7 oasu.LoggingInfoStream.message [IFD][qtp11102203-26]: 0 msec to checkpoint
   [junit4]   2> 4793 T26 C7 oasu.LoggingInfoStream.message [BD][qtp11102203-26]: prune sis=segments_2:  minGen=9223372036854775807 packetCount=1
   [junit4]   2> 4794 T26 C7 oasu.LoggingInfoStream.message [BD][qtp11102203-26]: pruneDeletes: prune 1 packets; 0 packets remain
   [junit4]   2> 4794 T26 C7 oasu.LoggingInfoStream.message [IW][qtp11102203-26]: return reader version=5 reader=StandardDirectoryReader(segments_2:5:nrt)
   [junit4]   2> 4794 T26 C7 oasu.LoggingInfoStream.message [DW][qtp11102203-26]: qtp11102203-26 finishFullFlush success=true
   [junit4]   2> 4794 T26 C7 oasu.LoggingInfoStream.message [IW][qtp11102203-26]: getReader took 63 msec
   [junit4]   2> 4795 T26 C7 oass.SolrIndexSearcher.<init> Opening Searcher@1fd39ea[collection1] realtime
   [junit4]   2> 4796 T26 C7 oasup.LogUpdateProcessor.finish [collection1] webapp=/solr path=/update params={wt=javabin&version=2} {deleteByQuery=*:* (-1478078628248944640)} 0 68
   [junit4]   2> 4804 T25 C7 oasu.DirectUpdateHandler2.commit start commit{,optimize=false,openSearcher=true,waitSearcher=true,expungeDeletes=false,softCommit=false,prepareCommit=false}
   [junit4]   2> 4805 T25 C7 oasu.LoggingInfoStream.message [IW][qtp11102203-25]: commit: start
   [junit4]   2> 4806 T25 C7 oasu.LoggingInfoStream.message [IW][qtp11102203-25]: commit: enter lock
   [junit4]   2> 4806 T25 C7 oasu.LoggingInfoStream.message [IW][qtp11102203-25]: commit: now prepare
   [junit4]   2> 4807 T25 C7 oasu.LoggingInfoStream.message [IW][qtp11102203-25]: prepareCommit: flush
   [junit4]   2> 4807 T25 C7 oasu.LoggingInfoStream.message [IW][qtp11102203-25]:   index before flush 
   [junit4]   2> 4807 T25 C7 oasu.LoggingInfoStream.message [DW][qtp11102203-25]: startFullFlush
   [junit4]   2> 4808 T25 C7 oasu.LoggingInfoStream.message [DW][qtp11102203-25]: anyChanges? numDocsInRam=0 deletes=false hasTickets:false pendingChangesInFullFlush: false
   [junit4]   2> 4808 T25 C7 oasu.LoggingInfoStream.message [IW][qtp11102203-25]: apply all deletes during flush
   [junit4]   2> 4809 T25 C7 oasu.LoggingInfoStream.message [BD][qtp11102203-25]: prune sis=segments_2:  minGen=9223372036854775807 packetCount=0
   [junit4]   2> 4809 T25 C7 oasu.LoggingInfoStream.message [DW][qtp11102203-25]: qtp11102203-25 finishFullFlush success=true
   [junit4]   2> 4810 T25 C7 oasu.LoggingInfoStream.message [IW][qtp11102203-25]: startCommit(): start
   [junit4]   2> 4810 T25 C7 oasu.LoggingInfoStream.message [IW][qtp1110220

[...truncated too long message...]

76002C09159DD]-worker]: now flush at close
   [junit4]   2> 133753 T310 C476 oasu.LoggingInfoStream.message [IW][SUITE-SolrExampleXMLTest-seed#[C6876002C09159DD]-worker]:   start flush: applyAllDeletes=true
   [junit4]   2> 133754 T310 C476 oasu.LoggingInfoStream.message [IW][SUITE-SolrExampleXMLTest-seed#[C6876002C09159DD]-worker]:   index before flush _1c(4.11.0):C1
   [junit4]   2> 133754 T310 C476 oasu.LoggingInfoStream.message [DW][SUITE-SolrExampleXMLTest-seed#[C6876002C09159DD]-worker]: startFullFlush
   [junit4]   2> 133754 T310 C476 oasu.LoggingInfoStream.message [DW][SUITE-SolrExampleXMLTest-seed#[C6876002C09159DD]-worker]: anyChanges? numDocsInRam=0 deletes=false hasTickets:false pendingChangesInFullFlush: false
   [junit4]   2> 133755 T310 C476 oasu.LoggingInfoStream.message [DW][SUITE-SolrExampleXMLTest-seed#[C6876002C09159DD]-worker]: SUITE-SolrExampleXMLTest-seed#[C6876002C09159DD]-worker finishFullFlush success=true
   [junit4]   2> 133755 T310 C476 oasu.LoggingInfoStream.message [IW][SUITE-SolrExampleXMLTest-seed#[C6876002C09159DD]-worker]: apply all deletes during flush
   [junit4]   2> 133755 T310 C476 oasu.LoggingInfoStream.message [BD][SUITE-SolrExampleXMLTest-seed#[C6876002C09159DD]-worker]: applyDeletes: no deletes; skipping
   [junit4]   2> 133756 T310 C476 oasu.LoggingInfoStream.message [BD][SUITE-SolrExampleXMLTest-seed#[C6876002C09159DD]-worker]: prune sis=segments_1v: _1c(4.11.0):C1 minGen=289 packetCount=0
   [junit4]   2> 133756 T310 C476 oasu.LoggingInfoStream.message [CMS][SUITE-SolrExampleXMLTest-seed#[C6876002C09159DD]-worker]: now merge
   [junit4]   2> 133756 T310 C476 oasu.LoggingInfoStream.message [CMS][SUITE-SolrExampleXMLTest-seed#[C6876002C09159DD]-worker]:   index: _1c(4.11.0):C1
   [junit4]   2> 133757 T310 C476 oasu.LoggingInfoStream.message [CMS][SUITE-SolrExampleXMLTest-seed#[C6876002C09159DD]-worker]:   no more merges pending; now return
   [junit4]   2> 133757 T310 C476 oasu.LoggingInfoStream.message [IW][SUITE-SolrExampleXMLTest-seed#[C6876002C09159DD]-worker]: waitForMerges
   [junit4]   2> 133757 T310 C476 oasu.LoggingInfoStream.message [IW][SUITE-SolrExampleXMLTest-seed#[C6876002C09159DD]-worker]: waitForMerges done
   [junit4]   2> 133757 T310 C476 oasu.LoggingInfoStream.message [IW][SUITE-SolrExampleXMLTest-seed#[C6876002C09159DD]-worker]: commit: start
   [junit4]   2> 133758 T310 C476 oasu.LoggingInfoStream.message [IW][SUITE-SolrExampleXMLTest-seed#[C6876002C09159DD]-worker]: commit: enter lock
   [junit4]   2> 133758 T310 C476 oasu.LoggingInfoStream.message [IW][SUITE-SolrExampleXMLTest-seed#[C6876002C09159DD]-worker]: commit: now prepare
   [junit4]   2> 133758 T310 C476 oasu.LoggingInfoStream.message [IW][SUITE-SolrExampleXMLTest-seed#[C6876002C09159DD]-worker]: prepareCommit: flush
   [junit4]   2> 133759 T310 C476 oasu.LoggingInfoStream.message [IW][SUITE-SolrExampleXMLTest-seed#[C6876002C09159DD]-worker]:   index before flush _1c(4.11.0):C1
   [junit4]   2> 133759 T310 C476 oasu.LoggingInfoStream.message [DW][SUITE-SolrExampleXMLTest-seed#[C6876002C09159DD]-worker]: startFullFlush
   [junit4]   2> 133759 T310 C476 oasu.LoggingInfoStream.message [DW][SUITE-SolrExampleXMLTest-seed#[C6876002C09159DD]-worker]: anyChanges? numDocsInRam=0 deletes=false hasTickets:false pendingChangesInFullFlush: false
   [junit4]   2> 133759 T310 C476 oasu.LoggingInfoStream.message [IW][SUITE-SolrExampleXMLTest-seed#[C6876002C09159DD]-worker]: apply all deletes during flush
   [junit4]   2> 133760 T310 C476 oasu.LoggingInfoStream.message [BD][SUITE-SolrExampleXMLTest-seed#[C6876002C09159DD]-worker]: applyDeletes: no deletes; skipping
   [junit4]   2> 133760 T310 C476 oasu.LoggingInfoStream.message [BD][SUITE-SolrExampleXMLTest-seed#[C6876002C09159DD]-worker]: prune sis=segments_1v: _1c(4.11.0):C1 minGen=289 packetCount=0
   [junit4]   2> 133760 T310 C476 oasu.LoggingInfoStream.message [DW][SUITE-SolrExampleXMLTest-seed#[C6876002C09159DD]-worker]: SUITE-SolrExampleXMLTest-seed#[C6876002C09159DD]-worker finishFullFlush success=true
   [junit4]   2> 133761 T310 C476 oasu.LoggingInfoStream.message [IW][SUITE-SolrExampleXMLTest-seed#[C6876002C09159DD]-worker]: startCommit(): start
   [junit4]   2> 133761 T310 C476 oasu.LoggingInfoStream.message [IW][SUITE-SolrExampleXMLTest-seed#[C6876002C09159DD]-worker]:   skip startCommit(): no changes pending
   [junit4]   2> 133761 T310 C476 oasu.LoggingInfoStream.message [IW][SUITE-SolrExampleXMLTest-seed#[C6876002C09159DD]-worker]: commit: pendingCommit == null; skip
   [junit4]   2> 133761 T310 C476 oasu.LoggingInfoStream.message [IW][SUITE-SolrExampleXMLTest-seed#[C6876002C09159DD]-worker]: commit: done
   [junit4]   2> 133762 T310 C476 oasu.LoggingInfoStream.message [IW][SUITE-SolrExampleXMLTest-seed#[C6876002C09159DD]-worker]: rollback
   [junit4]   2> 133762 T310 C476 oasu.LoggingInfoStream.message [IW][SUITE-SolrExampleXMLTest-seed#[C6876002C09159DD]-worker]: all running merges have aborted
   [junit4]   2> 133763 T310 C476 oasu.LoggingInfoStream.message [IW][SUITE-SolrExampleXMLTest-seed#[C6876002C09159DD]-worker]: rollback: done finish merges
   [junit4]   2> 133763 T310 C476 oasu.LoggingInfoStream.message [DW][SUITE-SolrExampleXMLTest-seed#[C6876002C09159DD]-worker]: abort
   [junit4]   2> 133763 T310 C476 oasu.LoggingInfoStream.message [DW][SUITE-SolrExampleXMLTest-seed#[C6876002C09159DD]-worker]: done abort; abortedFiles=[] success=true
   [junit4]   2> 133764 T310 C476 oasu.LoggingInfoStream.message [IW][SUITE-SolrExampleXMLTest-seed#[C6876002C09159DD]-worker]: rollback: infos=_1c(4.11.0):C1
   [junit4]   2> 133764 T310 C476 oasu.LoggingInfoStream.message [IFD][SUITE-SolrExampleXMLTest-seed#[C6876002C09159DD]-worker]: now checkpoint "_1c(4.11.0):C1" [1 segments ; isCommit = false]
   [junit4]   2> 133764 T310 C476 oasu.LoggingInfoStream.message [IFD][SUITE-SolrExampleXMLTest-seed#[C6876002C09159DD]-worker]: 0 msec to checkpoint
   [junit4]   2> 133765 T310 oasc.SolrCore.closeSearcher [collection1] Closing main searcher on request.
   [junit4]   2> 133766 T310 oasc.CachingDirectoryFactory.close Closing MockDirectoryFactory - 2 directories currently being tracked
   [junit4]   2> 133766 T310 oasc.CachingDirectoryFactory.closeCacheValue looking to close /mnt/ssd/jenkins/workspace/Lucene-Solr-4.x-Linux/solr/build/solr-solrj/test/J0/temp/solr.client.solrj.SolrExampleXMLTest-C6876002C09159DD-001/tempDir-001 [CachedDir<<refCount=0;path=/mnt/ssd/jenkins/workspace/Lucene-Solr-4.x-Linux/solr/build/solr-solrj/test/J0/temp/solr.client.solrj.SolrExampleXMLTest-C6876002C09159DD-001/tempDir-001;done=false>>]
   [junit4]   2> 133766 T310 oasc.CachingDirectoryFactory.close Closing directory: /mnt/ssd/jenkins/workspace/Lucene-Solr-4.x-Linux/solr/build/solr-solrj/test/J0/temp/solr.client.solrj.SolrExampleXMLTest-C6876002C09159DD-001/tempDir-001
   [junit4]   2> 133766 T310 oasc.CachingDirectoryFactory.closeCacheValue looking to close /mnt/ssd/jenkins/workspace/Lucene-Solr-4.x-Linux/solr/build/solr-solrj/test/J0/temp/solr.client.solrj.SolrExampleXMLTest-C6876002C09159DD-001/tempDir-001/index [CachedDir<<refCount=0;path=/mnt/ssd/jenkins/workspace/Lucene-Solr-4.x-Linux/solr/build/solr-solrj/test/J0/temp/solr.client.solrj.SolrExampleXMLTest-C6876002C09159DD-001/tempDir-001/index;done=false>>]
   [junit4]   2> 133767 T310 oasc.CachingDirectoryFactory.close Closing directory: /mnt/ssd/jenkins/workspace/Lucene-Solr-4.x-Linux/solr/build/solr-solrj/test/J0/temp/solr.client.solrj.SolrExampleXMLTest-C6876002C09159DD-001/tempDir-001/index
   [junit4]   2> 133767 T310 oejsh.ContextHandler.doStop stopped o.e.j.s.ServletContextHandler{/solr,null}
   [junit4]   2> 138710 T310 oas.SolrTestCaseJ4.deleteCore ###deleteCore
   [junit4]   2> NOTE: leaving temporary files on disk at: /mnt/ssd/jenkins/workspace/Lucene-Solr-4.x-Linux/solr/build/solr-solrj/test/J0/./temp/solr.client.solrj.SolrExampleXMLTest-C6876002C09159DD-001
   [junit4]   2> NOTE: test params are: codec=Lucene49, sim=RandomSimilarityProvider(queryNorm=true,coord=no): {}, locale=de_CH, timezone=Asia/Jakarta
   [junit4]   2> NOTE: Linux 3.13.0-35-generic i386/Oracle Corporation 1.9.0-ea (32-bit)/cpus=8,threads=1,free=20079032,total=60932096
   [junit4]   2> NOTE: All tests run in this JVM: [TestCoreAdmin, SolrParamTest, NoOpResponseParserTest, ClientUtilsTest, TestJavaBinCodec, DocumentAnalysisResponseTest, SolrExceptionTest, CloudSolrServerTest, SolrExampleStreamingBinaryTest, LargeVolumeEmbeddedTest, SolrExampleEmbeddedTest, SolrPingTest, SolrExampleStreamingTest, SolrExampleXMLTest]
   [junit4] Completed on J0 in 13.37s, 27 tests, 1 error <<< FAILURES!

[...truncated 96 lines...]
BUILD FAILED
/mnt/ssd/jenkins/workspace/Lucene-Solr-4.x-Linux/build.xml:492: The following error occurred while executing this line:
/mnt/ssd/jenkins/workspace/Lucene-Solr-4.x-Linux/build.xml:472: The following error occurred while executing this line:
/mnt/ssd/jenkins/workspace/Lucene-Solr-4.x-Linux/build.xml:60: The following error occurred while executing this line:
/mnt/ssd/jenkins/workspace/Lucene-Solr-4.x-Linux/extra-targets.xml:39: The following error occurred while executing this line:
/mnt/ssd/jenkins/workspace/Lucene-Solr-4.x-Linux/solr/build.xml:202: The following error occurred while executing this line:
/mnt/ssd/jenkins/workspace/Lucene-Solr-4.x-Linux/solr/common-build.xml:494: The following error occurred while executing this line:
/mnt/ssd/jenkins/workspace/Lucene-Solr-4.x-Linux/lucene/common-build.xml:1344: The following error occurred while executing this line:
/mnt/ssd/jenkins/workspace/Lucene-Solr-4.x-Linux/lucene/common-build.xml:959: There were test failures: 52 suites, 302 tests, 5 errors, 1 failure

Total time: 99 minutes 22 seconds
Build step 'Invoke Ant' marked build as failure
[description-setter] Description set: Java: 32bit/jdk1.9.0-ea-b26 -client -XX:+UseConcMarkSweepGC
Archiving artifacts
Recording test results
Email was triggered for: Failure - Any
Sending email for trigger: Failure - Any



Mime
View raw message