lucene-dev mailing list archives

Site index · List index
Message view « Date » · « Thread »
Top « Date » · « Thread »
From Michael McCandless <luc...@mikemccandless.com>
Subject Re: [JENKINS] Lucene-Solr-NightlyTests-trunk - Build # 613 - Still Failing
Date Tue, 02 Sep 2014 13:21:14 GMT
I'll dig.

Mike McCandless

http://blog.mikemccandless.com


On Sun, Aug 31, 2014 at 8:04 PM, Apache Jenkins Server
<jenkins@builds.apache.org> wrote:
> Build: https://builds.apache.org/job/Lucene-Solr-NightlyTests-trunk/613/
>
> 1 tests failed.
> REGRESSION:  org.apache.lucene.index.TestIndexWriterOutOfMemory.testBasics
>
> Error Message:
> TEST-TestIndexWriterOutOfMemory.testBasics-seed#[C4C9D7B4B9D5D290]: RefCount is 0 pre-decrement for file "_2_2_Lucene410_0.dvd"
>
> Stack Trace:
> java.lang.AssertionError: TEST-TestIndexWriterOutOfMemory.testBasics-seed#[C4C9D7B4B9D5D290]: RefCount is 0 pre-decrement for file "_2_2_Lucene410_0.dvd"
>         at __randomizedtesting.SeedInfo.seed([C4C9D7B4B9D5D290:F9117998813B8CE0]:0)
>         at org.apache.lucene.index.IndexFileDeleter$RefCount.DecRef(IndexFileDeleter.java:725)
>         at org.apache.lucene.index.IndexFileDeleter.decRef(IndexFileDeleter.java:611)
>         at org.apache.lucene.index.IndexFileDeleter.decRef(IndexFileDeleter.java:599)
>         at org.apache.lucene.index.IndexWriter.prepareCommitInternal(IndexWriter.java:2851)
>         at org.apache.lucene.index.IndexWriter.commitInternal(IndexWriter.java:2952)
>         at org.apache.lucene.index.IndexWriter.commit(IndexWriter.java:2919)
>         at org.apache.lucene.index.TestIndexWriterOutOfMemory.testBasics(TestIndexWriterOutOfMemory.java:215)
>         at sun.reflect.NativeMethodAccessorImpl.invoke0(Native Method)
>         at sun.reflect.NativeMethodAccessorImpl.invoke(NativeMethodAccessorImpl.java:57)
>         at sun.reflect.DelegatingMethodAccessorImpl.invoke(DelegatingMethodAccessorImpl.java:43)
>         at java.lang.reflect.Method.invoke(Method.java:606)
>         at com.carrotsearch.randomizedtesting.RandomizedRunner.invoke(RandomizedRunner.java:1618)
>         at com.carrotsearch.randomizedtesting.RandomizedRunner$6.evaluate(RandomizedRunner.java:827)
>         at com.carrotsearch.randomizedtesting.RandomizedRunner$7.evaluate(RandomizedRunner.java:863)
>         at com.carrotsearch.randomizedtesting.RandomizedRunner$8.evaluate(RandomizedRunner.java:877)
>         at org.apache.lucene.util.TestRuleSetupTeardownChained$1.evaluate(TestRuleSetupTeardownChained.java:50)
>         at org.apache.lucene.util.AbstractBeforeAfterRule$1.evaluate(AbstractBeforeAfterRule.java:46)
>         at com.carrotsearch.randomizedtesting.rules.SystemPropertiesInvariantRule$1.evaluate(SystemPropertiesInvariantRule.java:55)
>         at org.apache.lucene.util.TestRuleThreadAndTestName$1.evaluate(TestRuleThreadAndTestName.java:49)
>         at org.apache.lucene.util.TestRuleIgnoreAfterMaxFailures$1.evaluate(TestRuleIgnoreAfterMaxFailures.java:65)
>         at org.apache.lucene.util.TestRuleMarkFailure$1.evaluate(TestRuleMarkFailure.java:48)
>         at com.carrotsearch.randomizedtesting.rules.StatementAdapter.evaluate(StatementAdapter.java:36)
>         at com.carrotsearch.randomizedtesting.ThreadLeakControl$StatementRunner.run(ThreadLeakControl.java:365)
>         at com.carrotsearch.randomizedtesting.ThreadLeakControl.forkTimeoutingTask(ThreadLeakControl.java:798)
>         at com.carrotsearch.randomizedtesting.ThreadLeakControl$3.evaluate(ThreadLeakControl.java:458)
>         at com.carrotsearch.randomizedtesting.RandomizedRunner.runSingleTest(RandomizedRunner.java:836)
>         at com.carrotsearch.randomizedtesting.RandomizedRunner$3.evaluate(RandomizedRunner.java:738)
>         at com.carrotsearch.randomizedtesting.RandomizedRunner$4.evaluate(RandomizedRunner.java:772)
>         at com.carrotsearch.randomizedtesting.RandomizedRunner$5.evaluate(RandomizedRunner.java:783)
>         at org.apache.lucene.util.AbstractBeforeAfterRule$1.evaluate(AbstractBeforeAfterRule.java:46)
>         at org.apache.lucene.util.TestRuleStoreClassName$1.evaluate(TestRuleStoreClassName.java:42)
>         at com.carrotsearch.randomizedtesting.rules.SystemPropertiesInvariantRule$1.evaluate(SystemPropertiesInvariantRule.java:55)
>         at com.carrotsearch.randomizedtesting.rules.NoShadowingOrOverridesOnMethodsRule$1.evaluate(NoShadowingOrOverridesOnMethodsRule.java:39)
>         at com.carrotsearch.randomizedtesting.rules.NoShadowingOrOverridesOnMethodsRule$1.evaluate(NoShadowingOrOverridesOnMethodsRule.java:39)
>         at com.carrotsearch.randomizedtesting.rules.StatementAdapter.evaluate(StatementAdapter.java:36)
>         at com.carrotsearch.randomizedtesting.rules.StatementAdapter.evaluate(StatementAdapter.java:36)
>         at com.carrotsearch.randomizedtesting.rules.StatementAdapter.evaluate(StatementAdapter.java:36)
>         at org.apache.lucene.util.TestRuleAssertionsRequired$1.evaluate(TestRuleAssertionsRequired.java:43)
>         at org.apache.lucene.util.TestRuleMarkFailure$1.evaluate(TestRuleMarkFailure.java:48)
>         at org.apache.lucene.util.TestRuleIgnoreAfterMaxFailures$1.evaluate(TestRuleIgnoreAfterMaxFailures.java:65)
>         at org.apache.lucene.util.TestRuleIgnoreTestSuites$1.evaluate(TestRuleIgnoreTestSuites.java:55)
>         at com.carrotsearch.randomizedtesting.rules.StatementAdapter.evaluate(StatementAdapter.java:36)
>         at com.carrotsearch.randomizedtesting.ThreadLeakControl$StatementRunner.run(ThreadLeakControl.java:365)
>         at java.lang.Thread.run(Thread.java:745)
>
>
>
>
> Build Log:
> [...truncated 1725 lines...]
>    [junit4] Suite: org.apache.lucene.index.TestIndexWriterOutOfMemory
>    [junit4]   1> Unexpected exception: dumping fake-exception-log:...
>    [junit4]   1>
>    [junit4]   1> TEST: got expected fake exc:Fake OutOfMemoryError
>    [junit4]   1> java.lang.OutOfMemoryError: Fake OutOfMemoryError
>    [junit4]   1>        at org.apache.lucene.index.TestIndexWriterOutOfMemory$2.eval(TestIndexWriterOutOfMemory.java:119)
>    [junit4]   1>        at org.apache.lucene.store.MockDirectoryWrapper.maybeThrowDeterministicException(MockDirectoryWrapper.java:922)
>    [junit4]   1>        at org.apache.lucene.store.MockIndexOutputWrapper.writeBytes(MockIndexOutputWrapper.java:128)
>    [junit4]   1>        at org.apache.lucene.store.MockIndexOutputWrapper.writeByte(MockIndexOutputWrapper.java:111)
>    [junit4]   1>        at org.apache.lucene.store.DataOutput.writeInt(DataOutput.java:72)
>    [junit4]   1>        at org.apache.lucene.codecs.CodecUtil.writeFooter(CodecUtil.java:185)
>    [junit4]   1>        at org.apache.lucene.codecs.lucene49.Lucene49NormsConsumer.close(Lucene49NormsConsumer.java:173)
>    [junit4]   1>        at org.apache.lucene.util.IOUtils.close(IOUtils.java:77)
>    [junit4]   1>        at org.apache.lucene.index.DefaultIndexingChain.writeNorms(DefaultIndexingChain.java:202)
>    [junit4]   1>        at org.apache.lucene.index.DefaultIndexingChain.flush(DefaultIndexingChain.java:95)
>    [junit4]   1>        at org.apache.lucene.index.DocumentsWriterPerThread.flush(DocumentsWriterPerThread.java:442)
>    [junit4]   1>        at org.apache.lucene.index.DocumentsWriter.doFlush(DocumentsWriter.java:510)
>    [junit4]   1>        at org.apache.lucene.index.DocumentsWriter.postUpdate(DocumentsWriter.java:375)
>    [junit4]   1>        at org.apache.lucene.index.DocumentsWriter.updateDocument(DocumentsWriter.java:474)
>    [junit4]   1>        at org.apache.lucene.index.IndexWriter.updateDocument(IndexWriter.java:1391)
>    [junit4]   1>        at org.apache.lucene.index.IndexWriter.addDocument(IndexWriter.java:1106)
>    [junit4]   1>        at org.apache.lucene.index.IndexWriter.addDocument(IndexWriter.java:1087)
>    [junit4]   1>        at org.apache.lucene.index.TestIndexWriterOutOfMemory.testBasics(TestIndexWriterOutOfMemory.java:152)
>    [junit4]   1>        at sun.reflect.NativeMethodAccessorImpl.invoke0(Native Method)
>    [junit4]   1>        at sun.reflect.NativeMethodAccessorImpl.invoke(NativeMethodAccessorImpl.java:57)
>    [junit4]   1>        at sun.reflect.DelegatingMethodAccessorImpl.invoke(DelegatingMethodAccessorImpl.java:43)
>    [junit4]   1>        at java.lang.reflect.Method.invoke(Method.java:606)
>    [junit4]   1>        at com.carrotsearch.randomizedtesting.RandomizedRunner.invoke(RandomizedRunner.java:1618)
>    [junit4]   1>        at com.carrotsearch.randomizedtesting.RandomizedRunner$6.evaluate(RandomizedRunner.java:827)
>    [junit4]   1>        at com.carrotsearch.randomizedtesting.RandomizedRunner$7.evaluate(RandomizedRunner.java:863)
>    [junit4]   1>        at com.carrotsearch.randomizedtesting.RandomizedRunner$8.evaluate(RandomizedRunner.java:877)
>    [junit4]   1>        at org.apache.lucene.util.TestRuleSetupTeardownChained$1.evaluate(TestRuleSetupTeardownChained.java:50)
>    [junit4]   1>        at org.apache.lucene.util.AbstractBeforeAfterRule$1.evaluate(AbstractBeforeAfterRule.java:46)
>    [junit4]   1>        at com.carrotsearch.randomizedtesting.rules.SystemPropertiesInvariantRule$1.evaluate(SystemPropertiesInvariantRule.java:55)
>    [junit4]   1>        at org.apache.lucene.util.TestRuleThreadAndTestName$1.evaluate(TestRuleThreadAndTestName.java:49)
>    [junit4]   1>        at org.apache.lucene.util.TestRuleIgnoreAfterMaxFailures$1.evaluate(TestRuleIgnoreAfterMaxFailures.java:65)
>    [junit4]   1>        at org.apache.lucene.util.TestRuleMarkFailure$1.evaluate(TestRuleMarkFailure.java:48)
>    [junit4]   1>        at com.carrotsearch.randomizedtesting.rules.StatementAdapter.evaluate(StatementAdapter.java:36)
>    [junit4]   1>        at com.carrotsearch.randomizedtesting.ThreadLeakControl$StatementRunner.run(ThreadLeakControl.java:365)
>    [junit4]   1>        at com.carrotsearch.randomizedtesting.ThreadLeakControl.forkTimeoutingTask(ThreadLeakControl.java:798)
>    [junit4]   1>        at com.carrotsearch.randomizedtesting.ThreadLeakControl$3.evaluate(ThreadLeakControl.java:458)
>    [junit4]   1>        at com.carrotsearch.randomizedtesting.RandomizedRunner.runSingleTest(RandomizedRunner.java:836)
>    [junit4]   1>        at com.carrotsearch.randomizedtesting.RandomizedRunner$3.evaluate(RandomizedRunner.java:738)
>    [junit4]   1>        at com.carrotsearch.randomizedtesting.RandomizedRunner$4.evaluate(RandomizedRunner.java:772)
>    [junit4]   1>        at com.carrotsearch.randomizedtesting.RandomizedRunner$5.evaluate(RandomizedRunner.java:783)
>    [junit4]   1>        at org.apache.lucene.util.AbstractBeforeAfterRule$1.evaluate(AbstractBeforeAfterRule.java:46)
>    [junit4]   1>        at org.apache.lucene.util.TestRuleStoreClassName$1.evaluate(TestRuleStoreClassName.java:42)
>    [junit4]   1>        at com.carrotsearch.randomizedtesting.rules.SystemPropertiesInvariantRule$1.evaluate(SystemPropertiesInvariantRule.java:55)
>    [junit4]   1>        at com.carrotsearch.randomizedtesting.rules.NoShadowingOrOverridesOnMethodsRule$1.evaluate(NoShadowingOrOverridesOnMethodsRule.java:39)
>    [junit4]   1>        at com.carrotsearch.randomizedtesting.rules.NoShadowingOrOverridesOnMethodsRule$1.evaluate(NoShadowingOrOverridesOnMethodsRule.java:39)
>    [junit4]   1>        at com.carrotsearch.randomizedtesting.rules.StatementAdapter.evaluate(StatementAdapter.java:36)
>    [junit4]   1>        at com.carrotsearch.randomizedtesting.rules.StatementAdapter.evaluate(StatementAdapter.java:36)
>    [junit4]   1>        at com.carrotsearch.randomizedtesting.rules.StatementAdapter.evaluate(StatementAdapter.java:36)
>    [junit4]   1>        at org.apache.lucene.util.TestRuleAssertionsRequired$1.evaluate(TestRuleAssertionsRequired.java:43)
>    [junit4]   1>        at org.apache.lucene.util.TestRuleMarkFailure$1.evaluate(TestRuleMarkFailure.java:48)
>    [junit4]   1>        at org.apache.lucene.util.TestRuleIgnoreAfterMaxFailures$1.evaluate(TestRuleIgnoreAfterMaxFailures.java:65)
>    [junit4]   1>        at org.apache.lucene.util.TestRuleIgnoreTestSuites$1.evaluate(TestRuleIgnoreTestSuites.java:55)
>    [junit4]   1>        at com.carrotsearch.randomizedtesting.rules.StatementAdapter.evaluate(StatementAdapter.java:36)
>    [junit4]   1>        at com.carrotsearch.randomizedtesting.ThreadLeakControl$StatementRunner.run(ThreadLeakControl.java:365)
>    [junit4]   1>        at java.lang.Thread.run(Thread.java:745)
>    [junit4]   1>
>    [junit4]   1> TEST: got expected fake exc:Fake OutOfMemoryError
>    [junit4]   1> java.lang.OutOfMemoryError: Fake OutOfMemoryError
>    [junit4]   1>        at org.apache.lucene.index.TestIndexWriterOutOfMemory$2.eval(TestIndexWriterOutOfMemory.java:119)
>    [junit4]   1>        at org.apache.lucene.store.MockDirectoryWrapper.maybeThrowDeterministicException(MockDirectoryWrapper.java:922)
>    [junit4]   1>        at org.apache.lucene.store.MockIndexOutputWrapper.writeBytes(MockIndexOutputWrapper.java:128)
>    [junit4]   1>        at org.apache.lucene.store.MockIndexOutputWrapper.writeByte(MockIndexOutputWrapper.java:111)
>    [junit4]   1>        at org.apache.lucene.store.DataOutput.writeVInt(DataOutput.java:196)
>    [junit4]   1>        at org.apache.lucene.codecs.blocktree.BlockTreeTermsWriter.close(BlockTreeTermsWriter.java:1026)
>    [junit4]   1>        at org.apache.lucene.util.IOUtils.close(IOUtils.java:100)
>    [junit4]   1>        at org.apache.lucene.codecs.perfield.PerFieldPostingsFormat$FieldsWriter.close(PerFieldPostingsFormat.java:198)
>    [junit4]   1>        at org.apache.lucene.util.IOUtils.close(IOUtils.java:77)
>    [junit4]   1>        at org.apache.lucene.index.FreqProxTermsWriter.flush(FreqProxTermsWriter.java:111)
>    [junit4]   1>        at org.apache.lucene.index.DefaultIndexingChain.flush(DefaultIndexingChain.java:115)
>    [junit4]   1>        at org.apache.lucene.index.DocumentsWriterPerThread.flush(DocumentsWriterPerThread.java:442)
>    [junit4]   1>        at org.apache.lucene.index.DocumentsWriter.doFlush(DocumentsWriter.java:510)
>    [junit4]   1>        at org.apache.lucene.index.DocumentsWriter.flushAllThreads(DocumentsWriter.java:621)
>    [junit4]   1>        at org.apache.lucene.index.IndexWriter.prepareCommitInternal(IndexWriter.java:2793)
>    [junit4]   1>        at org.apache.lucene.index.IndexWriter.commitInternal(IndexWriter.java:2952)
>    [junit4]   1>        at org.apache.lucene.index.IndexWriter.commit(IndexWriter.java:2919)
>    [junit4]   1>        at org.apache.lucene.index.TestIndexWriterOutOfMemory.testBasics(TestIndexWriterOutOfMemory.java:215)
>    [junit4]   1>        at sun.reflect.NativeMethodAccessorImpl.invoke0(Native Method)
>    [junit4]   1>        at sun.reflect.NativeMethodAccessorImpl.invoke(NativeMethodAccessorImpl.java:57)
>    [junit4]   1>        at sun.reflect.DelegatingMethodAccessorImpl.invoke(DelegatingMethodAccessorImpl.java:43)
>    [junit4]   1>        at java.lang.reflect.Method.invoke(Method.java:606)
>    [junit4]   1>        at com.carrotsearch.randomizedtesting.RandomizedRunner.invoke(RandomizedRunner.java:1618)
>    [junit4]   1>        at com.carrotsearch.randomizedtesting.RandomizedRunner$6.evaluate(RandomizedRunner.java:827)
>    [junit4]   1>        at com.carrotsearch.randomizedtesting.RandomizedRunner$7.evaluate(RandomizedRunner.java:863)
>    [junit4]   1>        at com.carrotsearch.randomizedtesting.RandomizedRunner$8.evaluate(RandomizedRunner.java:877)
>    [junit4]   1>        at org.apache.lucene.util.TestRuleSetupTeardownChained$1.evaluate(TestRuleSetupTeardownChained.java:50)
>    [junit4]   1>        at org.apache.lucene.util.AbstractBeforeAfterRule$1.evaluate(AbstractBeforeAfterRule.java:46)
>    [junit4]   1>        at com.carrotsearch.randomizedtesting.rules.SystemPropertiesInvariantRule$1.evaluate(SystemPropertiesInvariantRule.java:55)
>    [junit4]   1>        at org.apache.lucene.util.TestRuleThreadAndTestName$1.evaluate(TestRuleThreadAndTestName.java:49)
>    [junit4]   1>        at org.apache.lucene.util.TestRuleIgnoreAfterMaxFailures$1.evaluate(TestRuleIgnoreAfterMaxFailures.java:65)
>    [junit4]   1>        at org.apache.lucene.util.TestRuleMarkFailure$1.evaluate(TestRuleMarkFailure.java:48)
>    [junit4]   1>        at com.carrotsearch.randomizedtesting.rules.StatementAdapter.evaluate(StatementAdapter.java:36)
>    [junit4]   1>        at com.carrotsearch.randomizedtesting.ThreadLeakControl$StatementRunner.run(ThreadLeakControl.java:365)
>    [junit4]   1>        at com.carrotsearch.randomizedtesting.ThreadLeakControl.forkTimeoutingTask(ThreadLeakControl.java:798)
>    [junit4]   1>        at com.carrotsearch.randomizedtesting.ThreadLeakControl$3.evaluate(ThreadLeakControl.java:458)
>    [junit4]   1>        at com.carrotsearch.randomizedtesting.RandomizedRunner.runSingleTest(RandomizedRunner.java:836)
>    [junit4]   1>        at com.carrotsearch.randomizedtesting.RandomizedRunner$3.evaluate(RandomizedRunner.java:738)
>    [junit4]   1>        at com.carrotsearch.randomizedtesting.RandomizedRunner$4.evaluate(RandomizedRunner.java:772)
>    [junit4]   1>        at com.carrotsearch.randomizedtesting.RandomizedRunner$5.evaluate(RandomizedRunner.java:783)
>    [junit4]   1>        at org.apache.lucene.util.AbstractBeforeAfterRule$1.evaluate(AbstractBeforeAfterRule.java:46)
>    [junit4]   1>        at org.apache.lucene.util.TestRuleStoreClassName$1.evaluate(TestRuleStoreClassName.java:42)
>    [junit4]   1>        at com.carrotsearch.randomizedtesting.rules.SystemPropertiesInvariantRule$1.evaluate(SystemPropertiesInvariantRule.java:55)
>    [junit4]   1>        at com.carrotsearch.randomizedtesting.rules.NoShadowingOrOverridesOnMethodsRule$1.evaluate(NoShadowingOrOverridesOnMethodsRule.java:39)
>    [junit4]   1>        at com.carrotsearch.randomizedtesting.rules.NoShadowingOrOverridesOnMethodsRule$1.evaluate(NoShadowingOrOverridesOnMethodsRule.java:39)
>    [junit4]   1>        at com.carrotsearch.randomizedtesting.rules.StatementAdapter.evaluate(StatementAdapter.java:36)
>    [junit4]   1>        at com.carrotsearch.randomizedtesting.rules.StatementAdapter.evaluate(StatementAdapter.java:36)
>    [junit4]   1>        at com.carrotsearch.randomizedtesting.rules.StatementAdapter.evaluate(StatementAdapter.java:36)
>    [junit4]   1>        at org.apache.lucene.util.TestRuleAssertionsRequired$1.evaluate(TestRuleAssertionsRequired.java:43)
>    [junit4]   1>        at org.apache.lucene.util.TestRuleMarkFailure$1.evaluate(TestRuleMarkFailure.java:48)
>    [junit4]   1>        at org.apache.lucene.util.TestRuleIgnoreAfterMaxFailures$1.evaluate(TestRuleIgnoreAfterMaxFailures.java:65)
>    [junit4]   1>        at org.apache.lucene.util.TestRuleIgnoreTestSuites$1.evaluate(TestRuleIgnoreTestSuites.java:55)
>    [junit4]   1>        at com.carrotsearch.randomizedtesting.rules.StatementAdapter.evaluate(StatementAdapter.java:36)
>    [junit4]   1>        at com.carrotsearch.randomizedtesting.ThreadLeakControl$StatementRunner.run(ThreadLeakControl.java:365)
>    [junit4]   1>        at java.lang.Thread.run(Thread.java:745)
>    [junit4]   1>
>    [junit4]   1> TEST: got expected fake exc:Fake OutOfMemoryError
>    [junit4]   1> java.lang.OutOfMemoryError: Fake OutOfMemoryError
>    [junit4]   1>        at org.apache.lucene.index.TestIndexWriterOutOfMemory$2.eval(TestIndexWriterOutOfMemory.java:119)
>    [junit4]   1>        at org.apache.lucene.store.MockDirectoryWrapper.maybeThrowDeterministicException(MockDirectoryWrapper.java:922)
>    [junit4]   1>        at org.apache.lucene.store.MockIndexOutputWrapper.writeBytes(MockIndexOutputWrapper.java:128)
>    [junit4]   1>        at org.apache.lucene.store.MockIndexOutputWrapper.writeByte(MockIndexOutputWrapper.java:111)
>    [junit4]   1>        at org.apache.lucene.store.DataOutput.writeInt(DataOutput.java:72)
>    [junit4]   1>        at org.apache.lucene.store.DataOutput.writeLong(DataOutput.java:218)
>    [junit4]   1>        at org.apache.lucene.codecs.lucene46.Lucene46FieldInfosWriter.write(Lucene46FieldInfosWriter.java:81)
>    [junit4]   1>        at org.apache.lucene.index.DefaultIndexingChain.flush(DefaultIndexingChain.java:122)
>    [junit4]   1>        at org.apache.lucene.index.DocumentsWriterPerThread.flush(DocumentsWriterPerThread.java:442)
>    [junit4]   1>        at org.apache.lucene.index.DocumentsWriter.doFlush(DocumentsWriter.java:510)
>    [junit4]   1>        at org.apache.lucene.index.DocumentsWriter.flushAllThreads(DocumentsWriter.java:621)
>    [junit4]   1>        at org.apache.lucene.index.IndexWriter.getReader(IndexWriter.java:413)
>    [junit4]   1>        at org.apache.lucene.index.DirectoryReader.open(DirectoryReader.java:87)
>    [junit4]   1>        at org.apache.lucene.index.TestIndexWriterOutOfMemory.testBasics(TestIndexWriterOutOfMemory.java:209)
>    [junit4]   1>        at sun.reflect.NativeMethodAccessorImpl.invoke0(Native Method)
>    [junit4]   1>        at sun.reflect.NativeMethodAccessorImpl.invoke(NativeMethodAccessorImpl.java:57)
>    [junit4]   1>        at sun.reflect.DelegatingMethodAccessorImpl.invoke(DelegatingMethodAccessorImpl.java:43)
>    [junit4]   1>        at java.lang.reflect.Method.invoke(Method.java:606)
>    [junit4]   1>        at com.carrotsearch.randomizedtesting.RandomizedRunner.invoke(RandomizedRunner.java:1618)
>    [junit4]   1>        at com.carrotsearch.randomizedtesting.RandomizedRunner$6.evaluate(RandomizedRunner.java:827)
>    [junit4]   1>        at com.carrotsearch.randomizedtesting.RandomizedRunner$7.evaluate(RandomizedRunner.java:863)
>    [junit4]   1>        at com.carrotsearch.randomizedtesting.RandomizedRunner$8.evaluate(RandomizedRunner.java:877)
>    [junit4]   1>        at org.apache.lucene.util.TestRuleSetupTeardownChained$1.evaluate(TestRuleSetupTeardownChained.java:50)
>    [junit4]   1>        at org.apache.lucene.util.AbstractBeforeAfterRule$1.evaluate(AbstractBeforeAfterRule.java:46)
>    [junit4]   1>        at com.carrotsearch.randomizedtesting.rules.SystemPropertiesInvariantRule$1.evaluate(SystemPropertiesInvariantRule.java:55)
>    [junit4]   1>        at org.apache.lucene.util.TestRuleThreadAndTestName$1.evaluate(TestRuleThreadAndTestName.java:49)
>    [junit4]   1>        at org.apache.lucene.util.TestRuleIgnoreAfterMaxFailures$1.evaluate(TestRuleIgnoreAfterMaxFailures.java:65)
>    [junit4]   1>        at org.apache.lucene.util.TestRuleMarkFailure$1.evaluate(TestRuleMarkFailure.java:48)
>    [junit4]   1>        at com.carrotsearch.randomizedtesting.rules.StatementAdapter.evaluate(StatementAdapter.java:36)
>    [junit4]   1>        at com.carrotsearch.randomizedtesting.ThreadLeakControl$StatementRunner.run(ThreadLeakControl.java:365)
>    [junit4]   1>        at com.carrotsearch.randomizedtesting.ThreadLeakControl.forkTimeoutingTask(ThreadLeakControl.java:798)
>    [junit4]   1>        at com.carrotsearch.randomizedtesting.ThreadLeakControl$3.evaluate(ThreadLeakControl.java:458)
>    [junit4]   1>        at com.carrotsearch.randomizedtesting.RandomizedRunner.runSingleTest(RandomizedRunner.java:836)
>    [junit4]   1>        at com.carrotsearch.randomizedtesting.RandomizedRunner$3.evaluate(RandomizedRunner.java:738)
>    [junit4]   1>        at com.carrotsearch.randomizedtesting.RandomizedRunner$4.evaluate(RandomizedRunner.java:772)
>    [junit4]   1>        at com.carrotsearch.randomizedtesting.RandomizedRunner$5.evaluate(RandomizedRunner.java:783)
>    [junit4]   1>        at org.apache.lucene.util.AbstractBeforeAfterRule$1.evaluate(AbstractBeforeAfterRule.java:46)
>    [junit4]   1>        at org.apache.lucene.util.TestRuleStoreClassName$1.evaluate(TestRuleStoreClassName.java:42)
>    [junit4]   1>        at com.carrotsearch.randomizedtesting.rules.SystemPropertiesInvariantRule$1.evaluate(SystemPropertiesInvariantRule.java:55)
>    [junit4]   1>        at com.carrotsearch.randomizedtesting.rules.NoShadowingOrOverridesOnMethodsRule$1.evaluate(NoShadowingOrOverridesOnMethodsRule.java:39)
>    [junit4]   1>        at com.carrotsearch.randomizedtesting.rules.NoShadowingOrOverridesOnMethodsRule$1.evaluate(NoShadowingOrOverridesOnMethodsRule.java:39)
>    [junit4]   1>        at com.carrotsearch.randomizedtesting.rules.StatementAdapter.evaluate(StatementAdapter.java:36)
>    [junit4]   1>        at com.carrotsearch.randomizedtesting.rules.StatementAdapter.evaluate(StatementAdapter.java:36)
>    [junit4]   1>        at com.carrotsearch.randomizedtesting.rules.StatementAdapter.evaluate(StatementAdapter.java:36)
>    [junit4]   1>        at org.apache.lucene.util.TestRuleAssertionsRequired$1.evaluate(TestRuleAssertionsRequired.java:43)
>    [junit4]   1>        at org.apache.lucene.util.TestRuleMarkFailure$1.evaluate(TestRuleMarkFailure.java:48)
>    [junit4]   1>        at org.apache.lucene.util.TestRuleIgnoreAfterMaxFailures$1.evaluate(TestRuleIgnoreAfterMaxFailures.java:65)
>    [junit4]   1>        at org.apache.lucene.util.TestRuleIgnoreTestSuites$1.evaluate(TestRuleIgnoreTestSuites.java:55)
>    [junit4]   1>        at com.carrotsearch.randomizedtesting.rules.StatementAdapter.evaluate(StatementAdapter.java:36)
>    [junit4]   1>        at com.carrotsearch.randomizedtesting.ThreadLeakControl$StatementRunner.run(ThreadLeakControl.java:365)
>    [junit4]   1>        at java.lang.Thread.run(Thread.java:745)
>    [junit4]   1>
>    [junit4]   1> TEST: got expected fake exc:Fake OutOfMemoryError
>    [junit4]   1> java.lang.OutOfMemoryError: Fake OutOfMemoryError
>    [junit4]   1>        at org.apache.lucene.index.TestIndexWriterOutOfMemory$2.eval(TestIndexWriterOutOfMemory.java:119)
>    [junit4]   1>        at org.apache.lucene.store.MockDirectoryWrapper.maybeThrowDeterministicException(MockDirectoryWrapper.java:922)
>    [junit4]   1>        at org.apache.lucene.store.MockIndexOutputWrapper.writeBytes(MockIndexOutputWrapper.java:128)
>    [junit4]   1>        at org.apache.lucene.store.MockIndexOutputWrapper.writeByte(MockIndexOutputWrapper.java:111)
>    [junit4]   1>        at org.apache.lucene.store.DataOutput.writeVInt(DataOutput.java:196)
>    [junit4]   1>        at org.apache.lucene.codecs.lucene41.Lucene41PostingsWriter.finishTerm(Lucene41PostingsWriter.java:485)
>    [junit4]   1>        at org.apache.lucene.codecs.PushPostingsWriterBase.writeTerm(PushPostingsWriterBase.java:198)
>    [junit4]   1>        at org.apache.lucene.codecs.blocktree.BlockTreeTermsWriter$TermsWriter.write(BlockTreeTermsWriter.java:894)
>    [junit4]   1>        at org.apache.lucene.codecs.blocktree.BlockTreeTermsWriter.write(BlockTreeTermsWriter.java:383)
>    [junit4]   1>        at org.apache.lucene.codecs.perfield.PerFieldPostingsFormat$FieldsWriter.write(PerFieldPostingsFormat.java:186)
>    [junit4]   1>        at org.apache.lucene.index.FreqProxTermsWriter.flush(FreqProxTermsWriter.java:107)
>    [junit4]   1>        at org.apache.lucene.index.DefaultIndexingChain.flush(DefaultIndexingChain.java:115)
>    [junit4]   1>        at org.apache.lucene.index.DocumentsWriterPerThread.flush(DocumentsWriterPerThread.java:442)
>    [junit4]   1>        at org.apache.lucene.index.DocumentsWriter.doFlush(DocumentsWriter.java:510)
>    [junit4]   1>        at org.apache.lucene.index.DocumentsWriter.flushAllThreads(DocumentsWriter.java:621)
>    [junit4]   1>        at org.apache.lucene.index.IndexWriter.getReader(IndexWriter.java:413)
>    [junit4]   1>        at org.apache.lucene.index.DirectoryReader.open(DirectoryReader.java:87)
>    [junit4]   1>        at org.apache.lucene.index.TestIndexWriterOutOfMemory.testBasics(TestIndexWriterOutOfMemory.java:209)
>    [junit4]   1>        at sun.reflect.NativeMethodAccessorImpl.invoke0(Native Method)
>    [junit4]   1>        at sun.reflect.NativeMethodAccessorImpl.invoke(NativeMethodAccessorImpl.java:57)
>    [junit4]   1>        at sun.reflect.DelegatingMethodAccessorImpl.invoke(DelegatingMethodAccessorImpl.java:43)
>    [junit4]   1>        at java.lang.reflect.Method.invoke(Method.java:606)
>    [junit4]   1>        at com.carrotsearch.randomizedtesting.RandomizedRunner.invoke(RandomizedRunner.java:1618)
>    [junit4]   1>        at com.carrotsearch.randomizedtesting.RandomizedRunner$6.evaluate(RandomizedRunner.java:827)
>    [junit4]   1>        at com.carrotsearch.randomizedtesting.RandomizedRunner$7.evaluate(RandomizedRunner.java:863)
>    [junit4]   1>        at com.carrotsearch.randomizedtesting.RandomizedRunner$8.evaluate(RandomizedRunner.java:877)
>    [junit4]   1>        at org.apache.lucene.util.TestRuleSetupTeardownChained$1.evaluate(TestRuleSetupTeardownChained.java:50)
>    [junit4]   1>        at org.apache.lucene.util.AbstractBeforeAfterRule$1.evaluate(AbstractBeforeAfterRule.java:46)
>    [junit4]   1>        at com.carrotsearch.randomizedtesting.rules.SystemPropertiesInvariantRule$1.evaluate(SystemPropertiesInvariantRule.java:55)
>    [junit4]   1>        at org.apache.lucene.util.TestRuleThreadAndTestName$1.evaluate(TestRuleThreadAndTestName.java:49)
>    [junit4]   1>        at org.apache.lucene.util.TestRuleIgnoreAfterMaxFailures$1.evaluate(TestRuleIgnoreAfterMaxFailures.java:65)
>    [junit4]   1>        at org.apache.lucene.util.TestRuleMarkFailure$1.evaluate(TestRuleMarkFailure.java:48)
>    [junit4]   1>        at com.carrotsearch.randomizedtesting.rules.StatementAdapter.evaluate(StatementAdapter.java:36)
>    [junit4]   1>        at com.carrotsearch.randomizedtesting.ThreadLeakControl$StatementRunner.run(ThreadLeakControl.java:365)
>    [junit4]   1>        at com.carrotsearch.randomizedtesting.ThreadLeakControl.forkTimeoutingTask(ThreadLeakControl.java:798)
>    [junit4]   1>        at com.carrotsearch.randomizedtesting.ThreadLeakControl$3.evaluate(ThreadLeakControl.java:458)
>    [junit4]   1>        at com.carrotsearch.randomizedtesting.RandomizedRunner.runSingleTest(RandomizedRunner.java:836)
>    [junit4]   1>        at com.carrotsearch.randomizedtesting.RandomizedRunner$3.evaluate(RandomizedRunner.java:738)
>    [junit4]   1>        at com.carrotsearch.randomizedtesting.RandomizedRunner$4.evaluate(RandomizedRunner.java:772)
>    [junit4]   1>        at com.carrotsearch.randomizedtesting.RandomizedRunner$5.evaluate(RandomizedRunner.java:783)
>    [junit4]   1>        at org.apache.lucene.util.AbstractBeforeAfterRule$1.evaluate(AbstractBeforeAfterRule.java:46)
>    [junit4]   1>        at org.apache.lucene.util.TestRuleStoreClassName$1.evaluate(TestRuleStoreClassName.java:42)
>    [junit4]   1>        at com.carrotsearch.randomizedtesting.rules.SystemPropertiesInvariantRule$1.evaluate(SystemPropertiesInvariantRule.java:55)
>    [junit4]   1>        at com.carrotsearch.randomizedtesting.rules.NoShadowingOrOverridesOnMethodsRule$1.evaluate(NoShadowingOrOverridesOnMethodsRule.java:39)
>    [junit4]   1>        at com.carrotsearch.randomizedtesting.rules.NoShadowingOrOverridesOnMethodsRule$1.evaluate(NoShadowingOrOverridesOnMethodsRule.java:39)
>    [junit4]   1>        at com.carrotsearch.randomizedtesting.rules.StatementAdapter.evaluate(StatementAdapter.java:36)
>    [junit4]   1>        at com.carrotsearch.randomizedtesting.rules.StatementAdapter.evaluate(StatementAdapter.java:36)
>    [junit4]   1>        at com.carrotsearch.randomizedtesting.rules.StatementAdapter.evaluate(StatementAdapter.java:36)
>    [junit4]   1>        at org.apache.lucene.util.TestRuleAssertionsRequired$1.evaluate(TestRuleAssertionsRequired.java:43)
>    [junit4]   1>        at org.apache.lucene.util.TestRuleMarkFailure$1.evaluate(TestRuleMarkFailure.java:48)
>    [junit4]   1>        at org.apache.lucene.util.TestRuleIgnoreAfterMaxFailures$1.evaluate(TestRuleIgnoreAfterMaxFailures.java:65)
>    [junit4]   1>        at org.apache.lucene.util.TestRuleIgnoreTestSuites$1.evaluate(TestRuleIgnoreTestSuites.java:55)
>    [junit4]   1>        at com.carrotsearch.randomizedtesting.rules.StatementAdapter.evaluate(StatementAdapter.java:36)
>    [junit4]   1>        at com.carrotsearch.randomizedtesting.ThreadLeakControl$StatementRunner.run(ThreadLeakControl.java:365)
>    [junit4]   1>        at java.lang.Thread.run(Thread.java:745)
>    [junit4]   1>
>    [junit4]   1> TEST: got expected fake exc:Fake OutOfMemoryError
>    [junit4]   1> java.lang.OutOfMemoryError: Fake OutOfMemoryError
>    [junit4]   1>        at org.apache.lucene.index.TestIndexWriterOutOfMemory$2.eval(TestIndexWriterOutOfMemory.java:119)
>    [junit4]   1>        at org.apache.lucene.store.MockDirectoryWrapper.maybeThrowDeterministicException(MockDirectoryWrapper.java:922)
>    [junit4]   1>        at org.apache.lucene.store.MockIndexOutputWrapper.writeBytes(MockIndexOutputWrapper.java:128)
>    [junit4]   1>        at org.apache.lucene.store.MockIndexOutputWrapper.writeByte(MockIndexOutputWrapper.java:111)
>    [junit4]   1>        at org.apache.lucene.util.fst.FST.save(FST.java:601)
>    [junit4]   1>        at org.apache.lucene.codecs.blocktree.BlockTreeTermsWriter$TermsWriter.finish(BlockTreeTermsWriter.java:970)
>    [junit4]   1>        at org.apache.lucene.codecs.blocktree.BlockTreeTermsWriter.write(BlockTreeTermsWriter.java:386)
>    [junit4]   1>        at org.apache.lucene.codecs.perfield.PerFieldPostingsFormat$FieldsWriter.write(PerFieldPostingsFormat.java:186)
>    [junit4]   1>        at org.apache.lucene.index.FreqProxTermsWriter.flush(FreqProxTermsWriter.java:107)
>    [junit4]   1>        at org.apache.lucene.index.DefaultIndexingChain.flush(DefaultIndexingChain.java:115)
>    [junit4]   1>        at org.apache.lucene.index.DocumentsWriterPerThread.flush(DocumentsWriterPerThread.java:442)
>    [junit4]   1>        at org.apache.lucene.index.DocumentsWriter.doFlush(DocumentsWriter.java:510)
>    [junit4]   1>        at org.apache.lucene.index.DocumentsWriter.flushAllThreads(DocumentsWriter.java:621)
>    [junit4]   1>        at org.apache.lucene.index.IndexWriter.prepareCommitInternal(IndexWriter.java:2793)
>    [junit4]   1>        at org.apache.lucene.index.IndexWriter.commitInternal(IndexWriter.java:2952)
>    [junit4]   1>        at org.apache.lucene.index.IndexWriter.commit(IndexWriter.java:2919)
>    [junit4]   1>        at org.apache.lucene.index.TestIndexWriterOutOfMemory.testBasics(TestIndexWriterOutOfMemory.java:215)
>    [junit4]   1>        at sun.reflect.NativeMethodAccessorImpl.invoke0(Native Method)
>    [junit4]   1>        at sun.reflect.NativeMethodAccessorImpl.invoke(NativeMethodAccessorImpl.java:57)
>    [junit4]   1>        at sun.reflect.DelegatingMethodAccessorImpl.invoke(DelegatingMethodAccessorImpl.java:43)
>    [junit4]   1>        at java.lang.reflect.Method.invoke(Method.java:606)
>    [junit4]   1>        at com.carrotsearch.randomizedtesting.RandomizedRunner.invoke(RandomizedRunner.java:1618)
>    [junit4]   1>        at com.carrotsearch.randomizedtesting.RandomizedRunner$6.evaluate(RandomizedRunner.java:827)
>    [junit4]   1>        at com.carrotsearch.randomizedtesting.RandomizedRunner$7.evaluate(RandomizedRunner.java:863)
>    [junit4]   1>        at com.carrotsearch.randomizedtesting.RandomizedRunner$8.evaluate(RandomizedRunner.java:877)
>    [junit4]   1>        at org.apache.lucene.util.TestRuleSetupTeardownChained$1.evaluate(TestRuleSetupTeardownChained.java:50)
>    [junit4]   1>        at org.apache.lucene.util.AbstractBeforeAfterRule$1.evaluate(AbstractBeforeAfterRule.java:46)
>    [junit4]   1>        at com.carrotsearch.randomizedtesting.rules.SystemPropertiesInvariantRule$1.evaluate(SystemPropertiesInvariantRule.java:55)
>    [junit4]   1>        at org.apache.lucene.util.TestRuleThreadAndTestName$1.evaluate(TestRuleThreadAndTestName.java:49)
>    [junit4]   1>        at org.apache.lucene.util.TestRuleIgnoreAfterMaxFailures$1.evaluate(TestRuleIgnoreAfterMaxFailures.java:65)
>    [junit4]   1>        at org.apache.lucene.util.TestRuleMarkFailure$1.evaluate(TestRuleMarkFailure.java:48)
>    [junit4]   1>        at com.carrotsearch.randomizedtesting.rules.StatementAdapter.evaluate(StatementAdapter.java:36)
>    [junit4]   1>        at com.carrotsearch.randomizedtesting.ThreadLeakControl$StatementRunner.run(ThreadLeakControl.java:365)
>    [junit4]   1>        at com.carrotsearch.randomizedtesting.ThreadLeakControl.forkTimeoutingTask(ThreadLeakControl.java:798)
>    [junit4]   1>        at com.carrotsearch.randomizedtesting.ThreadLeakControl$3.evaluate(ThreadLeakControl.java:458)
>    [junit4]   1>        at com.carrotsearch.randomizedtesting.RandomizedRunner.runSingleTest(RandomizedRunner.java:836)
>    [junit4]   1>        at com.carrotsearch.randomizedtesting.RandomizedRunner$3.evaluate(RandomizedRunner.java:738)
>    [junit4]   1>        at com.carrotsearch.randomizedtesting.RandomizedRunner$4.evaluate(RandomizedRunner.java:772)
>    [junit4]   1>        at com.carrotsearch.randomizedtesting.RandomizedRunner$5.evaluate(RandomizedRunner.java:783)
>    [junit4]   1>        at org.apache.lucene.util.AbstractBeforeAfterRule$1.evaluate(AbstractBeforeAfterRule.java:46)
>    [junit4]   1>        at org.apache.lucene.util.TestRuleStoreClassName$1.evaluate(TestRuleStoreClassName.java:42)
>    [junit4]   1>        at com.carrotsearch.randomizedtesting.rules.SystemPropertiesInvariantRule$1.evaluate(SystemPropertiesInvariantRule.java:55)
>    [junit4]   1>        at com.carrotsearch.randomizedtesting.rules.NoShadowingOrOverridesOnMethodsRule$1.evaluate(NoShadowingOrOverridesOnMethodsRule.java:39)
>    [junit4]   1>        at com.carrotsearch.randomizedtesting.rules.NoShadowingOrOverridesOnMethodsRule$1.evaluate(NoShadowingOrOverridesOnMethodsRule.java:39)
>    [junit4]   1>        at com.carrotsearch.randomizedtesting.rules.StatementAdapter.evaluate(StatementAdapter.java:36)
>    [junit4]   1>        at com.carrotsearch.randomizedtesting.rules.StatementAdapter.evaluate(StatementAdapter.java:36)
>    [junit4]   1>        at com.carrotsearch.randomizedtesting.rules.StatementAdapter.evaluate(StatementAdapter.java:36)
>    [junit4]   1>        at org.apache.lucene.util.TestRuleAssertionsRequired$1.evaluate(TestRuleAssertionsRequired.java:43)
>    [junit4]   1>        at org.apache.lucene.util.TestRuleMarkFailure$1.evaluate(TestRuleMarkFailure.java:48)
>    [junit4]   1>        at org.apache.lucene.util.TestRuleIgnoreAfterMaxFailures$1.evaluate(TestRuleIgnoreAfterMaxFailures.java:65)
>    [junit4]   1>        at org.apache.lucene.util.TestRuleIgnoreTestSuites$1.evaluate(TestRuleIgnoreTestSuites.java:55)
>    [junit4]   1>        at com.carrotsearch.randomizedtesting.rules.StatementAdapter.evaluate(StatementAdapter.java:36)
>    [junit4]   1>        at com.carrotsearch.randomizedtesting.ThreadLeakControl$StatementRunner.run(ThreadLeakControl.java:365)
>    [junit4]   1>        at java.lang.Thread.run(Thread.java:745)
>    [junit4]   1>
>    [junit4]   1> TEST: got expected fake exc:Fake OutOfMemoryError
>    [junit4]   1> java.lang.OutOfMemoryError: Fake OutOfMemoryError
>    [junit4]   1>        at org.apache.lucene.index.TestIndexWriterOutOfMemory$2.eval(TestIndexWriterOutOfMemory.java:119)
>    [junit4]   1>        at org.apache.lucene.store.MockDirectoryWrapper.maybeThrowDeterministicException(MockDirectoryWrapper.java:922)
>    [junit4]   1>        at org.apache.lucene.store.MockIndexOutputWrapper.writeBytes(MockIndexOutputWrapper.java:128)
>    [junit4]   1>        at org.apache.lucene.store.MockIndexOutputWrapper.writeByte(MockIndexOutputWrapper.java:111)
>    [junit4]   1>        at org.apache.lucene.store.DataOutput.writeVInt(DataOutput.java:196)
>    [junit4]   1>        at org.apache.lucene.store.DataOutput.writeString(DataOutput.java:261)
>    [junit4]   1>        at org.apache.lucene.store.DataOutput.writeStringStringMap(DataOutput.java:301)
>    [junit4]   1>        at org.apache.lucene.codecs.lucene46.Lucene46FieldInfosWriter.write(Lucene46FieldInfosWriter.java:82)
>    [junit4]   1>        at org.apache.lucene.index.DefaultIndexingChain.flush(DefaultIndexingChain.java:122)
>    [junit4]   1>        at org.apache.lucene.index.DocumentsWriterPerThread.flush(DocumentsWriterPerThread.java:442)
>    [junit4]   1>        at org.apache.lucene.index.DocumentsWriter.doFlush(DocumentsWriter.java:510)
>    [junit4]   1>        at org.apache.lucene.index.DocumentsWriter.flushAllThreads(DocumentsWriter.java:621)
>    [junit4]   1>        at org.apache.lucene.index.IndexWriter.prepareCommitInternal(IndexWriter.java:2793)
>    [junit4]   1>        at org.apache.lucene.index.IndexWriter.commitInternal(IndexWriter.java:2952)
>    [junit4]   1>        at org.apache.lucene.index.IndexWriter.commit(IndexWriter.java:2919)
>    [junit4]   1>        at org.apache.lucene.index.TestIndexWriterOutOfMemory.testBasics(TestIndexWriterOutOfMemory.java:215)
>    [junit4]   1>        at sun.reflect.NativeMethodAccessorImpl.invoke0(Native Method)
>    [junit4]   1>        at sun.reflect.NativeMethodAccessorImpl.invoke(NativeMethodAccessorImpl.java:57)
>    [junit4]   1>        at sun.reflect.DelegatingMethodAccessorImpl.invoke(DelegatingMethodAccessorImpl.java:43)
>    [junit4]   1>        at java.lang.reflect.Method.invoke(Method.java:606)
>    [junit4]   1>        at com.carrotsearch.randomizedtesting.RandomizedRunner.invoke(RandomizedRunner.java:1618)
>    [junit4]   1>        at com.carrotsearch.randomizedtesting.RandomizedRunner$6.evaluate(RandomizedRunner.java:827)
>    [junit4]   1>        at com.carrotsearch.randomizedtesting.RandomizedRunner$7.evaluate(RandomizedRunner.java:863)
>    [junit4]   1>        at com.carrotsearch.randomizedtesting.RandomizedRunner$8.evaluate(RandomizedRunner.java:877)
>    [junit4]   1>        at org.apache.lucene.util.TestRuleSetupTeardownChained$1.evaluate(TestRuleSetupTeardownChained.java:50)
>    [junit4]   1>        at org.apache.lucene.util.AbstractBeforeAfterRule$1.evaluate(AbstractBeforeAfterRule.java:46)
>    [junit4]   1>        at com.carrotsearch.randomizedtesting.rules.SystemPropertiesInvariantRule$1.evaluate(SystemPropertiesInvariantRule.java:55)
>    [junit4]   1>        at org.apache.lucene.util.TestRuleThreadAndTestName$1.evaluate(TestRuleThreadAndTestName.java:49)
>    [junit4]   1>        at org.apache.lucene.util.TestRuleIgnoreAfterMaxFailures$1.evaluate(TestRuleIgnoreAfterMaxFailures.java:65)
>    [junit4]   1>        at org.apache.lucene.util.TestRuleMarkFailure$1.evaluate(TestRuleMarkFailure.java:48)
>    [junit4]   1>        at com.carrotsearch.randomizedtesting.rules.StatementAdapter.evaluate(StatementAdapter.java:36)
>    [junit4]   1>        at com.carrotsearch.randomizedtesting.ThreadLeakControl$StatementRunner.run(ThreadLeakControl.java:365)
>    [junit4]   1>        at com.carrotsearch.randomizedtesting.ThreadLeakControl.forkTimeoutingTask(ThreadLeakControl.java:798)
>    [junit4]   1>        at com.carrotsearch.randomizedtesting.ThreadLeakControl$3.evaluate(ThreadLeakControl.java:458)
>    [junit4]   1>        at com.carrotsearch.randomizedtesting.RandomizedRunner.runSingleTest(RandomizedRunner.java:836)
>    [junit4]   1>        at com.carrotsearch.randomizedtesting.RandomizedRunner$3.evaluate(RandomizedRunner.java:738)
>    [junit4]   1>        at com.carrotsearch.randomizedtesting.RandomizedRunner$4.evaluate(RandomizedRunner.java:772)
>    [junit4]   1>        at com.carrotsearch.randomizedtesting.RandomizedRunner$5.evaluate(RandomizedRunner.java:783)
>    [junit4]   1>        at org.apache.lucene.util.AbstractBeforeAfterRule$1.evaluate(AbstractBeforeAfterRule.java:46)
>    [junit4]   1>        at org.apache.lucene.util.TestRuleStoreClassName$1.evaluate(TestRuleStoreClassName.java:42)
>    [junit4]   1>        at com.carrotsearch.randomizedtesting.rules.SystemPropertiesInvariantRule$1.evaluate(SystemPropertiesInvariantRule.java:55)
>    [junit4]   1>        at com.carrotsearch.randomizedtesting.rules.NoShadowingOrOverridesOnMethodsRule$1.evaluate(NoShadowingOrOverridesOnMethodsRule.java:39)
>    [junit4]   1>        at com.carrotsearch.randomizedtesting.rules.NoShadowingOrOverridesOnMethodsRule$1.evaluate(NoShadowingOrOverridesOnMethodsRule.java:39)
>    [junit4]   1>        at com.carrotsearch.randomizedtesting.rules.StatementAdapter.evaluate(StatementAdapter.java:36)
>    [junit4]   1>        at com.carrotsearch.randomizedtesting.rules.StatementAdapter.evaluate(StatementAdapter.java:36)
>    [junit4]   1>        at com.carrotsearch.randomizedtesting.rules.StatementAdapter.evaluate(StatementAdapter.java:36)
>    [junit4]   1>        at org.apache.lucene.util.TestRuleAssertionsRequired$1.evaluate(TestRuleAssertionsRequired.java:43)
>    [junit4]   1>        at org.apache.lucene.util.TestRuleMarkFailure$1.evaluate(TestRuleMarkFailure.java:48)
>    [junit4]   1>        at org.apache.lucene.util.TestRuleIgnoreAfterMaxFailures$1.evaluate(TestRuleIgnoreAfterMaxFailures.java:65)
>    [junit4]   1>        at org.apache.lucene.util.TestRuleIgnoreTestSuites$1.evaluate(TestRuleIgnoreTestSuites.java:55)
>    [junit4]   1>        at com.carrotsearch.randomizedtesting.rules.StatementAdapter.evaluate(StatementAdapter.java:36)
>    [junit4]   1>        at com.carrotsearch.randomizedtesting.ThreadLeakControl$StatementRunner.run(ThreadLeakControl.java:365)
>    [junit4]   1>        at java.lang.Thread.run(Thread.java:745)
>    [junit4]   1>
>    [junit4]   1> TEST: got expected fake exc:Fake OutOfMemoryError
>    [junit4]   1> java.lang.OutOfMemoryError: Fake OutOfMemoryError
>    [junit4]   1>        at org.apache.lucene.index.TestIndexWriterOutOfMemory$2.eval(TestIndexWriterOutOfMemory.java:119)
>    [junit4]   1>        at org.apache.lucene.store.MockDirectoryWrapper.maybeThrowDeterministicException(MockDirectoryWrapper.java:922)
>    [junit4]   1>        at org.apache.lucene.store.MockIndexOutputWrapper.writeBytes(MockIndexOutputWrapper.java:128)
>    [junit4]   1>        at org.apache.lucene.store.MockIndexOutputWrapper.writeByte(MockIndexOutputWrapper.java:111)
>    [junit4]   1>        at org.apache.lucene.store.DataOutput.writeVInt(DataOutput.java:196)
>    [junit4]   1>        at org.apache.lucene.util.fst.FST.save(FST.java:588)
>    [junit4]   1>        at org.apache.lucene.codecs.blocktree.BlockTreeTermsWriter$TermsWriter.finish(BlockTreeTermsWriter.java:970)
>    [junit4]   1>        at org.apache.lucene.codecs.blocktree.BlockTreeTermsWriter.write(BlockTreeTermsWriter.java:386)
>    [junit4]   1>        at org.apache.lucene.codecs.perfield.PerFieldPostingsFormat$FieldsWriter.write(PerFieldPostingsFormat.java:186)
>    [junit4]   1>        at org.apache.lucene.index.FreqProxTermsWriter.flush(FreqProxTermsWriter.java:107)
>    [junit4]   1>        at org.apache.lucene.index.DefaultIndexingChain.flush(DefaultIndexingChain.java:115)
>    [junit4]   1>        at org.apache.lucene.index.DocumentsWriterPerThread.flush(DocumentsWriterPerThread.java:442)
>    [junit4]   1>        at org.apache.lucene.index.DocumentsWriter.doFlush(DocumentsWriter.java:510)
>    [junit4]   1>        at org.apache.lucene.index.DocumentsWriter.flushAllThreads(DocumentsWriter.java:621)
>    [junit4]   1>        at org.apache.lucene.index.IndexWriter.prepareCommitInternal(IndexWriter.java:2793)
>    [junit4]   1>        at org.apache.lucene.index.IndexWriter.commitInternal(IndexWriter.java:2952)
>    [junit4]   1>        at org.apache.lucene.index.IndexWriter.commit(IndexWriter.java:2919)
>    [junit4]   1>        at org.apache.lucene.index.TestIndexWriterOutOfMemory.testBasics(TestIndexWriterOutOfMemory.java:215)
>    [junit4]   1>        at sun.reflect.NativeMethodAccessorImpl.invoke0(Native Method)
>    [junit4]   1>        at sun.reflect.NativeMethodAccessorImpl.invoke(NativeMethodAccessorImpl.java:57)
>    [junit4]   1>        at sun.reflect.DelegatingMethodAccessorImpl.invoke(DelegatingMethodAccessorImpl.java:43)
>    [junit4]   1>        at java.lang.reflect.Method.invoke(Method.java:606)
>    [junit4]   1>        at com.carrotsearch.randomizedtesting.RandomizedRunner.invoke(RandomizedRunner.java:1618)
>    [junit4]   1>        at com.carrotsearch.randomizedtesting.RandomizedRunner$6.evaluate(RandomizedRunner.java:827)
>    [junit4]   1>        at com.carrotsearch.randomizedtesting.RandomizedRunner$7.evaluate(RandomizedRunner.java:863)
>    [junit4]   1>        at com.carrotsearch.randomizedtesting.RandomizedRunner$8.evaluate(RandomizedRunner.java:877)
>    [junit4]   1>        at org.apache.lucene.util.TestRuleSetupTeardownChained$1.evaluate(TestRuleSetupTeardownChained.java:50)
>    [junit4]   1>        at org.apache.lucene.util.AbstractBeforeAfterRule$1.evaluate(AbstractBeforeAfterRule.java:46)
>    [junit4]   1>        at com.carrotsearch.randomizedtesting.rules.SystemPropertiesInvariantRule$1.evaluate(SystemPropertiesInvariantRule.java:55)
>    [junit4]   1>        at org.apache.lucene.util.TestRuleThreadAndTestName$1.evaluate(TestRuleThreadAndTestName.java:49)
>    [junit4]   1>        at org.apache.lucene.util.TestRuleIgnoreAfterMaxFailures$1.evaluate(TestRuleIgnoreAfterMaxFailures.java:65)
>    [junit4]   1>        at org.apache.lucene.util.TestRuleMarkFailure$1.evaluate(TestRuleMarkFailure.java:48)
>    [junit4]   1>        at com.carrotsearch.randomizedtesting.rules.StatementAdapter.evaluate(StatementAdapter.java:36)
>    [junit4]   1>        at com.carrotsearch.randomizedtesting.ThreadLeakControl$StatementRunner.run(ThreadLeakControl.java:365)
>    [junit4]   1>        at com.carrotsearch.randomizedtesting.ThreadLeakControl.forkTimeoutingTask(ThreadLeakControl.java:798)
>    [junit4]   1>        at com.carrotsearch.randomizedtesting.ThreadLeakControl$3.evaluate(ThreadLeakControl.java:458)
>    [junit4]   1>        at com.carrotsearch.randomizedtesting.RandomizedRunner.runSingleTest(RandomizedRunner.java:836)
>    [junit4]   1>        at com.carrotsearch.randomizedtesting.RandomizedRunner$3.evaluate(RandomizedRunner.java:738)
>    [junit4]   1>        at com.carrotsearch.randomizedtesting.RandomizedRunner$4.evaluate(RandomizedRunner.java:772)
>    [junit4]   1>        at com.carrotsearch.randomizedtesting.RandomizedRunner$5.evaluate(RandomizedRunner.java:783)
>    [junit4]   1>        at org.apache.lucene.util.AbstractBeforeAfterRule$1.evaluate(AbstractBeforeAfterRule.java:46)
>    [junit4]   1>        at org.apache.lucene.util.TestRuleStoreClassName$1.evaluate(TestRuleStoreClassName.java:42)
>    [junit4]   1>        at com.carrotsearch.randomizedtesting.rules.SystemPropertiesInvariantRule$1.evaluate(SystemPropertiesInvariantRule.java:55)
>    [junit4]   1>        at com.carrotsearch.randomizedtesting.rules.NoShadowingOrOverridesOnMethodsRule$1.evaluate(NoShadowingOrOverridesOnMethodsRule.java:39)
>    [junit4]   1>        at com.carrotsearch.randomizedtesting.rules.NoShadowingOrOverridesOnMethodsRule$1.evaluate(NoShadowingOrOverridesOnMethodsRule.java:39)
>    [junit4]   1>        at com.carrotsearch.randomizedtesting.rules.StatementAdapter.evaluate(StatementAdapter.java:36)
>    [junit4]   1>        at com.carrotsearch.randomizedtesting.rules.StatementAdapter.evaluate(StatementAdapter.java:36)
>    [junit4]   1>        at com.carrotsearch.randomizedtesting.rules.StatementAdapter.evaluate(StatementAdapter.java:36)
>    [junit4]   1>        at org.apache.lucene.util.TestRuleAssertionsRequired$1.evaluate(TestRuleAssertionsRequired.java:43)
>    [junit4]   1>        at org.apache.lucene.util.TestRuleMarkFailure$1.evaluate(TestRuleMarkFailure.java:48)
>    [junit4]   1>        at org.apache.lucene.util.TestRuleIgnoreAfterMaxFailures$1.evaluate(TestRuleIgnoreAfterMaxFailures.java:65)
>    [junit4]   1>        at org.apache.lucene.util.TestRuleIgnoreTestSuites$1.evaluate(TestRuleIgnoreTestSuites.java:55)
>    [junit4]   1>        at com.carrotsearch.randomizedtesting.rules.StatementAdapter.evaluate(StatementAdapter.java:36)
>    [junit4]   1>        at com.carrotsearch.randomizedtesting.ThreadLeakControl$StatementRunner.run(ThreadLeakControl.java:365)
>    [junit4]   1>        at java.lang.Thread.run(Thread.java:745)
>    [junit4]   1>
>    [junit4]   1> TEST: got expected fake exc:Fake OutOfMemoryError
>    [junit4]   1> java.lang.OutOfMemoryError: Fake OutOfMemoryError
>    [junit4]   1>        at org.apache.lucene.index.TestIndexWriterOutOfMemory$2.eval(TestIndexWriterOutOfMemory.java:119)
>    [junit4]   1>        at org.apache.lucene.store.MockDirectoryWrapper.maybeThrowDeterministicException(MockDirectoryWrapper.java:922)
>    [junit4]   1>        at org.apache.lucene.store.MockIndexOutputWrapper.writeBytes(MockIndexOutputWrapper.java:128)
>    [junit4]   1>        at org.apache.lucene.util.fst.BytesStore.writeTo(BytesStore.java:348)
>    [junit4]   1>        at org.apache.lucene.util.fst.FST.save(FST.java:611)
>    [junit4]   1>        at org.apache.lucene.codecs.blocktree.BlockTreeTermsWriter$TermsWriter.finish(BlockTreeTermsWriter.java:970)
>    [junit4]   1>        at org.apache.lucene.codecs.blocktree.BlockTreeTermsWriter.write(BlockTreeTermsWriter.java:386)
>    [junit4]   1>        at org.apache.lucene.codecs.perfield.PerFieldPostingsFormat$FieldsWriter.write(PerFieldPostingsFormat.java:186)
>    [junit4]   1>        at org.apache.lucene.index.FreqProxTermsWriter.flush(FreqProxTermsWriter.java:107)
>    [junit4]   1>        at org.apache.lucene.index.DefaultIndexingChain.flush(DefaultIndexingChain.java:115)
>    [junit4]   1>        at org.apache.lucene.index.DocumentsWriterPerThread.flush(DocumentsWriterPerThread.java:442)
>    [junit4]   1>        at org.apache.lucene.index.DocumentsWriter.doFlush(DocumentsWriter.java:510)
>    [junit4]   1>        at org.apache.lucene.index.DocumentsWriter.flushAllThreads(DocumentsWriter.java:621)
>    [junit4]   1>        at org.apache.lucene.index.IndexWriter.getReader(IndexWriter.java:413)
>    [junit4]   1>        at org.apache.lucene.index.DirectoryReader.open(DirectoryReader.java:87)
>    [junit4]   1>        at org.apache.lucene.index.TestIndexWriterOutOfMemory.testBasics(TestIndexWriterOutOfMemory.java:209)
>    [junit4]   1>        at sun.reflect.NativeMethodAccessorImpl.invoke0(Native Method)
>    [junit4]   1>        at sun.reflect.NativeMethodAccessorImpl.invoke(NativeMethodAccessorImpl.java:57)
>    [junit4]   1>        at sun.reflect.DelegatingMethodAccessorImpl.invoke(DelegatingMethodAccessorImpl.java:43)
>    [junit4]   1>        at java.lang.reflect.Method.invoke(Method.java:606)
>    [junit4]   1>        at com.carrotsearch.randomizedtesting.RandomizedRunner.invoke(RandomizedRunner.java:1618)
>    [junit4]   1>        at com.carrotsearch.randomizedtesting.RandomizedRunner$6.evaluate(RandomizedRunner.java:827)
>    [junit4]   1>        at com.carrotsearch.randomizedtesting.RandomizedRunner$7.evaluate(RandomizedRunner.java:863)
>    [junit4]   1>        at com.carrotsearch.randomizedtesting.RandomizedRunner$8.evaluate(RandomizedRunner.java:877)
>    [junit4]   1>        at org.apache.lucene.util.TestRuleSetupTeardownChained$1.evaluate(TestRuleSetupTeardownChained.java:50)
>    [junit4]   1>        at org.apache.lucene.util.AbstractBeforeAfterRule$1.evaluate(AbstractBeforeAfterRule.java:46)
>    [junit4]   1>        at com.carrotsearch.randomizedtesting.rules.SystemPropertiesInvariantRule$1.evaluate(SystemPropertiesInvariantRule.java:55)
>    [junit4]   1>        at org.apache.lucene.util.TestRuleThreadAndTestName$1.evaluate(TestRuleThreadAndTestName.java:49)
>    [junit4]   1>        at org.apache.lucene.util.TestRuleIgnoreAfterMaxFailures$1.evaluate(TestRuleIgnoreAfterMaxFailures.java:65)
>    [junit4]   1>        at org.apache.lucene.util.TestRuleMarkFailure$1.evaluate(TestRuleMarkFailure.java:48)
>    [junit4]   1>        at com.carrotsearch.randomizedtesting.rules.StatementAdapter.evaluate(StatementAdapter.java:36)
>    [junit4]   1>        at com.carrotsearch.randomizedtesting.ThreadLeakControl$StatementRunner.run(ThreadLeakControl.java:365)
>    [junit4]   1>        at com.carrotsearch.randomizedtesting.ThreadLeakControl.forkTimeoutingTask(ThreadLeakControl.java:798)
>    [junit4]   1>        at com.carrotsearch.randomizedtesting.ThreadLeakControl$3.evaluate(ThreadLeakControl.java:458)
>    [junit4]   1>        at com.carrotsearch.randomizedtesting.RandomizedRunner.runSingleTest(RandomizedRunner.java:836)
>    [junit4]   1>        at com.carrotsearch.randomizedtesting.RandomizedRunner$3.evaluate(RandomizedRunner.java:738)
>    [junit4]   1>        at com.carrotsearch.randomizedtesting.RandomizedRunner$4.evaluate(RandomizedRunner.java:772)
>    [junit4]   1>        at com.carrotsearch.randomizedtesting.RandomizedRunner$5.evaluate(RandomizedRunner.java:783)
>    [junit4]   1>        at org.apache.lucene.util.AbstractBeforeAfterRule$1.evaluate(AbstractBeforeAfterRule.java:46)
>    [junit4]   1>        at org.apache.lucene.util.TestRuleStoreClassName$1.evaluate(TestRuleStoreClassName.java:42)
>    [junit4]   1>        at com.carrotsearch.randomizedtesting.rules.SystemPropertiesInvariantRule$1.evaluate(SystemPropertiesInvariantRule.java:55)
>    [junit4]   1>        at com.carrotsearch.randomizedtesting.rules.NoShadowingOrOverridesOnMethodsRule$1.evaluate(NoShadowingOrOverridesOnMethodsRule.java:39)
>    [junit4]   1>        at com.carrotsearch.randomizedtesting.rules.NoShadowingOrOverridesOnMethodsRule$1.evaluate(NoShadowingOrOverridesOnMethodsRule.java:39)
>    [junit4]   1>        at com.carrotsearch.randomizedtesting.rules.StatementAdapter.evaluate(StatementAdapter.java:36)
>    [junit4]   1>        at com.carrotsearch.randomizedtesting.rules.StatementAdapter.evaluate(StatementAdapter.java:36)
>    [junit4]   1>        at com.carrotsearch.randomizedtesting.rules.StatementAdapter.evaluate(StatementAdapter.java:36)
>    [junit4]   1>        at org.apache.lucene.util.TestRuleAssertionsRequired$1.evaluate(TestRuleAssertionsRequired.java:43)
>    [junit4]   1>        at org.apache.lucene.util.TestRuleMarkFailure$1.evaluate(TestRuleMarkFailure.java:48)
>    [junit4]   1>        at org.apache.lucene.util.TestRuleIgnoreAfterMaxFailures$1.evaluate(TestRuleIgnoreAfterMaxFailures.java:65)
>    [junit4]   1>        at org.apache.lucene.util.TestRuleIgnoreTestSuites$1.evaluate(TestRuleIgnoreTestSuites.java:55)
>    [junit4]   1>        at com.carrotsearch.randomizedtesting.rules.StatementAdapter.evaluate(StatementAdapter.java:36)
>    [junit4]   1>        at com.carrotsearch.randomizedtesting.ThreadLeakControl$StatementRunner.run(ThreadLeakControl.java:365)
>    [junit4]   1>        at java.lang.Thread.run(Thread.java:745)
>    [junit4]   1>
>    [junit4]   1> TEST: got expected fake exc:Fake OutOfMemoryError
>    [junit4]   1> java.lang.OutOfMemoryError: Fake OutOfMemoryError
>    [junit4]   1>        at org.apache.lucene.index.TestIndexWriterOutOfMemory$2.eval(TestIndexWriterOutOfMemory.java:119)
>    [junit4]   1>        at org.apache.lucene.store.MockDirectoryWrapper.maybeThrowDeterministicException(MockDirectoryWrapper.java:922)
>    [junit4]   1>        at org.apache.lucene.store.MockIndexOutputWrapper.writeBytes(MockIndexOutputWrapper.java:128)
>    [junit4]   1>        at org.apache.lucene.store.MockIndexOutputWrapper.writeByte(MockIndexOutputWrapper.java:111)
>    [junit4]   1>        at org.apache.lucene.store.DataOutput.writeInt(DataOutput.java:74)
>    [junit4]   1>        at org.apache.lucene.store.DataOutput.writeLong(DataOutput.java:217)
>    [junit4]   1>        at org.apache.lucene.codecs.CodecUtil.writeFooter(CodecUtil.java:186)
>    [junit4]   1>        at org.apache.lucene.codecs.lucene46.Lucene46FieldInfosWriter.write(Lucene46FieldInfosWriter.java:84)
>    [junit4]   1>        at org.apache.lucene.index.DefaultIndexingChain.flush(DefaultIndexingChain.java:122)
>    [junit4]   1>        at org.apache.lucene.index.DocumentsWriterPerThread.flush(DocumentsWriterPerThread.java:442)
>    [junit4]   1>        at org.apache.lucene.index.DocumentsWriter.doFlush(DocumentsWriter.java:510)
>    [junit4]   1>        at org.apache.lucene.index.DocumentsWriter.flushAllThreads(DocumentsWriter.java:621)
>    [junit4]   1>        at org.apache.lucene.index.IndexWriter.prepareCommitInternal(IndexWriter.java:2793)
>    [junit4]   1>        at org.apache.lucene.index.IndexWriter.commitInternal(IndexWriter.java:2952)
>    [junit4]   1>        at org.apache.lucene.index.IndexWriter.commit(IndexWriter.java:2919)
>    [junit4]   1>        at org.apache.lucene.index.TestIndexWriterOutOfMemory.testBasics(TestIndexWriterOutOfMemory.java:215)
>    [junit4]   1>        at sun.reflect.NativeMethodAccessorImpl.invoke0(Native Method)
>    [junit4]   1>        at sun.reflect.NativeMethodAccessorImpl.invoke(NativeMethodAccessorImpl.java:57)
>    [junit4]   1>        at sun.reflect.DelegatingMethodAccessorImpl.invoke(DelegatingMethodAccessorImpl.java:43)
>    [junit4]   1>        at java.lang.reflect.Method.invoke(Method.java:606)
>    [junit4]   1>        at com.carrotsearch.randomizedtesting.RandomizedRunner.invoke(RandomizedRunner.java:1618)
>    [junit4]   1>        at com.carrotsearch.randomizedtesting.RandomizedRunner$6.evaluate(RandomizedRunner.java:827)
>    [junit4]   1>        at com.carrotsearch.randomizedtesting.RandomizedRunner$7.evaluate(RandomizedRunner.java:863)
>    [junit4]   1>        at com.carrotsearch.randomizedtesting.RandomizedRunner$8.evaluate(RandomizedRunner.java:877)
>    [junit4]   1>        at org.apache.lucene.util.TestRuleSetupTeardownChained$1.evaluate(TestRuleSetupTeardownChained.java:50)
>    [junit4]   1>        at org.apache.lucene.util.AbstractBeforeAfterRule$1.evaluate(AbstractBeforeAfterRule.java:46)
>    [junit4]   1>        at com.carrotsearch.randomizedtesting.rules.SystemPropertiesInvariantRule$1.evaluate(SystemPropertiesInvariantRule.java:55)
>    [junit4]   1>        at org.apache.lucene.util.TestRuleThreadAndTestName$1.evaluate(TestRuleThreadAndTestName.java:49)
>    [junit4]   1>        at org.apache.lucene.util.TestRuleIgnoreAfterMaxFailures$1.evaluate(TestRuleIgnoreAfterMaxFailures.java:65)
>    [junit4]   1>        at org.apache.lucene.util.TestRuleMarkFailure$1.evaluate(TestRuleMarkFailure.java:48)
>    [junit4]   1>        at com.carrotsearch.randomizedtesting.rules.StatementAdapter.evaluate(StatementAdapter.java:36)
>    [junit4]   1>        at com.carrotsearch.randomizedtesting.ThreadLeakControl$StatementRunner.run(ThreadLeakControl.java:365)
>    [junit4]   1>        at com.carrotsearch.randomizedtesting.ThreadLeakControl.forkTimeoutingTask(ThreadLeakControl.java:798)
>    [junit4]   1>        at com.carrotsearch.randomizedtesting.ThreadLeakControl$3.evaluate(ThreadLeakControl.java:458)
>    [junit4]   1>        at com.carrotsearch.randomizedtesting.RandomizedRunner.runSingleTest(RandomizedRunner.java:836)
>    [junit4]   1>        at com.carrotsearch.randomizedtesting.RandomizedRunner$3.evaluate(RandomizedRunner.java:738)
>    [junit4]   1>        at com.carrotsearch.randomizedtesting.RandomizedRunner$4.evaluate(RandomizedRunner.java:772)
>    [junit4]   1>        at com.carrotsearch.randomizedtesting.RandomizedRunner$5.evaluate(RandomizedRunner.java:783)
>    [junit4]   1>        at org.apache.lucene.util.AbstractBeforeAfterRule$1.evaluate(AbstractBeforeAfterRule.java:46)
>    [junit4]   1>        at org.apache.lucene.util.TestRuleStoreClassName$1.evaluate(TestRuleStoreClassName.java:42)
>    [junit4]   1>        at com.carrotsearch.randomizedtesting.rules.SystemPropertiesInvariantRule$1.evaluate(SystemPropertiesInvariantRule.java:55)
>    [junit4]   1>        at com.carrotsearch.randomizedtesting.rules.NoShadowingOrOverridesOnMethodsRule$1.evaluate(NoShadowingOrOverridesOnMethodsRule.java:39)
>    [junit4]   1>        at com.carrotsearch.randomizedtesting.rules.NoShadowingOrOverridesOnMethodsRule$1.evaluate(NoShadowingOrOverridesOnMethodsRule.java:39)
>    [junit4]   1>        at com.carrotsearch.randomizedtesting.rules.StatementAdapter.evaluate(StatementAdapter.java:36)
>    [junit4]   1>        at com.carrotsearch.randomizedtesting.rules.StatementAdapter.evaluate(StatementAdapter.java:36)
>    [junit4]   1>        at com.carrotsearch.randomizedtesting.rules.StatementAdapter.evaluate(StatementAdapter.java:36)
>    [junit4]   1>        at org.apache.lucene.util.TestRuleAssertionsRequired$1.evaluate(TestRuleAssertionsRequired.java:43)
>    [junit4]   1>        at org.apache.lucene.util.TestRuleMarkFailure$1.evaluate(TestRuleMarkFailure.java:48)
>    [junit4]   1>        at org.apache.lucene.util.TestRuleIgnoreAfterMaxFailures$1.evaluate(TestRuleIgnoreAfterMaxFailures.java:65)
>    [junit4]   1>        at org.apache.lucene.util.TestRuleIgnoreTestSuites$1.evaluate(TestRuleIgnoreTestSuites.java:55)
>    [junit4]   1>        at com.carrotsearch.randomizedtesting.rules.StatementAdapter.evaluate(StatementAdapter.java:36)
>    [junit4]   1>        at com.carrotsearch.randomizedtesting.ThreadLeakControl$StatementRunner.run(ThreadLeakControl.java:365)
>    [junit4]   1>        at java.lang.Thread.run(Thread.java:745)
>    [junit4]   1>
>    [junit4]   1> TEST: got expected fake exc:Fake OutOfMemoryError
>    [junit4]   1> java.lang.OutOfMemoryError: Fake OutOfMemoryError
>    [junit4]   1>        at org.apache.lucene.index.TestIndexWriterOutOfMemory$2.eval(TestIndexWriterOutOfMemory.java:119)
>    [junit4]   1>        at org.apache.lucene.store.MockDirectoryWrapper.maybeThrowDeterministicException(MockDirectoryWrapper.java:922)
>    [junit4]   1>        at org.apache.lucene.store.MockIndexOutputWrapper.writeBytes(MockIndexOutputWrapper.java:128)
>    [junit4]   1>        at org.apache.lucene.store.MockIndexOutputWrapper.writeByte(MockIndexOutputWrapper.java:111)
>    [junit4]   1>        at org.apache.lucene.store.DataOutput.writeVInt(DataOutput.java:196)
>    [junit4]   1>        at org.apache.lucene.codecs.lucene410.Lucene410DocValuesConsumer.addNumericField(Lucene410DocValuesConsumer.java:185)
>    [junit4]   1>        at org.apache.lucene.codecs.lucene410.Lucene410DocValuesConsumer.addSortedNumericField(Lucene410DocValuesConsumer.java:486)
>    [junit4]   1>        at org.apache.lucene.codecs.perfield.PerFieldDocValuesFormat$FieldsWriter.addSortedNumericField(PerFieldDocValuesFormat.java:122)
>    [junit4]   1>        at org.apache.lucene.index.SortedNumericDocValuesWriter.flush(SortedNumericDocValuesWriter.java:111)
>    [junit4]   1>        at org.apache.lucene.index.DefaultIndexingChain.writeDocValues(DefaultIndexingChain.java:142)
>    [junit4]   1>        at org.apache.lucene.index.DefaultIndexingChain.flush(DefaultIndexingChain.java:96)
>    [junit4]   1>        at org.apache.lucene.index.DocumentsWriterPerThread.flush(DocumentsWriterPerThread.java:442)
>    [junit4]   1>        at org.apache.lucene.index.DocumentsWriter.doFlush(DocumentsWriter.java:510)
>    [junit4]   1>        at org.apache.lucene.index.DocumentsWriter.flushAllThreads(DocumentsWriter.java:621)
>    [junit4]   1>        at org.apache.lucene.index.IndexWriter.getReader(IndexWriter.java:413)
>    [junit4]   1>        at org.apache.lucene.index.DirectoryReader.open(DirectoryReader.java:87)
>    [junit4]   1>        at org.apache.lucene.index.TestIndexWriterOutOfMemory.testBasics(TestIndexWriterOutOfMemory.java:209)
>    [junit4]   1>        at sun.reflect.NativeMethodAccessorImpl.invoke0(Native Method)
>    [junit4]   1>        at sun.reflect.NativeMethodAccessorImpl.invoke(NativeMethodAccessorImpl.java:57)
>    [junit4]   1>        at sun.reflect.DelegatingMethodAccessorImpl.invoke(DelegatingMethodAccessorImpl.java:43)
>    [junit4]   1>        at java.lang.reflect.Method.invoke(Method.java:606)
>    [junit4]   1>        at com.carrotsearch.randomizedtesting.RandomizedRunner.invoke(RandomizedRunner.java:1618)
>    [junit4]   1>        at com.carrotsearch.randomizedtesting.RandomizedRunner$6.evaluate(RandomizedRunner.java:827)
>    [junit4]   1>        at com.carrotsearch.randomizedtesting.RandomizedRunner$7.evaluate(RandomizedRunner.java:863)
>    [junit4]   1>        at com.carrotsearch.randomizedtesting.RandomizedRunner$8.evaluate(RandomizedRunner.java:877)
>    [junit4]   1>        at org.apache.lucene.util.TestRuleSetupTeardownChained$1.evaluate(TestRuleSetupTeardownChained.java:50)
>    [junit4]   1>        at org.apache.lucene.util.AbstractBeforeAfterRule$1.evaluate(AbstractBeforeAfterRule.java:46)
>    [junit4]   1>        at com.carrotsearch.randomizedtesting.rules.SystemPropertiesInvariantRule$1.evaluate(SystemPropertiesInvariantRule.java:55)
>    [junit4]   1>        at org.apache.lucene.util.TestRuleThreadAndTestName$1.evaluate(TestRuleThreadAndTestName.java:49)
>    [junit4]   1>        at org.apache.lucene.util.TestRuleIgnoreAfterMaxFailures$1.evaluate(TestRuleIgnoreAfterMaxFailures.java:65)
>    [junit4]   1>        at org.apache.lucene.util.TestRuleMarkFailure$1.evaluate(TestRuleMarkFailure.java:48)
>    [junit4]   1>        at com.carrotsearch.randomizedtesting.rules.StatementAdapter.evaluate(StatementAdapter.java:36)
>    [junit4]   1>        at com.carrotsearch.randomizedtesting.ThreadLeakControl$StatementRunner.run(ThreadLeakControl.java:365)
>    [junit4]   1>        at com.carrotsearch.randomizedtesting.ThreadLeakControl.forkTimeoutingTask(ThreadLeakControl.java:798)
>    [junit4]   1>        at com.carrotsearch.randomizedtesting.ThreadLeakControl$3.evaluate(ThreadLeakControl.java:458)
>    [junit4]   1>        at com.carrotsearch.randomizedtesting.RandomizedRunner.runSingleTest(RandomizedRunner.java:836)
>    [junit4]   1>        at com.carrotsearch.randomizedtesting.RandomizedRunner$3.evaluate(RandomizedRunner.java:738)
>    [junit4]   1>        at com.carrotsearch.randomizedtesting.RandomizedRunner$4.evaluate(RandomizedRunner.java:772)
>    [junit4]   1>        at com.carrotsearch.randomizedtesting.RandomizedRunner$5.evaluate(RandomizedRunner.java:783)
>    [junit4]   1>        at org.apache.lucene.util.AbstractBeforeAfterRule$1.evaluate(AbstractBeforeAfterRule.java:46)
>    [junit4]   1>        at org.apache.lucene.util.TestRuleStoreClassName$1.evaluate(TestRuleStoreClassName.java:42)
>    [junit4]   1>        at com.carrotsearch.randomizedtesting.rules.SystemPropertiesInvariantRule$1.evaluate(SystemPropertiesInvariantRule.java:55)
>    [junit4]   1>        at com.carrotsearch.randomizedtesting.rules.NoShadowingOrOverridesOnMethodsRule$1.evaluate(NoShadowingOrOverridesOnMethodsRule.java:39)
>    [junit4]   1>        at com.carrotsearch.randomizedtesting.rules.NoShadowingOrOverridesOnMethodsRule$1.evaluate(NoShadowingOrOverridesOnMethodsRule.java:39)
>    [junit4]   1>        at com.carrotsearch.randomizedtesting.rules.StatementAdapter.evaluate(StatementAdapter.java:36)
>    [junit4]   1>        at com.carrotsearch.randomizedtesting.rules.StatementAdapter.evaluate(StatementAdapter.java:36)
>    [junit4]   1>        at com.carrotsearch.randomizedtesting.rules.StatementAdapter.evaluate(StatementAdapter.java:36)
>    [junit4]   1>        at org.apache.lucene.util.TestRuleAssertionsRequired$1.evaluate(TestRuleAssertionsRequired.java:43)
>    [junit4]   1>        at org.apache.lucene.util.TestRuleMarkFailure$1.evaluate(TestRuleMarkFailure.java:48)
>    [junit4]   1>        at org.apache.lucene.util.TestRuleIgnoreAfterMaxFailures$1.evaluate(TestRuleIgnoreAfterMaxFailures.java:65)
>    [junit4]   1>        at org.apache.lucene.util.TestRuleIgnoreTestSuites$1.evaluate(TestRuleIgnoreTestSuites.java:55)
>    [junit4]   1>        at com.carrotsearch.randomizedtesting.rules.StatementAdapter.evaluate(StatementAdapter.java:36)
>    [junit4]   1>        at com.carrotsearch.randomizedtesting.ThreadLeakControl$StatementRunner.run(ThreadLeakControl.java:365)
>    [junit4]   1>        at java.lang.Thread.run(Thread.java:745)
>    [junit4]   1>
>    [junit4]   1> TEST: got expected fake exc:Fake OutOfMemoryError
>    [junit4]   1> java.lang.OutOfMemoryError: Fake OutOfMemoryError
>    [junit4]   1>        at org.apache.lucene.index.TestIndexWriterOutOfMemory$2.eval(TestIndexWriterOutOfMemory.java:119)
>    [junit4]   1>        at org.apache.lucene.store.MockDirectoryWrapper.maybeThrowDeterministicException(MockDirectoryWrapper.java:922)
>    [junit4]   1>        at org.apache.lucene.store.MockIndexOutputWrapper.writeBytes(MockIndexOutputWrapper.java:128)
>    [junit4]   1>        at org.apache.lucene.store.DataOutput.writeString(DataOutput.java:262)
>    [junit4]   1>        at org.apache.lucene.store.DataOutput.writeStringStringMap(DataOutput.java:302)
>    [junit4]   1>        at org.apache.lucene.codecs.lucene46.Lucene46FieldInfosWriter.write(Lucene46FieldInfosWriter.java:82)
>    [junit4]   1>        at org.apache.lucene.index.ReadersAndUpdates.writeFieldInfosGen(ReadersAndUpdates.java:454)
>    [junit4]   1>        at org.apache.lucene.index.ReadersAndUpdates.writeFieldUpdates(ReadersAndUpdates.java:516)
>    [junit4]   1>        at org.apache.lucene.index.BufferedUpdatesStream.applyDeletesAndUpdates(BufferedUpdatesStream.java:233)
>    [junit4]   1>        at org.apache.lucene.index.IndexWriter.applyAllDeletesAndUpdates(IndexWriter.java:3098)
>    [junit4]   1>        at org.apache.lucene.index.IndexWriter.maybeApplyDeletes(IndexWriter.java:3089)
>    [junit4]   1>        at org.apache.lucene.index.IndexWriter.getReader(IndexWriter.java:424)
>    [junit4]   1>        at org.apache.lucene.index.DirectoryReader.open(DirectoryReader.java:87)
>    [junit4]   1>        at org.apache.lucene.index.TestIndexWriterOutOfMemory.testBasics(TestIndexWriterOutOfMemory.java:209)
>    [junit4]   1>        at sun.reflect.NativeMethodAccessorImpl.invoke0(Native Method)
>    [junit4]   1>        at sun.reflect.NativeMethodAccessorImpl.invoke(NativeMethodAccessorImpl.java:57)
>    [junit4]   1>        at sun.reflect.DelegatingMethodAccessorImpl.invoke(DelegatingMethodAccessorImpl.java:43)
>    [junit4]   1>        at java.lang.reflect.Method.invoke(Method.java:606)
>    [junit4]   1>        at com.carrotsearch.randomizedtesting.RandomizedRunner.invoke(RandomizedRunner.java:1618)
>    [junit4]   1>        at com.carrotsearch.randomizedtesting.RandomizedRunner$6.evaluate(RandomizedRunner.java:827)
>    [junit4]   1>        at com.carrotsearch.randomizedtesting.RandomizedRunner$7.evaluate(RandomizedRunner.java:863)
>    [junit4]   1>        at com.carrotsearch.randomizedtesting.RandomizedRunner$8.evaluate(RandomizedRunner.java:877)
>    [junit4]   1>        at org.apache.lucene.util.TestRuleSetupTeardownChained$1.evaluate(TestRuleSetupTeardownChained.java:50)
>    [junit4]   1>        at org.apache.lucene.util.AbstractBeforeAfterRule$1.evaluate(AbstractBeforeAfterRule.java:46)
>    [junit4]   1>        at com.carrotsearch.randomizedtesting.rules.SystemPropertiesInvariantRule$1.evaluate(SystemPropertiesInvariantRule.java:55)
>    [junit4]   1>        at org.apache.lucene.util.TestRuleThreadAndTestName$1.evaluate(TestRuleThreadAndTestName.java:49)
>    [junit4]   1>        at org.apache.lucene.util.TestRuleIgnoreAfterMaxFailures$1.evaluate(TestRuleIgnoreAfterMaxFailures.java:65)
>    [junit4]   1>        at org.apache.lucene.util.TestRuleMarkFailure$1.evaluate(TestRuleMarkFailure.java:48)
>    [junit4]   1>        at com.carrotsearch.randomizedtesting.rules.StatementAdapter.evaluate(StatementAdapter.java:36)
>    [junit4]   1>        at com.carrotsearch.randomizedtesting.ThreadLeakControl$StatementRunner.run(ThreadLeakControl.java:365)
>    [junit4]   1>        at com.carrotsearch.randomizedtesting.ThreadLeakControl.forkTimeoutingTask(ThreadLeakControl.java:798)
>    [junit4]   1>        at com.carrotsearch.randomizedtesting.ThreadLeakControl$3.evaluate(ThreadLeakControl.java:458)
>    [junit4]   1>        at com.carrotsearch.randomizedtesting.RandomizedRunner.runSingleTest(RandomizedRunner.java:836)
>    [junit4]   1>        at com.carrotsearch.randomizedtesting.RandomizedRunner$3.evaluate(RandomizedRunner.java:738)
>    [junit4]   1>        at com.carrotsearch.randomizedtesting.RandomizedRunner$4.evaluate(RandomizedRunner.java:772)
>    [junit4]   1>        at com.carrotsearch.randomizedtesting.RandomizedRunner$5.evaluate(RandomizedRunner.java:783)
>    [junit4]   1>        at org.apache.lucene.util.AbstractBeforeAfterRule$1.evaluate(AbstractBeforeAfterRule.java:46)
>    [junit4]   1>        at org.apache.lucene.util.TestRuleStoreClassName$1.evaluate(TestRuleStoreClassName.java:42)
>    [junit4]   1>        at com.carrotsearch.randomizedtesting.rules.SystemPropertiesInvariantRule$1.evaluate(SystemPropertiesInvariantRule.java:55)
>    [junit4]   1>        at com.carrotsearch.randomizedtesting.rules.NoShadowingOrOverridesOnMethodsRule$1.evaluate(NoShadowingOrOverridesOnMethodsRule.java:39)
>    [junit4]   1>        at com.carrotsearch.randomizedtesting.rules.NoShadowingOrOverridesOnMethodsRule$1.evaluate(NoShadowingOrOverridesOnMethodsRule.java:39)
>    [junit4]   1>        at com.carrotsearch.randomizedtesting.rules.StatementAdapter.evaluate(StatementAdapter.java:36)
>    [junit4]   1>        at com.carrotsearch.randomizedtesting.rules.StatementAdapter.evaluate(StatementAdapter.java:36)
>    [junit4]   1>        at com.carrotsearch.randomizedtesting.rules.StatementAdapter.evaluate(StatementAdapter.java:36)
>    [junit4]   1>        at org.apache.lucene.util.TestRuleAssertionsRequired$1.evaluate(TestRuleAssertionsRequired.java:43)
>    [junit4]   1>        at org.apache.lucene.util.TestRuleMarkFailure$1.evaluate(TestRuleMarkFailure.java:48)
>    [junit4]   1>        at org.apache.lucene.util.TestRuleIgnoreAfterMaxFailures$1.evaluate(TestRuleIgnoreAfterMaxFailures.java:65)
>    [junit4]   1>        at org.apache.lucene.util.TestRuleIgnoreTestSuites$1.evaluate(TestRuleIgnoreTestSuites.java:55)
>    [junit4]   1>        at com.carrotsearch.randomizedtesting.rules.StatementAdapter.evaluate(StatementAdapter.java:36)
>    [junit4]   1>        at com.carrotsearch.randomizedtesting.ThreadLeakControl$StatementRunner.run(ThreadLeakControl.java:365)
>    [junit4]   1>        at java.lang.Thread.run(Thread.java:745)
>    [junit4]   1>
>    [junit4]   1> TEST: got expected fake exc:Fake OutOfMemoryError
>    [junit4]   1> java.lang.OutOfMemoryError: Fake OutOfMemoryError
>    [junit4]   1>        at org.apache.lucene.index.TestIndexWriterOutOfMemory$2.eval(TestIndexWriterOutOfMemory.java:119)
>    [junit4]   1>        at org.apache.lucene.store.MockDirectoryWrapper.maybeThrowDeterministicException(MockDirectoryWrapper.java:922)
>    [junit4]   1>        at org.apache.lucene.store.MockIndexOutputWrapper.writeBytes(MockIndexOutputWrapper.java:128)
>    [junit4]   1>        at org.apache.lucene.store.MockIndexOutputWrapper.writeByte(MockIndexOutputWrapper.java:111)
>    [junit4]   1>        at org.apache.lucene.store.DataOutput.writeInt(DataOutput.java:71)
>    [junit4]   1>        at org.apache.lucene.store.DataOutput.writeLong(DataOutput.java:218)
>    [junit4]   1>        at org.apache.lucene.codecs.lucene410.Lucene410DocValuesConsumer.addNumericField(Lucene410DocValuesConsumer.java:190)
>    [junit4]   1>        at org.apache.lucene.codecs.lucene410.Lucene410DocValuesConsumer.addSortedNumericField(Lucene410DocValuesConsumer.java:486)
>    [junit4]   1>        at org.apache.lucene.codecs.perfield.PerFieldDocValuesFormat$FieldsWriter.addSortedNumericField(PerFieldDocValuesFormat.java:122)
>    [junit4]   1>        at org.apache.lucene.index.SortedNumericDocValuesWriter.flush(SortedNumericDocValuesWriter.java:111)
>    [junit4]   1>        at org.apache.lucene.index.DefaultIndexingChain.writeDocValues(DefaultIndexingChain.java:142)
>    [junit4]   1>        at org.apache.lucene.index.DefaultIndexingChain.flush(DefaultIndexingChain.java:96)
>    [junit4]   1>        at org.apache.lucene.index.DocumentsWriterPerThread.flush(DocumentsWriterPerThread.java:442)
>    [junit4]   1>        at org.apache.lucene.index.DocumentsWriter.doFlush(DocumentsWriter.java:510)
>    [junit4]   1>        at org.apache.lucene.index.DocumentsWriter.flushAllThreads(DocumentsWriter.java:621)
>    [junit4]   1>        at org.apache.lucene.index.IndexWriter.getReader(IndexWriter.java:413)
>    [junit4]   1>        at org.apache.lucene.index.DirectoryReader.open(DirectoryReader.java:87)
>    [junit4]   1>        at org.apache.lucene.index.TestIndexWriterOutOfMemory.testBasics(TestIndexWriterOutOfMemory.java:209)
>    [junit4]   1>        at sun.reflect.NativeMethodAccessorImpl.invoke0(Native Method)
>    [junit4]   1>        at sun.reflect.NativeMethodAccessorImpl.invoke(NativeMethodAccessorImpl.java:57)
>    [junit4]   1>        at sun.reflect.DelegatingMethodAccessorImpl.invoke(DelegatingMethodAccessorImpl.java:43)
>    [junit4]   1>        at java.lang.reflect.Method.invoke(Method.java:606)
>    [junit4]   1>        at com.carrotsearch.randomizedtesting.RandomizedRunner.invoke(RandomizedRunner.java:1618)
>    [junit4]   1>        at com.carrotsearch.randomizedtesting.RandomizedRunner$6.evaluate(RandomizedRunner.java:827)
>    [junit4]   1>        at com.carrotsearch.randomizedtesting.RandomizedRunner$7.evaluate(RandomizedRunner.java:863)
>    [junit4]   1>        at com.carrotsearch.randomizedtesting.RandomizedRunner$8.evaluate(RandomizedRunner.java:877)
>    [junit4]   1>        at org.apache.lucene.util.TestRuleSetupTeardownChained$1.evaluate(TestRuleSetupTeardownChained.java:50)
>    [junit4]   1>        at org.apache.lucene.util.AbstractBeforeAfterRule$1.evaluate(AbstractBeforeAfterRule.java:46)
>    [junit4]   1>        at com.carrotsearch.randomizedtesting.rules.SystemPropertiesInvariantRule$1.evaluate(SystemPropertiesInvariantRule.java:55)
>    [junit4]   1>        at org.apache.lucene.util.TestRuleThreadAndTestName$1.evaluate(TestRuleThreadAndTestName.java:49)
>    [junit4]   1>        at org.apache.lucene.util.TestRuleIgnoreAfterMaxFailures$1.evaluate(TestRuleIgnoreAfterMaxFailures.java:65)
>    [junit4]   1>        at org.apache.lucene.util.TestRuleMarkFailure$1.evaluate(TestRuleMarkFailure.java:48)
>    [junit4]   1>        at com.carrotsearch.randomizedtesting.rules.StatementAdapter.evaluate(StatementAdapter.java:36)
>    [junit4]   1>        at com.carrotsearch.randomizedtesting.ThreadLeakControl$StatementRunner.run(ThreadLeakControl.java:365)
>    [junit4]   1>        at com.carrotsearch.randomizedtesting.ThreadLeakControl.forkTimeoutingTask(ThreadLeakControl.java:798)
>    [junit4]   1>        at com.carrotsearch.randomizedtesting.ThreadLeakControl$3.evaluate(ThreadLeakControl.java:458)
>    [junit4]   1>        at com.carrotsearch.randomizedtesting.RandomizedRunner.runSingleTest(RandomizedRunner.java:836)
>    [junit4]   1>        at com.carrotsearch.randomizedtesting.RandomizedRunner$3.evaluate(RandomizedRunner.java:738)
>    [junit4]   1>        at com.carrotsearch.randomizedtesting.RandomizedRunner$4.evaluate(RandomizedRunner.java:772)
>    [junit4]   1>        at com.carrotsearch.randomizedtesting.RandomizedRunner$5.evaluate(RandomizedRunner.java:783)
>    [junit4]   1>        at org.apache.lucene.util.AbstractBeforeAfterRule$1.evaluate(AbstractBeforeAfterRule.java:46)
>    [junit4]   1>        at org.apache.lucene.util.TestRuleStoreClassName$1.evaluate(TestRuleStoreClassName.java:42)
>    [junit4]   1>        at com.carrotsearch.randomizedtesting.rules.SystemPropertiesInvariantRule$1.evaluate(SystemPropertiesInvariantRule.java:55)
>    [junit4]   1>        at com.carrotsearch.randomizedtesting.rules.NoShadowingOrOverridesOnMethodsRule$1.evaluate(NoShadowingOrOverridesOnMethodsRule.java:39)
>    [junit4]   1>        at com.carrotsearch.randomizedtesting.rules.NoShadowingOrOverridesOnMethodsRule$1.evaluate(NoShadowingOrOverridesOnMethodsRule.java:39)
>    [junit4]   1>        at com.carrotsearch.randomizedtesting.rules.StatementAdapter.evaluate(StatementAdapter.java:36)
>    [junit4]   1>        at com.carrotsearch.randomizedtesting.rules.StatementAdapter.evaluate(StatementAdapter.java:36)
>    [junit4]   1>        at com.carrotsearch.randomizedtesting.rules.StatementAdapter.evaluate(StatementAdapter.java:36)
>    [junit4]   1>        at org.apache.lucene.util.TestRuleAssertionsRequired$1.evaluate(TestRuleAssertionsRequired.java:43)
>    [junit4]   1>        at org.apache.lucene.util.TestRuleMarkFailure$1.evaluate(TestRuleMarkFailure.java:48)
>    [junit4]   1>        at org.apache.lucene.util.TestRuleIgnoreAfterMaxFailures$1.evaluate(TestRuleIgnoreAfterMaxFailures.java:65)
>    [junit4]   1>        at org.apache.lucene.util.TestRuleIgnoreTestSuites$1.evaluate(TestRuleIgnoreTestSuites.java:55)
>    [junit4]   1>        at com.carrotsearch.randomizedtesting.rules.StatementAdapter.evaluate(StatementAdapter.java:36)
>    [junit4]   1>        at com.carrotsearch.randomizedtesting.ThreadLeakControl$StatementRunner.run(ThreadLeakControl.java:365)
>    [junit4]   1>        at java.lang.Thread.run(Thread.java:745)
>    [junit4]   1>
>    [junit4]   1> TEST: got expected fake exc:Fake OutOfMemoryError
>    [junit4]   1> java.lang.OutOfMemoryError: Fake OutOfMemoryError
>    [junit4]   1>        at org.apache.lucene.index.TestIndexWriterOutOfMemory$2.eval(TestIndexWriterOutOfMemory.java:119)
>    [junit4]   1>        at org.apache.lucene.store.MockDirectoryWrapper.maybeThrowDeterministicException(MockDirectoryWrapper.java:922)
>    [junit4]   1>        at org.apache.lucene.store.MockIndexOutputWrapper.writeBytes(MockIndexOutputWrapper.java:128)
>    [junit4]   1>        at org.apache.lucene.store.MockIndexOutputWrapper.writeByte(MockIndexOutputWrapper.java:111)
>    [junit4]   1>        at org.apache.lucene.store.DataOutput.writeInt(DataOutput.java:74)
>    [junit4]   1>        at org.apache.lucene.store.DataOutput.writeLong(DataOutput.java:218)
>    [junit4]   1>        at org.apache.lucene.codecs.lucene410.Lucene410DocValuesConsumer.addNumericField(Lucene410DocValuesConsumer.java:192)
>    [junit4]   1>        at org.apache.lucene.codecs.lucene410.Lucene410DocValuesConsumer.addNumericField(Lucene410DocValuesConsumer.java:111)
>    [junit4]   1>        at org.apache.lucene.codecs.perfield.PerFieldDocValuesFormat$FieldsWriter.addNumericField(PerFieldDocValuesFormat.java:107)
>    [junit4]   1>        at org.apache.lucene.index.ReadersAndUpdates.handleNumericDVUpdates(ReadersAndUpdates.java:317)
>    [junit4]   1>        at org.apache.lucene.index.ReadersAndUpdates.writeFieldUpdates(ReadersAndUpdates.java:510)
>    [junit4]   1>        at org.apache.lucene.index.BufferedUpdatesStream.applyDeletesAndUpdates(BufferedUpdatesStream.java:233)
>    [junit4]   1>        at org.apache.lucene.index.IndexWriter.applyAllDeletesAndUpdates(IndexWriter.java:3098)
>    [junit4]   1>        at org.apache.lucene.index.IndexWriter.maybeApplyDeletes(IndexWriter.java:3089)
>    [junit4]   1>        at org.apache.lucene.index.IndexWriter.getReader(IndexWriter.java:424)
>    [junit4]   1>        at org.apache.lucene.index.DirectoryReader.open(DirectoryReader.java:87)
>    [junit4]   1>        at org.apache.lucene.index.TestIndexWriterOutOfMemory.testBasics(TestIndexWriterOutOfMemory.java:209)
>    [junit4]   1>        at sun.reflect.NativeMethodAccessorImpl.invoke0(Native Method)
>    [junit4]   1>        at sun.reflect.NativeMethodAccessorImpl.invoke(NativeMethodAccessorImpl.java:57)
>    [junit4]   1>        at sun.reflect.DelegatingMethodAccessorImpl.invoke(DelegatingMethodAccessorImpl.java:43)
>    [junit4]   1>        at java.lang.reflect.Method.invoke(Method.java:606)
>    [junit4]   1>        at com.carrotsearch.randomizedtesting.RandomizedRunner.invoke(RandomizedRunner.java:1618)
>    [junit4]   1>        at com.carrotsearch.randomizedtesting.RandomizedRunner$6.evaluate(RandomizedRunner.java:827)
>    [junit4]   1>        at com.carrotsearch.randomizedtesting.RandomizedRunner$7.evaluate(RandomizedRunner.java:863)
>    [junit4]   1>        at com.carrotsearch.randomizedtesting.RandomizedRunner$8.evaluate(RandomizedRunner.java:877)
>    [junit4]   1>        at org.apache.lucene.util.TestRuleSetupTeardownChained$1.evaluate(TestRuleSetupTeardownChained.java:50)
>    [junit4]   1>        at org.apache.lucene.util.AbstractBeforeAfterRule$1.evaluate(AbstractBeforeAfterRule.java:46)
>    [junit4]   1>        at com.carrotsearch.randomizedtesting.rules.SystemPropertiesInvariantRule$1.evaluate(SystemPropertiesInvariantRule.java:55)
>    [junit4]   1>        at org.apache.lucene.util.TestRuleThreadAndTestName$1.evaluate(TestRuleThreadAndTestName.java:49)
>    [junit4]   1>        at org.apache.lucene.util.TestRuleIgnoreAfterMaxFailures$1.evaluate(TestRuleIgnoreAfterMaxFailures.java:65)
>    [junit4]   1>        at org.apache.lucene.util.TestRuleMarkFailure$1.evaluate(TestRuleMarkFailure.java:48)
>    [junit4]   1>        at com.carrotsearch.randomizedtesting.rules.StatementAdapter.evaluate(StatementAdapter.java:36)
>    [junit4]   1>        at com.carrotsearch.randomizedtesting.ThreadLeakControl$StatementRunner.run(ThreadLeakControl.java:365)
>    [junit4]   1>        at com.carrotsearch.randomizedtesting.ThreadLeakControl.forkTimeoutingTask(ThreadLeakControl.java:798)
>    [junit4]   1>        at com.carrotsearch.randomizedtesting.ThreadLeakControl$3.evaluate(ThreadLeakControl.java:458)
>    [junit4]   1>        at com.carrotsearch.randomizedtesting.RandomizedRunner.runSingleTest(RandomizedRunner.java:836)
>    [junit4]   1>        at com.carrotsearch.randomizedtesting.RandomizedRunner$3.evaluate(RandomizedRunner.java:738)
>    [junit4]   1>        at com.carrotsearch.randomizedtesting.RandomizedRunner$4.evaluate(RandomizedRunner.java:772)
>    [junit4]   1>        at com.carrotsearch.randomizedtesting.RandomizedRunner$5.evaluate(RandomizedRunner.java:783)
>    [junit4]   1>        at org.apache.lucene.util.AbstractBeforeAfterRule$1.evaluate(AbstractBeforeAfterRule.java:46)
>    [junit4]   1>        at org.apache.lucene.util.TestRuleStoreClassName$1.evaluate(TestRuleStoreClassName.java:42)
>    [junit4]   1>        at com.carrotsearch.randomizedtesting.rules.SystemPropertiesInvariantRule$1.evaluate(SystemPropertiesInvariantRule.java:55)
>    [junit4]   1>        at com.carrotsearch.randomizedtesting.rules.NoShadowingOrOverridesOnMethodsRule$1.evaluate(NoShadowingOrOverridesOnMethodsRule.java:39)
>    [junit4]   1>        at com.carrotsearch.randomizedtesting.rules.NoShadowingOrOverridesOnMethodsRule$1.evaluate(NoShadowingOrOverridesOnMethodsRule.java:39)
>    [junit4]   1>        at com.carrotsearch.randomizedtesting.rules.StatementAdapter.evaluate(StatementAdapter.java:36)
>    [junit4]   1>        at com.carrotsearch.randomizedtesting.rules.StatementAdapter.evaluate(StatementAdapter.java:36)
>    [junit4]   1>        at com.carrotsearch.randomizedtesting.rules.StatementAdapter.evaluate(StatementAdapter.java:36)
>    [junit4]   1>        at org.apache.lucene.util.TestRuleAssertionsRequired$1.evaluate(TestRuleAssertionsRequired.java:43)
>    [junit4]   1>        at org.apache.lucene.util.TestRuleMarkFailure$1.evaluate(TestRuleMarkFailure.java:48)
>    [junit4]   1>        at org.apache.lucene.util.TestRuleIgnoreAfterMaxFailures$1.evaluate(TestRuleIgnoreAfterMaxFailures.java:65)
>    [junit4]   1>        at org.apache.lucene.util.TestRuleIgnoreTestSuites$1.evaluate(TestRuleIgnoreTestSuites.java:55)
>    [junit4]   1>        at com.carrotsearch.randomizedtesting.rules.StatementAdapter.evaluate(StatementAdapter.java:36)
>    [junit4]   1>        at com.carrotsearch.randomizedtesting.ThreadLeakControl$StatementRunner.run(ThreadLeakControl.java:365)
>    [junit4]   1>        at java.lang.Thread.run(Thread.java:745)
>    [junit4]   1>
>    [junit4]   1> TEST: got expected fake exc:Fake OutOfMemoryError
>    [junit4]   1> java.lang.OutOfMemoryError: Fake OutOfMemoryError
>    [junit4]   1>        at org.apache.lucene.index.TestIndexWriterOutOfMemory$2.eval(TestIndexWriterOutOfMemory.java:119)
>    [junit4]   1>        at org.apache.lucene.store.MockDirectoryWrapper.maybeThrowDeterministicException(MockDirectoryWrapper.java:922)
>    [junit4]   1>        at org.apache.lucene.store.MockIndexOutputWrapper.writeBytes(MockIndexOutputWrapper.java:128)
>    [junit4]   1>        at org.apache.lucene.store.MockIndexOutputWrapper.writeByte(MockIndexOutputWrapper.java:111)
>    [junit4]   1>        at org.apache.lucene.store.DataOutput.writeInt(DataOutput.java:74)
>    [junit4]   1>        at org.apache.lucene.store.DataOutput.writeLong(DataOutput.java:218)
>    [junit4]   1>        at org.apache.lucene.codecs.lucene49.Lucene49NormsConsumer.addNormsField(Lucene49NormsConsumer.java:138)
>    [junit4]   1>        at org.apache.lucene.index.NormValuesWriter.flush(NormValuesWriter.java:72)
>    [junit4]   1>        at org.apache.lucene.index.DefaultIndexingChain.writeNorms(DefaultIndexingChain.java:191)
>    [junit4]   1>        at org.apache.lucene.index.DefaultIndexingChain.flush(DefaultIndexingChain.java:95)
>    [junit4]   1>        at org.apache.lucene.index.DocumentsWriterPerThread.flush(DocumentsWriterPerThread.java:442)
>    [junit4]   1>        at org.apache.lucene.index.DocumentsWriter.doFlush(DocumentsWriter.java:510)
>    [junit4]   1>        at org.apache.lucene.index.DocumentsWriter.flushAllThreads(DocumentsWriter.java:621)
>    [junit4]   1>        at org.apache.lucene.index.IndexWriter.prepareCommitInternal(IndexWriter.java:2793)
>    [junit4]   1>        at org.apache.lucene.index.IndexWriter.commitInternal(IndexWriter.java:2952)
>    [junit4]   1>        at org.apache.lucene.index.IndexWriter.commit(IndexWriter.java:2919)
>    [junit4]   1>        at org.apache.lucene.index.TestIndexWriterOutOfMemory.testBasics(TestIndexWriterOutOfMemory.java:215)
>    [junit4]   1>        at sun.reflect.NativeMethodAccessorImpl.invoke0(Native Method)
>    [junit4]   1>        at sun.reflect.NativeMethodAccessorImpl.invoke(NativeMethodAccessorImpl.java:57)
>    [junit4]   1>        at sun.reflect.DelegatingMethodAccessorImpl.invoke(DelegatingMethodAccessorImpl.java:43)
>    [junit4]   1>        at java.lang.reflect.Method.invoke(Method.java:606)
>    [junit4]   1>        at com.carrotsearch.randomizedtesting.RandomizedRunner.invoke(RandomizedRunner.java:1618)
>    [junit4]   1>        at com.carrotsearch.randomizedtesting.RandomizedRunner$6.evaluate(RandomizedRunner.java:827)
>    [junit4]   1>        at com.carrotsearch.randomizedtesting.RandomizedRunner$7.evaluate(RandomizedRunner.java:863)
>    [junit4]   1>        at com.carrotsearch.randomizedtesting.RandomizedRunner$8.evaluate(RandomizedRunner.java:877)
>    [junit4]   1>        at org.apache.lucene.util.TestRuleSetupTeardownChained$1.evaluate(TestRuleSetupTeardownChained.java:50)
>    [junit4]   1>        at org.apache.lucene.util.AbstractBeforeAfterRule$1.evaluate(AbstractBeforeAfterRule.java:46)
>    [junit4]   1>        at com.carrotsearch.randomizedtesting.rules.SystemPropertiesInvariantRule$1.evaluate(SystemPropertiesInvariantRule.java:55)
>    [junit4]   1>        at org.apache.lucene.util.TestRuleThreadAndTestName$1.evaluate(TestRuleThreadAndTestName.java:49)
>    [junit4]   1>        at org.apache.lucene.util.TestRuleIgnoreAfterMaxFailures$1.evaluate(TestRuleIgnoreAfterMaxFailures.java:65)
>    [junit4]   1>        at org.apache.lucene.util.TestRuleMarkFailure$1.evaluate(TestRuleMarkFailure.java:48)
>    [junit4]   1>        at com.carrotsearch.randomizedtesting.rules.StatementAdapter.evaluate(StatementAdapter.java:36)
>    [junit4]   1>        at com.carrotsearch.randomizedtesting.ThreadLeakControl$StatementRunner.run(ThreadLeakControl.java:365)
>    [junit4]   1>        at com.carrotsearch.randomizedtesting.ThreadLeakControl.forkTimeoutingTask(ThreadLeakControl.java:798)
>    [junit4]   1>        at com.carrotsearch.randomizedtesting.ThreadLeakControl$3.evaluate(ThreadLeakControl.java:458)
>    [junit4]   1>        at com.carrotsearch.randomizedtesting.RandomizedRunner.runSingleTest(RandomizedRunner.java:836)
>    [junit4]   1>        at com.carrotsearch.randomizedtesting.RandomizedRunner$3.evaluate(RandomizedRunner.java:738)
>    [junit4]   1>        at com.carrotsearch.randomizedtesting.RandomizedRunner$4.evaluate(RandomizedRunner.java:772)
>    [junit4]   1>        at com.carrotsearch.randomizedtesting.RandomizedRunner$5.evaluate(RandomizedRunner.java:783)
>    [junit4]   1>        at org.apache.lucene.util.AbstractBeforeAfterRule$1.evaluate(AbstractBeforeAfterRule.java:46)
>    [junit4]   1>        at org.apache.lucene.util.TestRuleStoreClassName$1.evaluate(TestRuleStoreClassName.java:42)
>    [junit4]   1>        at com.carrotsearch.randomizedtesting.rules.SystemPropertiesInvariantRule$1.evaluate(SystemPropertiesInvariantRule.java:55)
>    [junit4]   1>        at com.carrotsearch.randomizedtesting.rules.NoShadowingOrOverridesOnMethodsRule$1.evaluate(NoShadowingOrOverridesOnMethodsRule.java:39)
>    [junit4]   1>        at com.carrotsearch.randomizedtesting.rules.NoShadowingOrOverridesOnMethodsRule$1.evaluate(NoShadowingOrOverridesOnMethodsRule.java:39)
>    [junit4]   1>        at com.carrotsearch.randomizedtesting.rules.StatementAdapter.eva
>
> [...truncated too long message...]
>
> va:1618)
>    [junit4]   1>        at com.carrotsearch.randomizedtesting.RandomizedRunner$6.evaluate(RandomizedRunner.java:827)
>    [junit4]   1>        at com.carrotsearch.randomizedtesting.RandomizedRunner$7.evaluate(RandomizedRunner.java:863)
>    [junit4]   1>        at com.carrotsearch.randomizedtesting.RandomizedRunner$8.evaluate(RandomizedRunner.java:877)
>    [junit4]   1>        at org.apache.lucene.util.TestRuleSetupTeardownChained$1.evaluate(TestRuleSetupTeardownChained.java:50)
>    [junit4]   1>        at org.apache.lucene.util.AbstractBeforeAfterRule$1.evaluate(AbstractBeforeAfterRule.java:46)
>    [junit4]   1>        at com.carrotsearch.randomizedtesting.rules.SystemPropertiesInvariantRule$1.evaluate(SystemPropertiesInvariantRule.java:55)
>    [junit4]   1>        at org.apache.lucene.util.TestRuleThreadAndTestName$1.evaluate(TestRuleThreadAndTestName.java:49)
>    [junit4]   1>        at org.apache.lucene.util.TestRuleIgnoreAfterMaxFailures$1.evaluate(TestRuleIgnoreAfterMaxFailures.java:65)
>    [junit4]   1>        at org.apache.lucene.util.TestRuleMarkFailure$1.evaluate(TestRuleMarkFailure.java:48)
>    [junit4]   1>        at com.carrotsearch.randomizedtesting.rules.StatementAdapter.evaluate(StatementAdapter.java:36)
>    [junit4]   1>        at com.carrotsearch.randomizedtesting.ThreadLeakControl$StatementRunner.run(ThreadLeakControl.java:365)
>    [junit4]   1>        at com.carrotsearch.randomizedtesting.ThreadLeakControl.forkTimeoutingTask(ThreadLeakControl.java:798)
>    [junit4]   1>        at com.carrotsearch.randomizedtesting.ThreadLeakControl$3.evaluate(ThreadLeakControl.java:458)
>    [junit4]   1>        at com.carrotsearch.randomizedtesting.RandomizedRunner.runSingleTest(RandomizedRunner.java:836)
>    [junit4]   1>        at com.carrotsearch.randomizedtesting.RandomizedRunner$3.evaluate(RandomizedRunner.java:738)
>    [junit4]   1>        at com.carrotsearch.randomizedtesting.RandomizedRunner$4.evaluate(RandomizedRunner.java:772)
>    [junit4]   1>        at com.carrotsearch.randomizedtesting.RandomizedRunner$5.evaluate(RandomizedRunner.java:783)
>    [junit4]   1>        at org.apache.lucene.util.AbstractBeforeAfterRule$1.evaluate(AbstractBeforeAfterRule.java:46)
>    [junit4]   1>        at org.apache.lucene.util.TestRuleStoreClassName$1.evaluate(TestRuleStoreClassName.java:42)
>    [junit4]   1>        at com.carrotsearch.randomizedtesting.rules.SystemPropertiesInvariantRule$1.evaluate(SystemPropertiesInvariantRule.java:55)
>    [junit4]   1>        at com.carrotsearch.randomizedtesting.rules.NoShadowingOrOverridesOnMethodsRule$1.evaluate(NoShadowingOrOverridesOnMethodsRule.java:39)
>    [junit4]   1>        at com.carrotsearch.randomizedtesting.rules.NoShadowingOrOverridesOnMethodsRule$1.evaluate(NoShadowingOrOverridesOnMethodsRule.java:39)
>    [junit4]   1>        at com.carrotsearch.randomizedtesting.rules.StatementAdapter.evaluate(StatementAdapter.java:36)
>    [junit4]   1>        at com.carrotsearch.randomizedtesting.rules.StatementAdapter.evaluate(StatementAdapter.java:36)
>    [junit4]   1>        at com.carrotsearch.randomizedtesting.rules.StatementAdapter.evaluate(StatementAdapter.java:36)
>    [junit4]   1>        at org.apache.lucene.util.TestRuleAssertionsRequired$1.evaluate(TestRuleAssertionsRequired.java:43)
>    [junit4]   1>        at org.apache.lucene.util.TestRuleMarkFailure$1.evaluate(TestRuleMarkFailure.java:48)
>    [junit4]   1>        at org.apache.lucene.util.TestRuleIgnoreAfterMaxFailures$1.evaluate(TestRuleIgnoreAfterMaxFailures.java:65)
>    [junit4]   1>        at org.apache.lucene.util.TestRuleIgnoreTestSuites$1.evaluate(TestRuleIgnoreTestSuites.java:55)
>    [junit4]   1>        at com.carrotsearch.randomizedtesting.rules.StatementAdapter.evaluate(StatementAdapter.java:36)
>    [junit4]   1>        at com.carrotsearch.randomizedtesting.ThreadLeakControl$StatementRunner.run(ThreadLeakControl.java:365)
>    [junit4]   1>        at java.lang.Thread.run(Thread.java:745)
>    [junit4]   1>
>    [junit4]   2> NOTE: download the large Jenkins line-docs file by running 'ant get-jenkins-line-docs' in the lucene directory.
>    [junit4]   2> NOTE: reproduce with: ant test  -Dtestcase=TestIndexWriterOutOfMemory -Dtests.method=testBasics -Dtests.seed=C4C9D7B4B9D5D290 -Dtests.multiplier=2 -Dtests.nightly=true -Dtests.slow=true -Dtests.linedocsfile=/home/jenkins/lucene-data/enwiki.random.lines.txt -Dtests.locale=mk_MK -Dtests.timezone=America/Vancouver -Dtests.file.encoding=ISO-8859-1
>    [junit4] FAILURE  451s J2 | TestIndexWriterOutOfMemory.testBasics <<<
>    [junit4]    > Throwable #1: java.lang.AssertionError: TEST-TestIndexWriterOutOfMemory.testBasics-seed#[C4C9D7B4B9D5D290]: RefCount is 0 pre-decrement for file "_2_2_Lucene410_0.dvd"
>    [junit4]    >        at __randomizedtesting.SeedInfo.seed([C4C9D7B4B9D5D290:F9117998813B8CE0]:0)
>    [junit4]    >        at org.apache.lucene.index.IndexFileDeleter$RefCount.DecRef(IndexFileDeleter.java:725)
>    [junit4]    >        at org.apache.lucene.index.IndexFileDeleter.decRef(IndexFileDeleter.java:611)
>    [junit4]    >        at org.apache.lucene.index.IndexFileDeleter.decRef(IndexFileDeleter.java:599)
>    [junit4]    >        at org.apache.lucene.index.IndexWriter.prepareCommitInternal(IndexWriter.java:2851)
>    [junit4]    >        at org.apache.lucene.index.IndexWriter.commitInternal(IndexWriter.java:2952)
>    [junit4]    >        at org.apache.lucene.index.IndexWriter.commit(IndexWriter.java:2919)
>    [junit4]    >        at org.apache.lucene.index.TestIndexWriterOutOfMemory.testBasics(TestIndexWriterOutOfMemory.java:215)
>    [junit4]    >        at java.lang.Thread.run(Thread.java:745)
>    [junit4]   2> NOTE: leaving temporary files on disk at: /usr/home/jenkins/jenkins-slave/workspace/Lucene-Solr-NightlyTests-trunk/lucene/build/core/test/J2/./temp/lucene.index.TestIndexWriterOutOfMemory-C4C9D7B4B9D5D290-001
>    [junit4]   2> NOTE: test params are: codec=FastDecompressionCompressingStoredFields(storedFieldsFormat=CompressingStoredFieldsFormat(compressionMode=FAST_DECOMPRESSION, chunkSize=72), termVectorsFormat=CompressingTermVectorsFormat(compressionMode=FAST_DECOMPRESSION, chunkSize=72)), sim=RandomSimilarityProvider(queryNorm=true,coord=no): {text_payloads=DFR I(ne)L1, text1=IB SPL-L2, text_vectors=IB SPL-DZ(0.3)}, locale=mk_MK, timezone=America/Vancouver
>    [junit4]   2> NOTE: FreeBSD 9.1-RELEASE-p3 amd64/Oracle Corporation 1.7.0_65 (64-bit)/cpus=16,threads=1,free=139188712,total=511180800
>    [junit4]   2> NOTE: All tests run in this JVM: [TestUniqueTermCount, TestDocument, TestFastDecompressionMode, TestTimSorter, TestIndexWriterUnicode, TestConsistentFieldNumbers, TestQueryRescorer, TestFilterDirectory, TestLucene45DocValuesFormat, TestDirectoryReaderReopen, TestMultiLevelSkipList, Test2BPostingsBytes, TestFixedBitSet, TestFilteredQuery, TestStressAdvance, TestDocTermOrdsRangeFilter, TestPerFieldPostingsFormat, TestBlockPostingsFormat3, TestStringHelper, TestIntroSorter, TestFieldMaskingSpanQuery, TestMinShouldMatch2, TestIsCurrent, TestNIOFSDirectory, TestBlockPostingsFormat2, Test2BBinaryDocValues, Test2BPagedBytes, TestBagOfPostings, TestBytesRefHash, MultiCollectorTest, TestAssertions, TestBooleanQueryVisitSubscorers, TestDocumentsWriterDeleteQueue, TestPositiveScoresOnlyCollector, TestFilterAtomicReader, TestBitVector, TestTermVectors, TestGraphTokenizers, TestFilterIterator, TestNumericRangeQuery64, TestBooleanScorer, TestNumericUtils, TestCompressingTermVectorsFormat, TestFastCompressionMode, TestFieldsReader, TestElevationComparator, TestOperations, TestPerFieldPostingsFormat2, TestCustomNorms, TestDocCount, TestHighCompressionMode, TestIndexWriter, TestPerFieldDocValuesFormat, TestDocValuesFormat, TestIndexWriterReader, TestBytesStore, TestLucene42DocValuesFormat, TestSearcherManager, TestRegexpRandom2, TestSegmentReader, TestParallelCompositeReader, TestFieldCacheRewriteMethod, TestMultiThreadTermVectors, TestBlockPostingsFormat, TestSort, TestCustomSearcherSort, TestPostingsFormat, TestDeterminizeLexicon, TestMixedCodecs, TestSpanExplanations, Nested, Nested2, TestStressIndexing2, TestMultiPhraseQuery, TestLazyProxSkipping, TestTermVectorsWriter, TestCodecs, TestThreadedForceMerge, TestNearSpansOrdered, TestMultiFields, TestSpanSearchEquivalence, TestSegmentTermEnum, TestBooleanQuery, TestSortRandom, TestFileSwitchDirectory, TestNamedSPILoader, TestDemo, TestFieldInfos, TestExplanations, TestReaderClosed, TestNGramPhraseQuery, Nested1, TestIndexCommit, Test2BNumericDocValues, TestLucene40StoredFieldsFormat, TestFieldType, TestAllFilesHaveChecksumFooter, TestDocInverterPerFieldErrorInfo, TestIndexReaderClose, TestIndexWriterMaxDocs, TestIndexWriterOutOfMemory]
>    [junit4] Completed on J2 in 450.87s, 1 test, 1 failure <<< FAILURES!
>
> [...truncated 17 lines...]
> BUILD FAILED
> /usr/home/jenkins/jenkins-slave/workspace/Lucene-Solr-NightlyTests-trunk/build.xml:499: The following error occurred while executing this line:
> /usr/home/jenkins/jenkins-slave/workspace/Lucene-Solr-NightlyTests-trunk/build.xml:472: The following error occurred while executing this line:
> /usr/home/jenkins/jenkins-slave/workspace/Lucene-Solr-NightlyTests-trunk/build.xml:60: The following error occurred while executing this line:
> /usr/home/jenkins/jenkins-slave/workspace/Lucene-Solr-NightlyTests-trunk/extra-targets.xml:39: The following error occurred while executing this line:
> /usr/home/jenkins/jenkins-slave/workspace/Lucene-Solr-NightlyTests-trunk/lucene/build.xml:49: The following error occurred while executing this line:
> /usr/home/jenkins/jenkins-slave/workspace/Lucene-Solr-NightlyTests-trunk/lucene/common-build.xml:1343: The following error occurred while executing this line:
> /usr/home/jenkins/jenkins-slave/workspace/Lucene-Solr-NightlyTests-trunk/lucene/common-build.xml:958: There were test failures: 406 suites, 3534 tests, 1 failure, 102 ignored (91 assumptions)
>
> Total time: 41 minutes 53 seconds
> Build step 'Invoke Ant' marked build as failure
> Archiving artifacts
> Sending artifact delta relative to Lucene-Solr-NightlyTests-trunk #605
> Archived 5 artifacts
> Archive block size is 32768
> Received 0 blocks and 11681707 bytes
> Compression is 0.0%
> Took 3 sec
> Recording test results
> Email was triggered for: Failure
> Sending email for trigger: Failure
>
>
>
>
> ---------------------------------------------------------------------
> To unsubscribe, e-mail: dev-unsubscribe@lucene.apache.org
> For additional commands, e-mail: dev-help@lucene.apache.org

---------------------------------------------------------------------
To unsubscribe, e-mail: dev-unsubscribe@lucene.apache.org
For additional commands, e-mail: dev-help@lucene.apache.org


Mime
View raw message