lucene-dev mailing list archives

Site index · List index
Message view « Date » · « Thread »
Top « Date » · « Thread »
From Robert Muir <rcm...@gmail.com>
Subject Re: [JENKINS] Lucene-4x-Linux-Java7-64-test-only - Build # 31352 - Failure!
Date Wed, 17 Sep 2014 14:40:22 GMT
I am currently working on this bug:
https://issues.apache.org/jira/browse/LUCENE-5958

On Wed, Sep 17, 2014 at 10:34 AM,  <builder@flonkings.com> wrote:
> Build: builds.flonkings.com/job/Lucene-4x-Linux-Java7-64-test-only/31352/
>
> 1 tests failed.
> REGRESSION:  org.apache.lucene.index.TestIndexWriterOutOfMemory.testBasics
>
> Error Message:
> _0.si in dir=RAMDirectory(id=lucene-1a0b93be)
>
> Stack Trace:
> java.nio.file.NoSuchFileException: _0.si in dir=RAMDirectory(id=lucene-1a0b93be)
>         at __randomizedtesting.SeedInfo.seed([7F895B600AACB6E4:4251F54C3242E894]:0)
>         at org.apache.lucene.store.MockDirectoryWrapper.openInput(MockDirectoryWrapper.java:644)
>         at org.apache.lucene.codecs.lucene40.Lucene40SegmentInfoReader.read(Lucene40SegmentInfoReader.java:52)
>         at org.apache.lucene.index.SegmentInfos.read(SegmentInfos.java:320)
>         at org.apache.lucene.index.SegmentInfos$1.doBody(SegmentInfos.java:419)
>         at org.apache.lucene.index.SegmentInfos$FindSegmentsFile.run(SegmentInfos.java:746)
>         at org.apache.lucene.index.SegmentInfos$FindSegmentsFile.run(SegmentInfos.java:698)
>         at org.apache.lucene.index.SegmentInfos.read(SegmentInfos.java:415)
>         at org.apache.lucene.index.CheckIndex.checkIndex(CheckIndex.java:415)
>         at org.apache.lucene.util.TestUtil.checkIndex(TestUtil.java:236)
>         at org.apache.lucene.store.MockDirectoryWrapper.close(MockDirectoryWrapper.java:765)
>         at org.apache.lucene.index.TestIndexWriterOutOfMemory.doTest(TestIndexWriterOutOfMemory.java:89)
>         at org.apache.lucene.index.TestIndexWriterOutOfMemory.testBasics(TestIndexWriterOutOfMemory.java:250)
>         at sun.reflect.NativeMethodAccessorImpl.invoke0(Native Method)
>         at sun.reflect.NativeMethodAccessorImpl.invoke(NativeMethodAccessorImpl.java:57)
>         at sun.reflect.DelegatingMethodAccessorImpl.invoke(DelegatingMethodAccessorImpl.java:43)
>         at java.lang.reflect.Method.invoke(Method.java:606)
>         at com.carrotsearch.randomizedtesting.RandomizedRunner.invoke(RandomizedRunner.java:1618)
>         at com.carrotsearch.randomizedtesting.RandomizedRunner$6.evaluate(RandomizedRunner.java:827)
>         at com.carrotsearch.randomizedtesting.RandomizedRunner$7.evaluate(RandomizedRunner.java:863)
>         at com.carrotsearch.randomizedtesting.RandomizedRunner$8.evaluate(RandomizedRunner.java:877)
>         at org.apache.lucene.util.TestRuleSetupTeardownChained$1.evaluate(TestRuleSetupTeardownChained.java:50)
>         at org.apache.lucene.util.TestRuleFieldCacheSanity$1.evaluate(TestRuleFieldCacheSanity.java:51)
>         at org.apache.lucene.util.AbstractBeforeAfterRule$1.evaluate(AbstractBeforeAfterRule.java:46)
>         at com.carrotsearch.randomizedtesting.rules.SystemPropertiesInvariantRule$1.evaluate(SystemPropertiesInvariantRule.java:55)
>         at org.apache.lucene.util.TestRuleThreadAndTestName$1.evaluate(TestRuleThreadAndTestName.java:49)
>         at org.apache.lucene.util.TestRuleIgnoreAfterMaxFailures$1.evaluate(TestRuleIgnoreAfterMaxFailures.java:65)
>         at org.apache.lucene.util.TestRuleMarkFailure$1.evaluate(TestRuleMarkFailure.java:48)
>         at com.carrotsearch.randomizedtesting.rules.StatementAdapter.evaluate(StatementAdapter.java:36)
>         at com.carrotsearch.randomizedtesting.ThreadLeakControl$StatementRunner.run(ThreadLeakControl.java:365)
>         at com.carrotsearch.randomizedtesting.ThreadLeakControl.forkTimeoutingTask(ThreadLeakControl.java:798)
>         at com.carrotsearch.randomizedtesting.ThreadLeakControl$3.evaluate(ThreadLeakControl.java:458)
>         at com.carrotsearch.randomizedtesting.RandomizedRunner.runSingleTest(RandomizedRunner.java:836)
>         at com.carrotsearch.randomizedtesting.RandomizedRunner$3.evaluate(RandomizedRunner.java:738)
>         at com.carrotsearch.randomizedtesting.RandomizedRunner$4.evaluate(RandomizedRunner.java:772)
>         at com.carrotsearch.randomizedtesting.RandomizedRunner$5.evaluate(RandomizedRunner.java:783)
>         at org.apache.lucene.util.AbstractBeforeAfterRule$1.evaluate(AbstractBeforeAfterRule.java:46)
>         at org.apache.lucene.util.TestRuleStoreClassName$1.evaluate(TestRuleStoreClassName.java:42)
>         at com.carrotsearch.randomizedtesting.rules.SystemPropertiesInvariantRule$1.evaluate(SystemPropertiesInvariantRule.java:55)
>         at com.carrotsearch.randomizedtesting.rules.NoShadowingOrOverridesOnMethodsRule$1.evaluate(NoShadowingOrOverridesOnMethodsRule.java:39)
>         at com.carrotsearch.randomizedtesting.rules.NoShadowingOrOverridesOnMethodsRule$1.evaluate(NoShadowingOrOverridesOnMethodsRule.java:39)
>         at com.carrotsearch.randomizedtesting.rules.StatementAdapter.evaluate(StatementAdapter.java:36)
>         at com.carrotsearch.randomizedtesting.rules.StatementAdapter.evaluate(StatementAdapter.java:36)
>         at com.carrotsearch.randomizedtesting.rules.StatementAdapter.evaluate(StatementAdapter.java:36)
>         at org.apache.lucene.util.TestRuleAssertionsRequired$1.evaluate(TestRuleAssertionsRequired.java:43)
>         at org.apache.lucene.util.TestRuleMarkFailure$1.evaluate(TestRuleMarkFailure.java:48)
>         at org.apache.lucene.util.TestRuleIgnoreAfterMaxFailures$1.evaluate(TestRuleIgnoreAfterMaxFailures.java:65)
>         at org.apache.lucene.util.TestRuleIgnoreTestSuites$1.evaluate(TestRuleIgnoreTestSuites.java:55)
>         at com.carrotsearch.randomizedtesting.rules.StatementAdapter.evaluate(StatementAdapter.java:36)
>         at com.carrotsearch.randomizedtesting.ThreadLeakControl$StatementRunner.run(ThreadLeakControl.java:365)
>         at java.lang.Thread.run(Thread.java:745)
>
>
>
>
> Build Log:
> [...truncated 1506 lines...]
>    [junit4] Suite: org.apache.lucene.index.TestIndexWriterOutOfMemory
>    [junit4]   1> Unexpected exception: dumping fake-exception-log:...
>    [junit4]   1>
>    [junit4]   1> TEST: got expected fake exc:Fake OutOfMemoryError
>    [junit4]   1> java.lang.OutOfMemoryError: Fake OutOfMemoryError
>    [junit4]   1>        at org.apache.lucene.index.TestIndexWriterOutOfMemory$2.eval(TestIndexWriterOutOfMemory.java:262)
>    [junit4]   1>        at org.apache.lucene.store.MockDirectoryWrapper.maybeThrowDeterministicException(MockDirectoryWrapper.java:958)
>    [junit4]   1>        at org.apache.lucene.store.MockDirectoryWrapper.deleteFile(MockDirectoryWrapper.java:501)
>    [junit4]   1>        at org.apache.lucene.store.MockDirectoryWrapper.deleteFile(MockDirectoryWrapper.java:474)
>    [junit4]   1>        at org.apache.lucene.index.IndexFileDeleter.deleteFile(IndexFileDeleter.java:730)
>    [junit4]   1>        at org.apache.lucene.index.IndexFileDeleter.deletePendingFiles(IndexFileDeleter.java:523)
>    [junit4]   1>        at org.apache.lucene.index.IndexFileDeleter.checkpoint(IndexFileDeleter.java:561)
>    [junit4]   1>        at org.apache.lucene.index.IndexWriter.finishCommit(IndexWriter.java:3206)
>    [junit4]   1>        at org.apache.lucene.index.IndexWriter.commitInternal(IndexWriter.java:3186)
>    [junit4]   1>        at org.apache.lucene.index.IndexWriter.commit(IndexWriter.java:3146)
>    [junit4]   1>        at org.apache.lucene.index.TestIndexWriterOutOfMemory.doTest(TestIndexWriterOutOfMemory.java:199)
>    [junit4]   1>        at org.apache.lucene.index.TestIndexWriterOutOfMemory.testBasics(TestIndexWriterOutOfMemory.java:250)
>    [junit4]   1>        at sun.reflect.NativeMethodAccessorImpl.invoke0(Native Method)
>    [junit4]   1>        at sun.reflect.NativeMethodAccessorImpl.invoke(NativeMethodAccessorImpl.java:57)
>    [junit4]   1>        at sun.reflect.DelegatingMethodAccessorImpl.invoke(DelegatingMethodAccessorImpl.java:43)
>    [junit4]   1>        at java.lang.reflect.Method.invoke(Method.java:606)
>    [junit4]   1>        at com.carrotsearch.randomizedtesting.RandomizedRunner.invoke(RandomizedRunner.java:1618)
>    [junit4]   1>        at com.carrotsearch.randomizedtesting.RandomizedRunner$6.evaluate(RandomizedRunner.java:827)
>    [junit4]   1>        at com.carrotsearch.randomizedtesting.RandomizedRunner$7.evaluate(RandomizedRunner.java:863)
>    [junit4]   1>        at com.carrotsearch.randomizedtesting.RandomizedRunner$8.evaluate(RandomizedRunner.java:877)
>    [junit4]   1>        at org.apache.lucene.util.TestRuleSetupTeardownChained$1.evaluate(TestRuleSetupTeardownChained.java:50)
>    [junit4]   1>        at org.apache.lucene.util.TestRuleFieldCacheSanity$1.evaluate(TestRuleFieldCacheSanity.java:51)
>    [junit4]   1>        at org.apache.lucene.util.AbstractBeforeAfterRule$1.evaluate(AbstractBeforeAfterRule.java:46)
>    [junit4]   1>        at com.carrotsearch.randomizedtesting.rules.SystemPropertiesInvariantRule$1.evaluate(SystemPropertiesInvariantRule.java:55)
>    [junit4]   1>        at org.apache.lucene.util.TestRuleThreadAndTestName$1.evaluate(TestRuleThreadAndTestName.java:49)
>    [junit4]   1>        at org.apache.lucene.util.TestRuleIgnoreAfterMaxFailures$1.evaluate(TestRuleIgnoreAfterMaxFailures.java:65)
>    [junit4]   1>        at org.apache.lucene.util.TestRuleMarkFailure$1.evaluate(TestRuleMarkFailure.java:48)
>    [junit4]   1>        at com.carrotsearch.randomizedtesting.rules.StatementAdapter.evaluate(StatementAdapter.java:36)
>    [junit4]   1>        at com.carrotsearch.randomizedtesting.ThreadLeakControl$StatementRunner.run(ThreadLeakControl.java:365)
>    [junit4]   1>        at com.carrotsearch.randomizedtesting.ThreadLeakControl.forkTimeoutingTask(ThreadLeakControl.java:798)
>    [junit4]   1>        at com.carrotsearch.randomizedtesting.ThreadLeakControl$3.evaluate(ThreadLeakControl.java:458)
>    [junit4]   1>        at com.carrotsearch.randomizedtesting.RandomizedRunner.runSingleTest(RandomizedRunner.java:836)
>    [junit4]   1>        at com.carrotsearch.randomizedtesting.RandomizedRunner$3.evaluate(RandomizedRunner.java:738)
>    [junit4]   1>        at com.carrotsearch.randomizedtesting.RandomizedRunner$4.evaluate(RandomizedRunner.java:772)
>    [junit4]   1>        at com.carrotsearch.randomizedtesting.RandomizedRunner$5.evaluate(RandomizedRunner.java:783)
>    [junit4]   1>        at org.apache.lucene.util.AbstractBeforeAfterRule$1.evaluate(AbstractBeforeAfterRule.java:46)
>    [junit4]   1>        at org.apache.lucene.util.TestRuleStoreClassName$1.evaluate(TestRuleStoreClassName.java:42)
>    [junit4]   1>        at com.carrotsearch.randomizedtesting.rules.SystemPropertiesInvariantRule$1.evaluate(SystemPropertiesInvariantRule.java:55)
>    [junit4]   1>        at com.carrotsearch.randomizedtesting.rules.NoShadowingOrOverridesOnMethodsRule$1.evaluate(NoShadowingOrOverridesOnMethodsRule.java:39)
>    [junit4]   1>        at com.carrotsearch.randomizedtesting.rules.NoShadowingOrOverridesOnMethodsRule$1.evaluate(NoShadowingOrOverridesOnMethodsRule.java:39)
>    [junit4]   1>        at com.carrotsearch.randomizedtesting.rules.StatementAdapter.evaluate(StatementAdapter.java:36)
>    [junit4]   1>        at com.carrotsearch.randomizedtesting.rules.StatementAdapter.evaluate(StatementAdapter.java:36)
>    [junit4]   1>        at com.carrotsearch.randomizedtesting.rules.StatementAdapter.evaluate(StatementAdapter.java:36)
>    [junit4]   1>        at org.apache.lucene.util.TestRuleAssertionsRequired$1.evaluate(TestRuleAssertionsRequired.java:43)
>    [junit4]   1>        at org.apache.lucene.util.TestRuleMarkFailure$1.evaluate(TestRuleMarkFailure.java:48)
>    [junit4]   1>        at org.apache.lucene.util.TestRuleIgnoreAfterMaxFailures$1.evaluate(TestRuleIgnoreAfterMaxFailures.java:65)
>    [junit4]   1>        at org.apache.lucene.util.TestRuleIgnoreTestSuites$1.evaluate(TestRuleIgnoreTestSuites.java:55)
>    [junit4]   1>        at com.carrotsearch.randomizedtesting.rules.StatementAdapter.evaluate(StatementAdapter.java:36)
>    [junit4]   1>        at com.carrotsearch.randomizedtesting.ThreadLeakControl$StatementRunner.run(ThreadLeakControl.java:365)
>    [junit4]   1>        at java.lang.Thread.run(Thread.java:745)
>    [junit4]   1>
>    [junit4]   2> NOTE: reproduce with: ant test  -Dtestcase=TestIndexWriterOutOfMemory
-Dtests.method=testBasics -Dtests.seed=7F895B600AACB6E4 -Dtests.slow=true -Dtests.locale=lv
-Dtests.timezone=Asia/Samarkand -Dtests.file.encoding=UTF-8
>    [junit4] ERROR   1.29s J6 | TestIndexWriterOutOfMemory.testBasics <<<
>    [junit4]    > Throwable #1: java.nio.file.NoSuchFileException: _0.si in dir=RAMDirectory(id=lucene-1a0b93be)
>    [junit4]    >        at __randomizedtesting.SeedInfo.seed([7F895B600AACB6E4:4251F54C3242E894]:0)
>    [junit4]    >        at org.apache.lucene.store.MockDirectoryWrapper.openInput(MockDirectoryWrapper.java:644)
>    [junit4]    >        at org.apache.lucene.codecs.lucene40.Lucene40SegmentInfoReader.read(Lucene40SegmentInfoReader.java:52)
>    [junit4]    >        at org.apache.lucene.index.SegmentInfos.read(SegmentInfos.java:320)
>    [junit4]    >        at org.apache.lucene.index.SegmentInfos$1.doBody(SegmentInfos.java:419)
>    [junit4]    >        at org.apache.lucene.index.SegmentInfos$FindSegmentsFile.run(SegmentInfos.java:746)
>    [junit4]    >        at org.apache.lucene.index.SegmentInfos$FindSegmentsFile.run(SegmentInfos.java:698)
>    [junit4]    >        at org.apache.lucene.index.SegmentInfos.read(SegmentInfos.java:415)
>    [junit4]    >        at org.apache.lucene.index.CheckIndex.checkIndex(CheckIndex.java:415)
>    [junit4]    >        at org.apache.lucene.util.TestUtil.checkIndex(TestUtil.java:236)
>    [junit4]    >        at org.apache.lucene.store.MockDirectoryWrapper.close(MockDirectoryWrapper.java:765)
>    [junit4]    >        at org.apache.lucene.index.TestIndexWriterOutOfMemory.doTest(TestIndexWriterOutOfMemory.java:89)
>    [junit4]    >        at org.apache.lucene.index.TestIndexWriterOutOfMemory.testBasics(TestIndexWriterOutOfMemory.java:250)
>    [junit4]    >        at java.lang.Thread.run(Thread.java:745)
>    [junit4]   2> NOTE: test params are: codec=Lucene41, sim=RandomSimilarityProvider(queryNorm=true,coord=crazy):
{text_vectors=DFR I(ne)BZ(0.3), text1=LM Jelinek-Mercer(0.700000), text_payloads=DFR I(ne)L2},
locale=lv, timezone=Asia/Samarkand
>    [junit4]   2> NOTE: Linux 3.2.0-26-generic amd64/Oracle Corporation 1.7.0_65 (64-bit)/cpus=8,threads=1,free=91628240,total=327680000
>    [junit4]   2> NOTE: All tests run in this JVM: [TestCompressingStoredFieldsFormat,
TestLucene40NormsFormat, TestSimilarity2, TestSizeBoundedForceMerge, TestLongBitSet, TestTermsEnum,
TestBooleanQuery, TestStressNRT, TestIntroSorter, TestIdentityHashSet, TestNumericRangeQuery64,
TestDocIdBitSet, TestLucene49DocValuesFormat, TestIndexWriterExceptions2, TestSpansAdvanced2,
TestTermRangeQuery, TestSpansAdvanced, TestSentinelIntSet, TestCachingWrapperFilter, TestIndexWriterUnicode,
TestBytesRef, TestDirectPacked, TestSortDocValues, TestHighCompressionMode, TestBasics, Test2BSortedDocValues,
TestDocInverterPerFieldErrorInfo, TestFieldReuse, TestIndexWriterOutOfMemory]
>    [junit4] Completed on J6 in 1.37s, 2 tests, 1 error, 1 skipped <<< FAILURES!
>
> [...truncated 167 lines...]
> BUILD FAILED
> /var/lib/jenkins/workspace/Lucene-4x-Linux-Java7-64-test-only/checkout/lucene/build.xml:49:
The following error occurred while executing this line:
> /var/lib/jenkins/workspace/Lucene-4x-Linux-Java7-64-test-only/checkout/lucene/common-build.xml:1360:
The following error occurred while executing this line:
> /var/lib/jenkins/workspace/Lucene-4x-Linux-Java7-64-test-only/checkout/lucene/common-build.xml:963:
There were test failures: 420 suites, 3746 tests, 1 error, 141 ignored (129 assumptions)
>
> Total time: 7 minutes 48 seconds
> Build step 'Invoke Ant' marked build as failure
> Archiving artifacts
> Recording test results
> Email was triggered for: Failure
> Sending email for trigger: Failure
>
>
>
>
> ---------------------------------------------------------------------
> To unsubscribe, e-mail: dev-unsubscribe@lucene.apache.org
> For additional commands, e-mail: dev-help@lucene.apache.org

---------------------------------------------------------------------
To unsubscribe, e-mail: dev-unsubscribe@lucene.apache.org
For additional commands, e-mail: dev-help@lucene.apache.org


Mime
View raw message