lucene-dev mailing list archives

Site index · List index
Message view « Date » · « Thread »
Top « Date » · « Thread »
From Robert Muir <rm...@apache.org>
Subject Re: [JENKINS] Lucene-Solr-trunk-MacOSX (64bit/jdk1.7.0) - Build # 1844 - Failure!
Date Mon, 22 Sep 2014 18:21:53 GMT
Thank you

On Mon, Sep 22, 2014 at 1:19 PM, Michael McCandless
<lucene@mikemccandless.com> wrote:
> I'll fix ... need to suppress SimpleText...
>
> Mike McCandless
>
> http://blog.mikemccandless.com
>
>
> On Mon, Sep 22, 2014 at 1:07 PM, Policeman Jenkins Server
> <jenkins@thetaphi.de> wrote:
>> Build: http://jenkins.thetaphi.de/job/Lucene-Solr-trunk-MacOSX/1844/
>> Java: 64bit/jdk1.7.0 -XX:+UseCompressedOops -XX:+UseParallelGC
>>
>> 15 tests failed.
>> REGRESSION:  org.apache.lucene.search.TestSortedSetSelector.testMiddleMax
>>
>> Error Message:
>> codec does not support random access ordinals, cannot use selector: MIDDLE_MAX
>>
>> Stack Trace:
>> java.lang.UnsupportedOperationException: codec does not support random access ordinals, cannot use selector: MIDDLE_MAX
>>         at __randomizedtesting.SeedInfo.seed([7104C11261397844:4A10894851F62D02]:0)
>>         at org.apache.lucene.search.SortedSetSelector.wrap(SortedSetSelector.java:80)
>>         at org.apache.lucene.search.SortedSetSortField$1.getSortedDocValues(SortedSetSortField.java:129)
>>         at org.apache.lucene.search.FieldComparator$TermOrdValComparator.setNextReader(FieldComparator.java:828)
>>         at org.apache.lucene.search.TopFieldCollector$OneComparatorNonScoringCollector.doSetNextReader(TopFieldCollector.java:97)
>>         at org.apache.lucene.search.SimpleCollector.getLeafCollector(SimpleCollector.java:33)
>>         at org.apache.lucene.search.IndexSearcher.search(IndexSearcher.java:605)
>>         at org.apache.lucene.search.AssertingIndexSearcher.search(AssertingIndexSearcher.java:94)
>>         at org.apache.lucene.search.IndexSearcher.search(IndexSearcher.java:573)
>>         at org.apache.lucene.search.IndexSearcher.search(IndexSearcher.java:525)
>>         at org.apache.lucene.search.IndexSearcher.search(IndexSearcher.java:502)
>>         at org.apache.lucene.search.IndexSearcher.search(IndexSearcher.java:370)
>>         at org.apache.lucene.search.TestSortedSetSelector.testMiddleMax(TestSortedSetSelector.java:384)
>>         at sun.reflect.NativeMethodAccessorImpl.invoke0(Native Method)
>>         at sun.reflect.NativeMethodAccessorImpl.invoke(NativeMethodAccessorImpl.java:57)
>>         at sun.reflect.DelegatingMethodAccessorImpl.invoke(DelegatingMethodAccessorImpl.java:43)
>>         at java.lang.reflect.Method.invoke(Method.java:606)
>>         at com.carrotsearch.randomizedtesting.RandomizedRunner.invoke(RandomizedRunner.java:1618)
>>         at com.carrotsearch.randomizedtesting.RandomizedRunner$6.evaluate(RandomizedRunner.java:827)
>>         at com.carrotsearch.randomizedtesting.RandomizedRunner$7.evaluate(RandomizedRunner.java:863)
>>         at com.carrotsearch.randomizedtesting.RandomizedRunner$8.evaluate(RandomizedRunner.java:877)
>>         at org.apache.lucene.util.TestRuleSetupTeardownChained$1.evaluate(TestRuleSetupTeardownChained.java:50)
>>         at org.apache.lucene.util.AbstractBeforeAfterRule$1.evaluate(AbstractBeforeAfterRule.java:46)
>>         at com.carrotsearch.randomizedtesting.rules.SystemPropertiesInvariantRule$1.evaluate(SystemPropertiesInvariantRule.java:55)
>>         at org.apache.lucene.util.TestRuleThreadAndTestName$1.evaluate(TestRuleThreadAndTestName.java:49)
>>         at org.apache.lucene.util.TestRuleIgnoreAfterMaxFailures$1.evaluate(TestRuleIgnoreAfterMaxFailures.java:65)
>>         at org.apache.lucene.util.TestRuleMarkFailure$1.evaluate(TestRuleMarkFailure.java:48)
>>         at com.carrotsearch.randomizedtesting.rules.StatementAdapter.evaluate(StatementAdapter.java:36)
>>         at com.carrotsearch.randomizedtesting.ThreadLeakControl$StatementRunner.run(ThreadLeakControl.java:365)
>>         at com.carrotsearch.randomizedtesting.ThreadLeakControl.forkTimeoutingTask(ThreadLeakControl.java:798)
>>         at com.carrotsearch.randomizedtesting.ThreadLeakControl$3.evaluate(ThreadLeakControl.java:458)
>>         at com.carrotsearch.randomizedtesting.RandomizedRunner.runSingleTest(RandomizedRunner.java:836)
>>         at com.carrotsearch.randomizedtesting.RandomizedRunner$3.evaluate(RandomizedRunner.java:738)
>>         at com.carrotsearch.randomizedtesting.RandomizedRunner$4.evaluate(RandomizedRunner.java:772)
>>         at com.carrotsearch.randomizedtesting.RandomizedRunner$5.evaluate(RandomizedRunner.java:783)
>>         at org.apache.lucene.util.AbstractBeforeAfterRule$1.evaluate(AbstractBeforeAfterRule.java:46)
>>         at org.apache.lucene.util.TestRuleStoreClassName$1.evaluate(TestRuleStoreClassName.java:42)
>>         at com.carrotsearch.randomizedtesting.rules.SystemPropertiesInvariantRule$1.evaluate(SystemPropertiesInvariantRule.java:55)
>>         at com.carrotsearch.randomizedtesting.rules.NoShadowingOrOverridesOnMethodsRule$1.evaluate(NoShadowingOrOverridesOnMethodsRule.java:39)
>>         at com.carrotsearch.randomizedtesting.rules.NoShadowingOrOverridesOnMethodsRule$1.evaluate(NoShadowingOrOverridesOnMethodsRule.java:39)
>>         at com.carrotsearch.randomizedtesting.rules.StatementAdapter.evaluate(StatementAdapter.java:36)
>>         at com.carrotsearch.randomizedtesting.rules.StatementAdapter.evaluate(StatementAdapter.java:36)
>>         at com.carrotsearch.randomizedtesting.rules.StatementAdapter.evaluate(StatementAdapter.java:36)
>>         at org.apache.lucene.util.TestRuleAssertionsRequired$1.evaluate(TestRuleAssertionsRequired.java:43)
>>         at org.apache.lucene.util.TestRuleMarkFailure$1.evaluate(TestRuleMarkFailure.java:48)
>>         at org.apache.lucene.util.TestRuleIgnoreAfterMaxFailures$1.evaluate(TestRuleIgnoreAfterMaxFailures.java:65)
>>         at org.apache.lucene.util.TestRuleIgnoreTestSuites$1.evaluate(TestRuleIgnoreTestSuites.java:55)
>>         at com.carrotsearch.randomizedtesting.rules.StatementAdapter.evaluate(StatementAdapter.java:36)
>>         at com.carrotsearch.randomizedtesting.ThreadLeakControl$StatementRunner.run(ThreadLeakControl.java:365)
>>         at java.lang.Thread.run(Thread.java:745)
>>
>>
>> REGRESSION:  org.apache.lucene.search.TestSortedSetSelector.testMiddleMaxSingleton
>>
>> Error Message:
>> codec does not support random access ordinals, cannot use selector: MIDDLE_MAX
>>
>> Stack Trace:
>> java.lang.UnsupportedOperationException: codec does not support random access ordinals, cannot use selector: MIDDLE_MAX
>>         at __randomizedtesting.SeedInfo.seed([7104C11261397844:50A308D1FBB1D3AA]:0)
>>         at org.apache.lucene.search.SortedSetSelector.wrap(SortedSetSelector.java:80)
>>         at org.apache.lucene.search.SortedSetSortField$1.getSortedDocValues(SortedSetSortField.java:129)
>>         at org.apache.lucene.search.FieldComparator$TermOrdValComparator.setNextReader(FieldComparator.java:828)
>>         at org.apache.lucene.search.TopFieldCollector$OneComparatorNonScoringCollector.doSetNextReader(TopFieldCollector.java:97)
>>         at org.apache.lucene.search.SimpleCollector.getLeafCollector(SimpleCollector.java:33)
>>         at org.apache.lucene.search.IndexSearcher.search(IndexSearcher.java:605)
>>         at org.apache.lucene.search.AssertingIndexSearcher.search(AssertingIndexSearcher.java:94)
>>         at org.apache.lucene.search.IndexSearcher.search(IndexSearcher.java:573)
>>         at org.apache.lucene.search.IndexSearcher.search(IndexSearcher.java:525)
>>         at org.apache.lucene.search.IndexSearcher.search(IndexSearcher.java:502)
>>         at org.apache.lucene.search.IndexSearcher.search(IndexSearcher.java:370)
>>         at org.apache.lucene.search.TestSortedSetSelector.testMiddleMaxSingleton(TestSortedSetSelector.java:519)
>>         at sun.reflect.NativeMethodAccessorImpl.invoke0(Native Method)
>>         at sun.reflect.NativeMethodAccessorImpl.invoke(NativeMethodAccessorImpl.java:57)
>>         at sun.reflect.DelegatingMethodAccessorImpl.invoke(DelegatingMethodAccessorImpl.java:43)
>>         at java.lang.reflect.Method.invoke(Method.java:606)
>>         at com.carrotsearch.randomizedtesting.RandomizedRunner.invoke(RandomizedRunner.java:1618)
>>         at com.carrotsearch.randomizedtesting.RandomizedRunner$6.evaluate(RandomizedRunner.java:827)
>>         at com.carrotsearch.randomizedtesting.RandomizedRunner$7.evaluate(RandomizedRunner.java:863)
>>         at com.carrotsearch.randomizedtesting.RandomizedRunner$8.evaluate(RandomizedRunner.java:877)
>>         at org.apache.lucene.util.TestRuleSetupTeardownChained$1.evaluate(TestRuleSetupTeardownChained.java:50)
>>         at org.apache.lucene.util.AbstractBeforeAfterRule$1.evaluate(AbstractBeforeAfterRule.java:46)
>>         at com.carrotsearch.randomizedtesting.rules.SystemPropertiesInvariantRule$1.evaluate(SystemPropertiesInvariantRule.java:55)
>>         at org.apache.lucene.util.TestRuleThreadAndTestName$1.evaluate(TestRuleThreadAndTestName.java:49)
>>         at org.apache.lucene.util.TestRuleIgnoreAfterMaxFailures$1.evaluate(TestRuleIgnoreAfterMaxFailures.java:65)
>>         at org.apache.lucene.util.TestRuleMarkFailure$1.evaluate(TestRuleMarkFailure.java:48)
>>         at com.carrotsearch.randomizedtesting.rules.StatementAdapter.evaluate(StatementAdapter.java:36)
>>         at com.carrotsearch.randomizedtesting.ThreadLeakControl$StatementRunner.run(ThreadLeakControl.java:365)
>>         at com.carrotsearch.randomizedtesting.ThreadLeakControl.forkTimeoutingTask(ThreadLeakControl.java:798)
>>         at com.carrotsearch.randomizedtesting.ThreadLeakControl$3.evaluate(ThreadLeakControl.java:458)
>>         at com.carrotsearch.randomizedtesting.RandomizedRunner.runSingleTest(RandomizedRunner.java:836)
>>         at com.carrotsearch.randomizedtesting.RandomizedRunner$3.evaluate(RandomizedRunner.java:738)
>>         at com.carrotsearch.randomizedtesting.RandomizedRunner$4.evaluate(RandomizedRunner.java:772)
>>         at com.carrotsearch.randomizedtesting.RandomizedRunner$5.evaluate(RandomizedRunner.java:783)
>>         at org.apache.lucene.util.AbstractBeforeAfterRule$1.evaluate(AbstractBeforeAfterRule.java:46)
>>         at org.apache.lucene.util.TestRuleStoreClassName$1.evaluate(TestRuleStoreClassName.java:42)
>>         at com.carrotsearch.randomizedtesting.rules.SystemPropertiesInvariantRule$1.evaluate(SystemPropertiesInvariantRule.java:55)
>>         at com.carrotsearch.randomizedtesting.rules.NoShadowingOrOverridesOnMethodsRule$1.evaluate(NoShadowingOrOverridesOnMethodsRule.java:39)
>>         at com.carrotsearch.randomizedtesting.rules.NoShadowingOrOverridesOnMethodsRule$1.evaluate(NoShadowingOrOverridesOnMethodsRule.java:39)
>>         at com.carrotsearch.randomizedtesting.rules.StatementAdapter.evaluate(StatementAdapter.java:36)
>>         at com.carrotsearch.randomizedtesting.rules.StatementAdapter.evaluate(StatementAdapter.java:36)
>>         at com.carrotsearch.randomizedtesting.rules.StatementAdapter.evaluate(StatementAdapter.java:36)
>>         at org.apache.lucene.util.TestRuleAssertionsRequired$1.evaluate(TestRuleAssertionsRequired.java:43)
>>         at org.apache.lucene.util.TestRuleMarkFailure$1.evaluate(TestRuleMarkFailure.java:48)
>>         at org.apache.lucene.util.TestRuleIgnoreAfterMaxFailures$1.evaluate(TestRuleIgnoreAfterMaxFailures.java:65)
>>         at org.apache.lucene.util.TestRuleIgnoreTestSuites$1.evaluate(TestRuleIgnoreTestSuites.java:55)
>>         at com.carrotsearch.randomizedtesting.rules.StatementAdapter.evaluate(StatementAdapter.java:36)
>>         at com.carrotsearch.randomizedtesting.ThreadLeakControl$StatementRunner.run(ThreadLeakControl.java:365)
>>         at java.lang.Thread.run(Thread.java:745)
>>
>>
>> REGRESSION:  org.apache.lucene.search.TestSortedSetSelector.testMaxMissingLast
>>
>> Error Message:
>> codec does not support random access ordinals, cannot use selector: MAX
>>
>> Stack Trace:
>> java.lang.UnsupportedOperationException: codec does not support random access ordinals, cannot use selector: MAX
>>         at __randomizedtesting.SeedInfo.seed([7104C11261397844:61DA6D5EAAE73BB8]:0)
>>         at org.apache.lucene.search.SortedSetSelector.wrap(SortedSetSelector.java:80)
>>         at org.apache.lucene.search.SortedSetSortField$1.getSortedDocValues(SortedSetSortField.java:129)
>>         at org.apache.lucene.search.FieldComparator$TermOrdValComparator.setNextReader(FieldComparator.java:828)
>>         at org.apache.lucene.search.TopFieldCollector$OneComparatorNonScoringCollector.doSetNextReader(TopFieldCollector.java:97)
>>         at org.apache.lucene.search.SimpleCollector.getLeafCollector(SimpleCollector.java:33)
>>         at org.apache.lucene.search.IndexSearcher.search(IndexSearcher.java:605)
>>         at org.apache.lucene.search.AssertingIndexSearcher.search(AssertingIndexSearcher.java:94)
>>         at org.apache.lucene.search.IndexSearcher.search(IndexSearcher.java:573)
>>         at org.apache.lucene.search.IndexSearcher.search(IndexSearcher.java:525)
>>         at org.apache.lucene.search.IndexSearcher.search(IndexSearcher.java:502)
>>         at org.apache.lucene.search.IndexSearcher.search(IndexSearcher.java:370)
>>         at org.apache.lucene.search.TestSortedSetSelector.testMaxMissingLast(TestSortedSetSelector.java:157)
>>         at sun.reflect.NativeMethodAccessorImpl.invoke0(Native Method)
>>         at sun.reflect.NativeMethodAccessorImpl.invoke(NativeMethodAccessorImpl.java:57)
>>         at sun.reflect.DelegatingMethodAccessorImpl.invoke(DelegatingMethodAccessorImpl.java:43)
>>         at java.lang.reflect.Method.invoke(Method.java:606)
>>         at com.carrotsearch.randomizedtesting.RandomizedRunner.invoke(RandomizedRunner.java:1618)
>>         at com.carrotsearch.randomizedtesting.RandomizedRunner$6.evaluate(RandomizedRunner.java:827)
>>         at com.carrotsearch.randomizedtesting.RandomizedRunner$7.evaluate(RandomizedRunner.java:863)
>>         at com.carrotsearch.randomizedtesting.RandomizedRunner$8.evaluate(RandomizedRunner.java:877)
>>         at org.apache.lucene.util.TestRuleSetupTeardownChained$1.evaluate(TestRuleSetupTeardownChained.java:50)
>>         at org.apache.lucene.util.AbstractBeforeAfterRule$1.evaluate(AbstractBeforeAfterRule.java:46)
>>         at com.carrotsearch.randomizedtesting.rules.SystemPropertiesInvariantRule$1.evaluate(SystemPropertiesInvariantRule.java:55)
>>         at org.apache.lucene.util.TestRuleThreadAndTestName$1.evaluate(TestRuleThreadAndTestName.java:49)
>>         at org.apache.lucene.util.TestRuleIgnoreAfterMaxFailures$1.evaluate(TestRuleIgnoreAfterMaxFailures.java:65)
>>         at org.apache.lucene.util.TestRuleMarkFailure$1.evaluate(TestRuleMarkFailure.java:48)
>>         at com.carrotsearch.randomizedtesting.rules.StatementAdapter.evaluate(StatementAdapter.java:36)
>>         at com.carrotsearch.randomizedtesting.ThreadLeakControl$StatementRunner.run(ThreadLeakControl.java:365)
>>         at com.carrotsearch.randomizedtesting.ThreadLeakControl.forkTimeoutingTask(ThreadLeakControl.java:798)
>>         at com.carrotsearch.randomizedtesting.ThreadLeakControl$3.evaluate(ThreadLeakControl.java:458)
>>         at com.carrotsearch.randomizedtesting.RandomizedRunner.runSingleTest(RandomizedRunner.java:836)
>>         at com.carrotsearch.randomizedtesting.RandomizedRunner$3.evaluate(RandomizedRunner.java:738)
>>         at com.carrotsearch.randomizedtesting.RandomizedRunner$4.evaluate(RandomizedRunner.java:772)
>>         at com.carrotsearch.randomizedtesting.RandomizedRunner$5.evaluate(RandomizedRunner.java:783)
>>         at org.apache.lucene.util.AbstractBeforeAfterRule$1.evaluate(AbstractBeforeAfterRule.java:46)
>>         at org.apache.lucene.util.TestRuleStoreClassName$1.evaluate(TestRuleStoreClassName.java:42)
>>         at com.carrotsearch.randomizedtesting.rules.SystemPropertiesInvariantRule$1.evaluate(SystemPropertiesInvariantRule.java:55)
>>         at com.carrotsearch.randomizedtesting.rules.NoShadowingOrOverridesOnMethodsRule$1.evaluate(NoShadowingOrOverridesOnMethodsRule.java:39)
>>         at com.carrotsearch.randomizedtesting.rules.NoShadowingOrOverridesOnMethodsRule$1.evaluate(NoShadowingOrOverridesOnMethodsRule.java:39)
>>         at com.carrotsearch.randomizedtesting.rules.StatementAdapter.evaluate(StatementAdapter.java:36)
>>         at com.carrotsearch.randomizedtesting.rules.StatementAdapter.evaluate(StatementAdapter.java:36)
>>         at com.carrotsearch.randomizedtesting.rules.StatementAdapter.evaluate(StatementAdapter.java:36)
>>         at org.apache.lucene.util.TestRuleAssertionsRequired$1.evaluate(TestRuleAssertionsRequired.java:43)
>>         at org.apache.lucene.util.TestRuleMarkFailure$1.evaluate(TestRuleMarkFailure.java:48)
>>         at org.apache.lucene.util.TestRuleIgnoreAfterMaxFailures$1.evaluate(TestRuleIgnoreAfterMaxFailures.java:65)
>>         at org.apache.lucene.util.TestRuleIgnoreTestSuites$1.evaluate(TestRuleIgnoreTestSuites.java:55)
>>         at com.carrotsearch.randomizedtesting.rules.StatementAdapter.evaluate(StatementAdapter.java:36)
>>         at com.carrotsearch.randomizedtesting.ThreadLeakControl$StatementRunner.run(ThreadLeakControl.java:365)
>>         at java.lang.Thread.run(Thread.java:745)
>>
>>
>> REGRESSION:  org.apache.lucene.search.TestSortedSetSelector.testMiddleMinReverse
>>
>> Error Message:
>> codec does not support random access ordinals, cannot use selector: MIDDLE_MIN
>>
>> Stack Trace:
>> java.lang.UnsupportedOperationException: codec does not support random access ordinals, cannot use selector: MIDDLE_MIN
>>         at __randomizedtesting.SeedInfo.seed([7104C11261397844:BC59BFFF641D13E7]:0)
>>         at org.apache.lucene.search.SortedSetSelector.wrap(SortedSetSelector.java:80)
>>         at org.apache.lucene.search.SortedSetSortField$1.getSortedDocValues(SortedSetSortField.java:129)
>>         at org.apache.lucene.search.FieldComparator$TermOrdValComparator.setNextReader(FieldComparator.java:828)
>>         at org.apache.lucene.search.TopFieldCollector$OneComparatorNonScoringCollector.doSetNextReader(TopFieldCollector.java:97)
>>         at org.apache.lucene.search.SimpleCollector.getLeafCollector(SimpleCollector.java:33)
>>         at org.apache.lucene.search.IndexSearcher.search(IndexSearcher.java:605)
>>         at org.apache.lucene.search.AssertingIndexSearcher.search(AssertingIndexSearcher.java:94)
>>         at org.apache.lucene.search.IndexSearcher.search(IndexSearcher.java:573)
>>         at org.apache.lucene.search.IndexSearcher.search(IndexSearcher.java:525)
>>         at org.apache.lucene.search.IndexSearcher.search(IndexSearcher.java:502)
>>         at org.apache.lucene.search.IndexSearcher.search(IndexSearcher.java:370)
>>         at org.apache.lucene.search.TestSortedSetSelector.testMiddleMinReverse(TestSortedSetSelector.java:249)
>>         at sun.reflect.NativeMethodAccessorImpl.invoke0(Native Method)
>>         at sun.reflect.NativeMethodAccessorImpl.invoke(NativeMethodAccessorImpl.java:57)
>>         at sun.reflect.DelegatingMethodAccessorImpl.invoke(DelegatingMethodAccessorImpl.java:43)
>>         at java.lang.reflect.Method.invoke(Method.java:606)
>>         at com.carrotsearch.randomizedtesting.RandomizedRunner.invoke(RandomizedRunner.java:1618)
>>         at com.carrotsearch.randomizedtesting.RandomizedRunner$6.evaluate(RandomizedRunner.java:827)
>>         at com.carrotsearch.randomizedtesting.RandomizedRunner$7.evaluate(RandomizedRunner.java:863)
>>         at com.carrotsearch.randomizedtesting.RandomizedRunner$8.evaluate(RandomizedRunner.java:877)
>>         at org.apache.lucene.util.TestRuleSetupTeardownChained$1.evaluate(TestRuleSetupTeardownChained.java:50)
>>         at org.apache.lucene.util.AbstractBeforeAfterRule$1.evaluate(AbstractBeforeAfterRule.java:46)
>>         at com.carrotsearch.randomizedtesting.rules.SystemPropertiesInvariantRule$1.evaluate(SystemPropertiesInvariantRule.java:55)
>>         at org.apache.lucene.util.TestRuleThreadAndTestName$1.evaluate(TestRuleThreadAndTestName.java:49)
>>         at org.apache.lucene.util.TestRuleIgnoreAfterMaxFailures$1.evaluate(TestRuleIgnoreAfterMaxFailures.java:65)
>>         at org.apache.lucene.util.TestRuleMarkFailure$1.evaluate(TestRuleMarkFailure.java:48)
>>         at com.carrotsearch.randomizedtesting.rules.StatementAdapter.evaluate(StatementAdapter.java:36)
>>         at com.carrotsearch.randomizedtesting.ThreadLeakControl$StatementRunner.run(ThreadLeakControl.java:365)
>>         at com.carrotsearch.randomizedtesting.ThreadLeakControl.forkTimeoutingTask(ThreadLeakControl.java:798)
>>         at com.carrotsearch.randomizedtesting.ThreadLeakControl$3.evaluate(ThreadLeakControl.java:458)
>>         at com.carrotsearch.randomizedtesting.RandomizedRunner.runSingleTest(RandomizedRunner.java:836)
>>         at com.carrotsearch.randomizedtesting.RandomizedRunner$3.evaluate(RandomizedRunner.java:738)
>>         at com.carrotsearch.randomizedtesting.RandomizedRunner$4.evaluate(RandomizedRunner.java:772)
>>         at com.carrotsearch.randomizedtesting.RandomizedRunner$5.evaluate(RandomizedRunner.java:783)
>>         at org.apache.lucene.util.AbstractBeforeAfterRule$1.evaluate(AbstractBeforeAfterRule.java:46)
>>         at org.apache.lucene.util.TestRuleStoreClassName$1.evaluate(TestRuleStoreClassName.java:42)
>>         at com.carrotsearch.randomizedtesting.rules.SystemPropertiesInvariantRule$1.evaluate(SystemPropertiesInvariantRule.java:55)
>>         at com.carrotsearch.randomizedtesting.rules.NoShadowingOrOverridesOnMethodsRule$1.evaluate(NoShadowingOrOverridesOnMethodsRule.java:39)
>>         at com.carrotsearch.randomizedtesting.rules.NoShadowingOrOverridesOnMethodsRule$1.evaluate(NoShadowingOrOverridesOnMethodsRule.java:39)
>>         at com.carrotsearch.randomizedtesting.rules.StatementAdapter.evaluate(StatementAdapter.java:36)
>>         at com.carrotsearch.randomizedtesting.rules.StatementAdapter.evaluate(StatementAdapter.java:36)
>>         at com.carrotsearch.randomizedtesting.rules.StatementAdapter.evaluate(StatementAdapter.java:36)
>>         at org.apache.lucene.util.TestRuleAssertionsRequired$1.evaluate(TestRuleAssertionsRequired.java:43)
>>         at org.apache.lucene.util.TestRuleMarkFailure$1.evaluate(TestRuleMarkFailure.java:48)
>>         at org.apache.lucene.util.TestRuleIgnoreAfterMaxFailures$1.evaluate(TestRuleIgnoreAfterMaxFailures.java:65)
>>         at org.apache.lucene.util.TestRuleIgnoreTestSuites$1.evaluate(TestRuleIgnoreTestSuites.java:55)
>>         at com.carrotsearch.randomizedtesting.rules.StatementAdapter.evaluate(StatementAdapter.java:36)
>>         at com.carrotsearch.randomizedtesting.ThreadLeakControl$StatementRunner.run(ThreadLeakControl.java:365)
>>         at java.lang.Thread.run(Thread.java:745)
>>
>>
>> REGRESSION:  org.apache.lucene.search.TestSortedSetSelector.testMaxReverse
>>
>> Error Message:
>> codec does not support random access ordinals, cannot use selector: MAX
>>
>> Stack Trace:
>> java.lang.UnsupportedOperationException: codec does not support random access ordinals, cannot use selector: MAX
>>         at __randomizedtesting.SeedInfo.seed([7104C11261397844:7ECFE6835D929D2C]:0)
>>         at org.apache.lucene.search.SortedSetSelector.wrap(SortedSetSelector.java:80)
>>         at org.apache.lucene.search.SortedSetSortField$1.getSortedDocValues(SortedSetSortField.java:129)
>>         at org.apache.lucene.search.FieldComparator$TermOrdValComparator.setNextReader(FieldComparator.java:828)
>>         at org.apache.lucene.search.TopFieldCollector$OneComparatorNonScoringCollector.doSetNextReader(TopFieldCollector.java:97)
>>         at org.apache.lucene.search.SimpleCollector.getLeafCollector(SimpleCollector.java:33)
>>         at org.apache.lucene.search.IndexSearcher.search(IndexSearcher.java:605)
>>         at org.apache.lucene.search.AssertingIndexSearcher.search(AssertingIndexSearcher.java:94)
>>         at org.apache.lucene.search.IndexSearcher.search(IndexSearcher.java:573)
>>         at org.apache.lucene.search.IndexSearcher.search(IndexSearcher.java:525)
>>         at org.apache.lucene.search.IndexSearcher.search(IndexSearcher.java:502)
>>         at org.apache.lucene.search.IndexSearcher.search(IndexSearcher.java:370)
>>         at org.apache.lucene.search.TestSortedSetSelector.testMaxReverse(TestSortedSetSelector.java:85)
>>         at sun.reflect.NativeMethodAccessorImpl.invoke0(Native Method)
>>         at sun.reflect.NativeMethodAccessorImpl.invoke(NativeMethodAccessorImpl.java:57)
>>         at sun.reflect.DelegatingMethodAccessorImpl.invoke(DelegatingMethodAccessorImpl.java:43)
>>         at java.lang.reflect.Method.invoke(Method.java:606)
>>         at com.carrotsearch.randomizedtesting.RandomizedRunner.invoke(RandomizedRunner.java:1618)
>>         at com.carrotsearch.randomizedtesting.RandomizedRunner$6.evaluate(RandomizedRunner.java:827)
>>         at com.carrotsearch.randomizedtesting.RandomizedRunner$7.evaluate(RandomizedRunner.java:863)
>>         at com.carrotsearch.randomizedtesting.RandomizedRunner$8.evaluate(RandomizedRunner.java:877)
>>         at org.apache.lucene.util.TestRuleSetupTeardownChained$1.evaluate(TestRuleSetupTeardownChained.java:50)
>>         at org.apache.lucene.util.AbstractBeforeAfterRule$1.evaluate(AbstractBeforeAfterRule.java:46)
>>         at com.carrotsearch.randomizedtesting.rules.SystemPropertiesInvariantRule$1.evaluate(SystemPropertiesInvariantRule.java:55)
>>         at org.apache.lucene.util.TestRuleThreadAndTestName$1.evaluate(TestRuleThreadAndTestName.java:49)
>>         at org.apache.lucene.util.TestRuleIgnoreAfterMaxFailures$1.evaluate(TestRuleIgnoreAfterMaxFailures.java:65)
>>         at org.apache.lucene.util.TestRuleMarkFailure$1.evaluate(TestRuleMarkFailure.java:48)
>>         at com.carrotsearch.randomizedtesting.rules.StatementAdapter.evaluate(StatementAdapter.java:36)
>>         at com.carrotsearch.randomizedtesting.ThreadLeakControl$StatementRunner.run(ThreadLeakControl.java:365)
>>         at com.carrotsearch.randomizedtesting.ThreadLeakControl.forkTimeoutingTask(ThreadLeakControl.java:798)
>>         at com.carrotsearch.randomizedtesting.ThreadLeakControl$3.evaluate(ThreadLeakControl.java:458)
>>         at com.carrotsearch.randomizedtesting.RandomizedRunner.runSingleTest(RandomizedRunner.java:836)
>>         at com.carrotsearch.randomizedtesting.RandomizedRunner$3.evaluate(RandomizedRunner.java:738)
>>         at com.carrotsearch.randomizedtesting.RandomizedRunner$4.evaluate(RandomizedRunner.java:772)
>>         at com.carrotsearch.randomizedtesting.RandomizedRunner$5.evaluate(RandomizedRunner.java:783)
>>         at org.apache.lucene.util.AbstractBeforeAfterRule$1.evaluate(AbstractBeforeAfterRule.java:46)
>>         at org.apache.lucene.util.TestRuleStoreClassName$1.evaluate(TestRuleStoreClassName.java:42)
>>         at com.carrotsearch.randomizedtesting.rules.SystemPropertiesInvariantRule$1.evaluate(SystemPropertiesInvariantRule.java:55)
>>         at com.carrotsearch.randomizedtesting.rules.NoShadowingOrOverridesOnMethodsRule$1.evaluate(NoShadowingOrOverridesOnMethodsRule.java:39)
>>         at com.carrotsearch.randomizedtesting.rules.NoShadowingOrOverridesOnMethodsRule$1.evaluate(NoShadowingOrOverridesOnMethodsRule.java:39)
>>         at com.carrotsearch.randomizedtesting.rules.StatementAdapter.evaluate(StatementAdapter.java:36)
>>         at com.carrotsearch.randomizedtesting.rules.StatementAdapter.evaluate(StatementAdapter.java:36)
>>         at com.carrotsearch.randomizedtesting.rules.StatementAdapter.evaluate(StatementAdapter.java:36)
>>         at org.apache.lucene.util.TestRuleAssertionsRequired$1.evaluate(TestRuleAssertionsRequired.java:43)
>>         at org.apache.lucene.util.TestRuleMarkFailure$1.evaluate(TestRuleMarkFailure.java:48)
>>         at org.apache.lucene.util.TestRuleIgnoreAfterMaxFailures$1.evaluate(TestRuleIgnoreAfterMaxFailures.java:65)
>>         at org.apache.lucene.util.TestRuleIgnoreTestSuites$1.evaluate(TestRuleIgnoreTestSuites.java:55)
>>         at com.carrotsearch.randomizedtesting.rules.StatementAdapter.evaluate(StatementAdapter.java:36)
>>         at com.carrotsearch.randomizedtesting.ThreadLeakControl$StatementRunner.run(ThreadLeakControl.java:365)
>>         at java.lang.Thread.run(Thread.java:745)
>>
>>
>> REGRESSION:  org.apache.lucene.search.TestSortedSetSelector.testMiddleMinSingleton
>>
>> Error Message:
>> codec does not support random access ordinals, cannot use selector: MIDDLE_MIN
>>
>> Stack Trace:
>> java.lang.UnsupportedOperationException: codec does not support random access ordinals, cannot use selector: MIDDLE_MIN
>>         at __randomizedtesting.SeedInfo.seed([7104C11261397844:2B079C9B5D9CD1C1]:0)
>>         at org.apache.lucene.search.SortedSetSelector.wrap(SortedSetSelector.java:80)
>>         at org.apache.lucene.search.SortedSetSortField$1.getSortedDocValues(SortedSetSortField.java:129)
>>         at org.apache.lucene.search.FieldComparator$TermOrdValComparator.setNextReader(FieldComparator.java:828)
>>         at org.apache.lucene.search.TopFieldCollector$OneComparatorNonScoringCollector.doSetNextReader(TopFieldCollector.java:97)
>>         at org.apache.lucene.search.SimpleCollector.getLeafCollector(SimpleCollector.java:33)
>>         at org.apache.lucene.search.IndexSearcher.search(IndexSearcher.java:605)
>>         at org.apache.lucene.search.AssertingIndexSearcher.search(AssertingIndexSearcher.java:94)
>>         at org.apache.lucene.search.IndexSearcher.search(IndexSearcher.java:573)
>>         at org.apache.lucene.search.IndexSearcher.search(IndexSearcher.java:525)
>>         at org.apache.lucene.search.IndexSearcher.search(IndexSearcher.java:502)
>>         at org.apache.lucene.search.IndexSearcher.search(IndexSearcher.java:370)
>>         at org.apache.lucene.search.TestSortedSetSelector.testMiddleMinSingleton(TestSortedSetSelector.java:353)
>>         at sun.reflect.NativeMethodAccessorImpl.invoke0(Native Method)
>>         at sun.reflect.NativeMethodAccessorImpl.invoke(NativeMethodAccessorImpl.java:57)
>>         at sun.reflect.DelegatingMethodAccessorImpl.invoke(DelegatingMethodAccessorImpl.java:43)
>>         at java.lang.reflect.Method.invoke(Method.java:606)
>>         at com.carrotsearch.randomizedtesting.RandomizedRunner.invoke(RandomizedRunner.java:1618)
>>         at com.carrotsearch.randomizedtesting.RandomizedRunner$6.evaluate(RandomizedRunner.java:827)
>>         at com.carrotsearch.randomizedtesting.RandomizedRunner$7.evaluate(RandomizedRunner.java:863)
>>         at com.carrotsearch.randomizedtesting.RandomizedRunner$8.evaluate(RandomizedRunner.java:877)
>>         at org.apache.lucene.util.TestRuleSetupTeardownChained$1.evaluate(TestRuleSetupTeardownChained.java:50)
>>         at org.apache.lucene.util.AbstractBeforeAfterRule$1.evaluate(AbstractBeforeAfterRule.java:46)
>>         at com.carrotsearch.randomizedtesting.rules.SystemPropertiesInvariantRule$1.evaluate(SystemPropertiesInvariantRule.java:55)
>>         at org.apache.lucene.util.TestRuleThreadAndTestName$1.evaluate(TestRuleThreadAndTestName.java:49)
>>         at org.apache.lucene.util.TestRuleIgnoreAfterMaxFailures$1.evaluate(TestRuleIgnoreAfterMaxFailures.java:65)
>>         at org.apache.lucene.util.TestRuleMarkFailure$1.evaluate(TestRuleMarkFailure.java:48)
>>         at com.carrotsearch.randomizedtesting.rules.StatementAdapter.evaluate(StatementAdapter.java:36)
>>         at com.carrotsearch.randomizedtesting.ThreadLeakControl$StatementRunner.run(ThreadLeakControl.java:365)
>>         at com.carrotsearch.randomizedtesting.ThreadLeakControl.forkTimeoutingTask(ThreadLeakControl.java:798)
>>         at com.carrotsearch.randomizedtesting.ThreadLeakControl$3.evaluate(ThreadLeakControl.java:458)
>>         at com.carrotsearch.randomizedtesting.RandomizedRunner.runSingleTest(RandomizedRunner.java:836)
>>         at com.carrotsearch.randomizedtesting.RandomizedRunner$3.evaluate(RandomizedRunner.java:738)
>>         at com.carrotsearch.randomizedtesting.RandomizedRunner$4.evaluate(RandomizedRunner.java:772)
>>         at com.carrotsearch.randomizedtesting.RandomizedRunner$5.evaluate(RandomizedRunner.java:783)
>>         at org.apache.lucene.util.AbstractBeforeAfterRule$1.evaluate(AbstractBeforeAfterRule.java:46)
>>         at org.apache.lucene.util.TestRuleStoreClassName$1.evaluate(TestRuleStoreClassName.java:42)
>>         at com.carrotsearch.randomizedtesting.rules.SystemPropertiesInvariantRule$1.evaluate(SystemPropertiesInvariantRule.java:55)
>>         at com.carrotsearch.randomizedtesting.rules.NoShadowingOrOverridesOnMethodsRule$1.evaluate(NoShadowingOrOverridesOnMethodsRule.java:39)
>>         at com.carrotsearch.randomizedtesting.rules.NoShadowingOrOverridesOnMethodsRule$1.evaluate(NoShadowingOrOverridesOnMethodsRule.java:39)
>>         at com.carrotsearch.randomizedtesting.rules.StatementAdapter.evaluate(StatementAdapter.java:36)
>>         at com.carrotsearch.randomizedtesting.rules.StatementAdapter.evaluate(StatementAdapter.java:36)
>>         at com.carrotsearch.randomizedtesting.rules.StatementAdapter.evaluate(StatementAdapter.java:36)
>>         at org.apache.lucene.util.TestRuleAssertionsRequired$1.evaluate(TestRuleAssertionsRequired.java:43)
>>         at org.apache.lucene.util.TestRuleMarkFailure$1.evaluate(TestRuleMarkFailure.java:48)
>>         at org.apache.lucene.util.TestRuleIgnoreAfterMaxFailures$1.evaluate(TestRuleIgnoreAfterMaxFailures.java:65)
>>         at org.apache.lucene.util.TestRuleIgnoreTestSuites$1.evaluate(TestRuleIgnoreTestSuites.java:55)
>>         at com.carrotsearch.randomizedtesting.rules.StatementAdapter.evaluate(StatementAdapter.java:36)
>>         at com.carrotsearch.randomizedtesting.ThreadLeakControl$StatementRunner.run(ThreadLeakControl.java:365)
>>         at java.lang.Thread.run(Thread.java:745)
>>
>>
>> REGRESSION:  org.apache.lucene.search.TestSortedSetSelector.testMiddleMinMissingFirst
>>
>> Error Message:
>> codec does not support random access ordinals, cannot use selector: MIDDLE_MIN
>>
>> Stack Trace:
>> java.lang.UnsupportedOperationException: codec does not support random access ordinals, cannot use selector: MIDDLE_MIN
>>         at __randomizedtesting.SeedInfo.seed([7104C11261397844:8444C12B5FE304BF]:0)
>>         at org.apache.lucene.search.SortedSetSelector.wrap(SortedSetSelector.java:80)
>>         at org.apache.lucene.search.SortedSetSortField$1.getSortedDocValues(SortedSetSortField.java:129)
>>         at org.apache.lucene.search.FieldComparator$TermOrdValComparator.setNextReader(FieldComparator.java:828)
>>         at org.apache.lucene.search.TopFieldCollector$OneComparatorNonScoringCollector.doSetNextReader(TopFieldCollector.java:97)
>>         at org.apache.lucene.search.SimpleCollector.getLeafCollector(SimpleCollector.java:33)
>>         at org.apache.lucene.search.IndexSearcher.search(IndexSearcher.java:605)
>>         at org.apache.lucene.search.AssertingIndexSearcher.search(AssertingIndexSearcher.java:94)
>>         at org.apache.lucene.search.IndexSearcher.search(IndexSearcher.java:573)
>>         at org.apache.lucene.search.IndexSearcher.search(IndexSearcher.java:525)
>>         at org.apache.lucene.search.IndexSearcher.search(IndexSearcher.java:502)
>>         at org.apache.lucene.search.IndexSearcher.search(IndexSearcher.java:370)
>>         at org.apache.lucene.search.TestSortedSetSelector.testMiddleMinMissingFirst(TestSortedSetSelector.java:285)
>>         at sun.reflect.NativeMethodAccessorImpl.invoke0(Native Method)
>>         at sun.reflect.NativeMethodAccessorImpl.invoke(NativeMethodAccessorImpl.java:57)
>>         at sun.reflect.DelegatingMethodAccessorImpl.invoke(DelegatingMethodAccessorImpl.java:43)
>>         at java.lang.reflect.Method.invoke(Method.java:606)
>>         at com.carrotsearch.randomizedtesting.RandomizedRunner.invoke(RandomizedRunner.java:1618)
>>         at com.carrotsearch.randomizedtesting.RandomizedRunner$6.evaluate(RandomizedRunner.java:827)
>>         at com.carrotsearch.randomizedtesting.RandomizedRunner$7.evaluate(RandomizedRunner.java:863)
>>         at com.carrotsearch.randomizedtesting.RandomizedRunner$8.evaluate(RandomizedRunner.java:877)
>>         at org.apache.lucene.util.TestRuleSetupTeardownChained$1.evaluate(TestRuleSetupTeardownChained.java:50)
>>         at org.apache.lucene.util.AbstractBeforeAfterRule$1.evaluate(AbstractBeforeAfterRule.java:46)
>>         at com.carrotsearch.randomizedtesting.rules.SystemPropertiesInvariantRule$1.evaluate(SystemPropertiesInvariantRule.java:55)
>>         at org.apache.lucene.util.TestRuleThreadAndTestName$1.evaluate(TestRuleThreadAndTestName.java:49)
>>         at org.apache.lucene.util.TestRuleIgnoreAfterMaxFailures$1.evaluate(TestRuleIgnoreAfterMaxFailures.java:65)
>>         at org.apache.lucene.util.TestRuleMarkFailure$1.evaluate(TestRuleMarkFailure.java:48)
>>         at com.carrotsearch.randomizedtesting.rules.StatementAdapter.evaluate(StatementAdapter.java:36)
>>         at com.carrotsearch.randomizedtesting.ThreadLeakControl$StatementRunner.run(ThreadLeakControl.java:365)
>>         at com.carrotsearch.randomizedtesting.ThreadLeakControl.forkTimeoutingTask(ThreadLeakControl.java:798)
>>         at com.carrotsearch.randomizedtesting.ThreadLeakControl$3.evaluate(ThreadLeakControl.java:458)
>>         at com.carrotsearch.randomizedtesting.RandomizedRunner.runSingleTest(RandomizedRunner.java:836)
>>         at com.carrotsearch.randomizedtesting.RandomizedRunner$3.evaluate(RandomizedRunner.java:738)
>>         at com.carrotsearch.randomizedtesting.RandomizedRunner$4.evaluate(RandomizedRunner.java:772)
>>         at com.carrotsearch.randomizedtesting.RandomizedRunner$5.evaluate(RandomizedRunner.java:783)
>>         at org.apache.lucene.util.AbstractBeforeAfterRule$1.evaluate(AbstractBeforeAfterRule.java:46)
>>         at org.apache.lucene.util.TestRuleStoreClassName$1.evaluate(TestRuleStoreClassName.java:42)
>>         at com.carrotsearch.randomizedtesting.rules.SystemPropertiesInvariantRule$1.evaluate(SystemPropertiesInvariantRule.java:55)
>>         at com.carrotsearch.randomizedtesting.rules.NoShadowingOrOverridesOnMethodsRule$1.evaluate(NoShadowingOrOverridesOnMethodsRule.java:39)
>>         at com.carrotsearch.randomizedtesting.rules.NoShadowingOrOverridesOnMethodsRule$1.evaluate(NoShadowingOrOverridesOnMethodsRule.java:39)
>>         at com.carrotsearch.randomizedtesting.rules.StatementAdapter.evaluate(StatementAdapter.java:36)
>>         at com.carrotsearch.randomizedtesting.rules.StatementAdapter.evaluate(StatementAdapter.java:36)
>>         at com.carrotsearch.randomizedtesting.rules.StatementAdapter.evaluate(StatementAdapter.java:36)
>>         at org.apache.lucene.util.TestRuleAssertionsRequired$1.evaluate(TestRuleAssertionsRequired.java:43)
>>         at org.apache.lucene.util.TestRuleMarkFailure$1.evaluate(TestRuleMarkFailure.java:48)
>>         at org.apache.lucene.util.TestRuleIgnoreAfterMaxFailures$1.evaluate(TestRuleIgnoreAfterMaxFailures.java:65)
>>         at org.apache.lucene.util.TestRuleIgnoreTestSuites$1.evaluate(TestRuleIgnoreTestSuites.java:55)
>>         at com.carrotsearch.randomizedtesting.rules.StatementAdapter.evaluate(StatementAdapter.java:36)
>>         at com.carrotsearch.randomizedtesting.ThreadLeakControl$StatementRunner.run(ThreadLeakControl.java:365)
>>         at java.lang.Thread.run(Thread.java:745)
>>
>>
>> REGRESSION:  org.apache.lucene.search.TestSortedSetSelector.testMiddleMaxMissingFirst
>>
>> Error Message:
>> codec does not support random access ordinals, cannot use selector: MIDDLE_MAX
>>
>> Stack Trace:
>> java.lang.UnsupportedOperationException: codec does not support random access ordinals, cannot use selector: MIDDLE_MAX
>>         at __randomizedtesting.SeedInfo.seed([7104C11261397844:8522AE52293D6589]:0)
>>         at org.apache.lucene.search.SortedSetSelector.wrap(SortedSetSelector.java:80)
>>         at org.apache.lucene.search.SortedSetSortField$1.getSortedDocValues(SortedSetSortField.java:129)
>>         at org.apache.lucene.search.FieldComparator$TermOrdValComparator.setNextReader(FieldComparator.java:828)
>>         at org.apache.lucene.search.TopFieldCollector$OneComparatorNonScoringCollector.doSetNextReader(TopFieldCollector.java:97)
>>         at org.apache.lucene.search.SimpleCollector.getLeafCollector(SimpleCollector.java:33)
>>         at org.apache.lucene.search.IndexSearcher.search(IndexSearcher.java:605)
>>         at org.apache.lucene.search.AssertingIndexSearcher.search(AssertingIndexSearcher.java:94)
>>         at org.apache.lucene.search.IndexSearcher.search(IndexSearcher.java:573)
>>         at org.apache.lucene.search.IndexSearcher.search(IndexSearcher.java:525)
>>         at org.apache.lucene.search.IndexSearcher.search(IndexSearcher.java:502)
>>         at org.apache.lucene.search.IndexSearcher.search(IndexSearcher.java:370)
>>         at org.apache.lucene.search.TestSortedSetSelector.testMiddleMaxMissingFirst(TestSortedSetSelector.java:451)
>>         at sun.reflect.NativeMethodAccessorImpl.invoke0(Native Method)
>>         at sun.reflect.NativeMethodAccessorImpl.invoke(NativeMethodAccessorImpl.java:57)
>>         at sun.reflect.DelegatingMethodAccessorImpl.invoke(DelegatingMethodAccessorImpl.java:43)
>>         at java.lang.reflect.Method.invoke(Method.java:606)
>>         at com.carrotsearch.randomizedtesting.RandomizedRunner.invoke(RandomizedRunner.java:1618)
>>         at com.carrotsearch.randomizedtesting.RandomizedRunner$6.evaluate(RandomizedRunner.java:827)
>>         at com.carrotsearch.randomizedtesting.RandomizedRunner$7.evaluate(RandomizedRunner.java:863)
>>         at com.carrotsearch.randomizedtesting.RandomizedRunner$8.evaluate(RandomizedRunner.java:877)
>>         at org.apache.lucene.util.TestRuleSetupTeardownChained$1.evaluate(TestRuleSetupTeardownChained.java:50)
>>         at org.apache.lucene.util.AbstractBeforeAfterRule$1.evaluate(AbstractBeforeAfterRule.java:46)
>>         at com.carrotsearch.randomizedtesting.rules.SystemPropertiesInvariantRule$1.evaluate(SystemPropertiesInvariantRule.java:55)
>>         at org.apache.lucene.util.TestRuleThreadAndTestName$1.evaluate(TestRuleThreadAndTestName.java:49)
>>         at org.apache.lucene.util.TestRuleIgnoreAfterMaxFailures$1.evaluate(TestRuleIgnoreAfterMaxFailures.java:65)
>>         at org.apache.lucene.util.TestRuleMarkFailure$1.evaluate(TestRuleMarkFailure.java:48)
>>         at com.carrotsearch.randomizedtesting.rules.StatementAdapter.evaluate(StatementAdapter.java:36)
>>         at com.carrotsearch.randomizedtesting.ThreadLeakControl$StatementRunner.run(ThreadLeakControl.java:365)
>>         at com.carrotsearch.randomizedtesting.ThreadLeakControl.forkTimeoutingTask(ThreadLeakControl.java:798)
>>         at com.carrotsearch.randomizedtesting.ThreadLeakControl$3.evaluate(ThreadLeakControl.java:458)
>>         at com.carrotsearch.randomizedtesting.RandomizedRunner.runSingleTest(RandomizedRunner.java:836)
>>         at com.carrotsearch.randomizedtesting.RandomizedRunner$3.evaluate(RandomizedRunner.java:738)
>>         at com.carrotsearch.randomizedtesting.RandomizedRunner$4.evaluate(RandomizedRunner.java:772)
>>         at com.carrotsearch.randomizedtesting.RandomizedRunner$5.evaluate(RandomizedRunner.java:783)
>>         at org.apache.lucene.util.AbstractBeforeAfterRule$1.evaluate(AbstractBeforeAfterRule.java:46)
>>         at org.apache.lucene.util.TestRuleStoreClassName$1.evaluate(TestRuleStoreClassName.java:42)
>>         at com.carrotsearch.randomizedtesting.rules.SystemPropertiesInvariantRule$1.evaluate(SystemPropertiesInvariantRule.java:55)
>>         at com.carrotsearch.randomizedtesting.rules.NoShadowingOrOverridesOnMethodsRule$1.evaluate(NoShadowingOrOverridesOnMethodsRule.java:39)
>>         at com.carrotsearch.randomizedtesting.rules.NoShadowingOrOverridesOnMethodsRule$1.evaluate(NoShadowingOrOverridesOnMethodsRule.java:39)
>>         at com.carrotsearch.randomizedtesting.rules.StatementAdapter.evaluate(StatementAdapter.java:36)
>>         at com.carrotsearch.randomizedtesting.rules.StatementAdapter.evaluate(StatementAdapter.java:36)
>>         at com.carrotsearch.randomizedtesting.rules.StatementAdapter.evaluate(StatementAdapter.java:36)
>>         at org.apache.lucene.util.TestRuleAssertionsRequired$1.evaluate(TestRuleAssertionsRequired.java:43)
>>         at org.apache.lucene.util.TestRuleMarkFailure$1.evaluate(TestRuleMarkFailure.java:48)
>>         at org.apache.lucene.util.TestRuleIgnoreAfterMaxFailures$1.evaluate(TestRuleIgnoreAfterMaxFailures.java:65)
>>         at org.apache.lucene.util.TestRuleIgnoreTestSuites$1.evaluate(TestRuleIgnoreTestSuites.java:55)
>>         at com.carrotsearch.randomizedtesting.rules.StatementAdapter.evaluate(StatementAdapter.java:36)
>>         at com.carrotsearch.randomizedtesting.ThreadLeakControl$StatementRunner.run(ThreadLeakControl.java:365)
>>         at java.lang.Thread.run(Thread.java:745)
>>
>>
>> REGRESSION:  org.apache.lucene.search.TestSortedSetSelector.testMiddleMaxMissingLast
>>
>> Error Message:
>> codec does not support random access ordinals, cannot use selector: MIDDLE_MAX
>>
>> Stack Trace:
>> java.lang.UnsupportedOperationException: codec does not support random access ordinals, cannot use selector: MIDDLE_MAX
>>         at __randomizedtesting.SeedInfo.seed([7104C11261397844:5F04CC1A74C4FA00]:0)
>>         at org.apache.lucene.search.SortedSetSelector.wrap(SortedSetSelector.java:80)
>>         at org.apache.lucene.search.SortedSetSortField$1.getSortedDocValues(SortedSetSortField.java:129)
>>         at org.apache.lucene.search.FieldComparator$TermOrdValComparator.setNextReader(FieldComparator.java:828)
>>         at org.apache.lucene.search.TopFieldCollector$OneComparatorNonScoringCollector.doSetNextReader(TopFieldCollector.java:97)
>>         at org.apache.lucene.search.SimpleCollector.getLeafCollector(SimpleCollector.java:33)
>>         at org.apache.lucene.search.IndexSearcher.search(IndexSearcher.java:605)
>>         at org.apache.lucene.search.AssertingIndexSearcher.search(AssertingIndexSearcher.java:94)
>>         at org.apache.lucene.search.IndexSearcher.search(IndexSearcher.java:573)
>>         at org.apache.lucene.search.IndexSearcher.search(IndexSearcher.java:525)
>>         at org.apache.lucene.search.IndexSearcher.search(IndexSearcher.java:502)
>>         at org.apache.lucene.search.IndexSearcher.search(IndexSearcher.java:370)
>>         at org.apache.lucene.search.TestSortedSetSelector.testMiddleMaxMissingLast(TestSortedSetSelector.java:489)
>>         at sun.reflect.NativeMethodAccessorImpl.invoke0(Native Method)
>>         at sun.reflect.NativeMethodAccessorImpl.invoke(NativeMethodAccessorImpl.java:57)
>>         at sun.reflect.DelegatingMethodAccessorImpl.invoke(DelegatingMethodAccessorImpl.java:43)
>>         at java.lang.reflect.Method.invoke(Method.java:606)
>>         at com.carrotsearch.randomizedtesting.RandomizedRunner.invoke(RandomizedRunner.java:1618)
>>         at com.carrotsearch.randomizedtesting.RandomizedRunner$6.evaluate(RandomizedRunner.java:827)
>>         at com.carrotsearch.randomizedtesting.RandomizedRunner$7.evaluate(RandomizedRunner.java:863)
>>         at com.carrotsearch.randomizedtesting.RandomizedRunner$8.evaluate(RandomizedRunner.java:877)
>>         at org.apache.lucene.util.TestRuleSetupTeardownChained$1.evaluate(TestRuleSetupTeardownChained.java:50)
>>         at org.apache.lucene.util.AbstractBeforeAfterRule$1.evaluate(AbstractBeforeAfterRule.java:46)
>>         at com.carrotsearch.randomizedtesting.rules.SystemPropertiesInvariantRule$1.evaluate(SystemPropertiesInvariantRule.java:55)
>>         at org.apache.lucene.util.TestRuleThreadAndTestName$1.evaluate(TestRuleThreadAndTestName.java:49)
>>         at org.apache.lucene.util.TestRuleIgnoreAfterMaxFailures$1.evaluate(TestRuleIgnoreAfterMaxFailures.java:65)
>>         at org.apache.lucene.util.TestRuleMarkFailure$1.evaluate(TestRuleMarkFailure.java:48)
>>         at com.carrotsearch.randomizedtesting.rules.StatementAdapter.evaluate(StatementAdapter.java:36)
>>         at com.carrotsearch.randomizedtesting.ThreadLeakControl$StatementRunner.run(ThreadLeakControl.java:365)
>>         at com.carrotsearch.randomizedtesting.ThreadLeakControl.forkTimeoutingTask(ThreadLeakControl.java:798)
>>         at com.carrotsearch.randomizedtesting.ThreadLeakControl$3.evaluate(ThreadLeakControl.java:458)
>>         at com.carrotsearch.randomizedtesting.RandomizedRunner.runSingleTest(RandomizedRunner.java:836)
>>         at com.carrotsearch.randomizedtesting.RandomizedRunner$3.evaluate(RandomizedRunner.java:738)
>>         at com.carrotsearch.randomizedtesting.RandomizedRunner$4.evaluate(RandomizedRunner.java:772)
>>         at com.carrotsearch.randomizedtesting.RandomizedRunner$5.evaluate(RandomizedRunner.java:783)
>>         at org.apache.lucene.util.AbstractBeforeAfterRule$1.evaluate(AbstractBeforeAfterRule.java:46)
>>         at org.apache.lucene.util.TestRuleStoreClassName$1.evaluate(TestRuleStoreClassName.java:42)
>>         at com.carrotsearch.randomizedtesting.rules.SystemPropertiesInvariantRule$1.evaluate(SystemPropertiesInvariantRule.java:55)
>>         at com.carrotsearch.randomizedtesting.rules.NoShadowingOrOverridesOnMethodsRule$1.evaluate(NoShadowingOrOverridesOnMethodsRule.java:39)
>>         at com.carrotsearch.randomizedtesting.rules.NoShadowingOrOverridesOnMethodsRule$1.evaluate(NoShadowingOrOverridesOnMethodsRule.java:39)
>>         at com.carrotsearch.randomizedtesting.rules.StatementAdapter.evaluate(StatementAdapter.java:36)
>>         at com.carrotsearch.randomizedtesting.rules.StatementAdapter.evaluate(StatementAdapter.java:36)
>>         at com.carrotsearch.randomizedtesting.rules.StatementAdapter.evaluate(StatementAdapter.java:36)
>>         at org.apache.lucene.util.TestRuleAssertionsRequired$1.evaluate(TestRuleAssertionsRequired.java:43)
>>         at org.apache.lucene.util.TestRuleMarkFailure$1.evaluate(TestRuleMarkFailure.java:48)
>>         at org.apache.lucene.util.TestRuleIgnoreAfterMaxFailures$1.evaluate(TestRuleIgnoreAfterMaxFailures.java:65)
>>         at org.apache.lucene.util.TestRuleIgnoreTestSuites$1.evaluate(TestRuleIgnoreTestSuites.java:55)
>>         at com.carrotsearch.randomizedtesting.rules.StatementAdapter.evaluate(StatementAdapter.java:36)
>>         at com.carrotsearch.randomizedtesting.ThreadLeakControl$StatementRunner.run(ThreadLeakControl.java:365)
>>         at java.lang.Thread.run(Thread.java:745)
>>
>>
>> REGRESSION:  org.apache.lucene.search.TestSortedSetSelector.testMaxSingleton
>>
>> Error Message:
>> codec does not support random access ordinals, cannot use selector: MAX
>>
>> Stack Trace:
>> java.lang.UnsupportedOperationException: codec does not support random access ordinals, cannot use selector: MAX
>>         at __randomizedtesting.SeedInfo.seed([7104C11261397844:ADC7FCB3C2984018]:0)
>>         at org.apache.lucene.search.SortedSetSelector.wrap(SortedSetSelector.java:80)
>>         at org.apache.lucene.search.SortedSetSortField$1.getSortedDocValues(SortedSetSortField.java:129)
>>         at org.apache.lucene.search.FieldComparator$TermOrdValComparator.setNextReader(FieldComparator.java:828)
>>         at org.apache.lucene.search.TopFieldCollector$OneComparatorNonScoringCollector.doSetNextReader(TopFieldCollector.java:97)
>>         at org.apache.lucene.search.SimpleCollector.getLeafCollector(SimpleCollector.java:33)
>>         at org.apache.lucene.search.IndexSearcher.search(IndexSearcher.java:605)
>>         at org.apache.lucene.search.AssertingIndexSearcher.search(AssertingIndexSearcher.java:94)
>>         at org.apache.lucene.search.IndexSearcher.search(IndexSearcher.java:573)
>>         at org.apache.lucene.search.IndexSearcher.search(IndexSearcher.java:525)
>>         at org.apache.lucene.search.IndexSearcher.search(IndexSearcher.java:502)
>>         at org.apache.lucene.search.IndexSearcher.search(IndexSearcher.java:370)
>>         at org.apache.lucene.search.TestSortedSetSelector.testMaxSingleton(TestSortedSetSelector.java:187)
>>         at sun.reflect.NativeMethodAccessorImpl.invoke0(Native Method)
>>         at sun.reflect.NativeMethodAccessorImpl.invoke(NativeMethodAccessorImpl.java:57)
>>         at sun.reflect.DelegatingMethodAccessorImpl.invoke(DelegatingMethodAccessorImpl.java:43)
>>         at java.lang.reflect.Method.invoke(Method.java:606)
>>         at com.carrotsearch.randomizedtesting.RandomizedRunner.invoke(RandomizedRunner.java:1618)
>>         at com.carrotsearch.randomizedtesting.RandomizedRunner$6.evaluate(RandomizedRunner.java:827)
>>         at com.carrotsearch.randomizedtesting.RandomizedRunner$7.evaluate(RandomizedRunner.java:863)
>>         at com.carrotsearch.randomizedtesting.RandomizedRunner$8.evaluate(RandomizedRunner.java:877)
>>         at org.apache.lucene.util.TestRuleSetupTeardownChained$1.evaluate(TestRuleSetupTeardownChained.java:50)
>>         at org.apache.lucene.util.AbstractBeforeAfterRule$1.evaluate(AbstractBeforeAfterRule.java:46)
>>         at com.carrotsearch.randomizedtesting.rules.SystemPropertiesInvariantRule$1.evaluate(SystemPropertiesInvariantRule.java:55)
>>         at org.apache.lucene.util.TestRuleThreadAndTestName$1.evaluate(TestRuleThreadAndTestName.java:49)
>>         at org.apache.lucene.util.TestRuleIgnoreAfterMaxFailures$1.evaluate(TestRuleIgnoreAfterMaxFailures.java:65)
>>         at org.apache.lucene.util.TestRuleMarkFailure$1.evaluate(TestRuleMarkFailure.java:48)
>>         at com.carrotsearch.randomizedtesting.rules.StatementAdapter.evaluate(StatementAdapter.java:36)
>>         at com.carrotsearch.randomizedtesting.ThreadLeakControl$StatementRunner.run(ThreadLeakControl.java:365)
>>         at com.carrotsearch.randomizedtesting.ThreadLeakControl.forkTimeoutingTask(ThreadLeakControl.java:798)
>>         at com.carrotsearch.randomizedtesting.ThreadLeakControl$3.evaluate(ThreadLeakControl.java:458)
>>         at com.carrotsearch.randomizedtesting.RandomizedRunner.runSingleTest(RandomizedRunner.java:836)
>>         at com.carrotsearch.randomizedtesting.RandomizedRunner$3.evaluate(RandomizedRunner.java:738)
>>         at com.carrotsearch.randomizedtesting.RandomizedRunner$4.evaluate(RandomizedRunner.java:772)
>>         at com.carrotsearch.randomizedtesting.RandomizedRunner$5.evaluate(RandomizedRunner.java:783)
>>         at org.apache.lucene.util.AbstractBeforeAfterRule$1.evaluate(AbstractBeforeAfterRule.java:46)
>>         at org.apache.lucene.util.TestRuleStoreClassName$1.evaluate(TestRuleStoreClassName.java:42)
>>         at com.carrotsearch.randomizedtesting.rules.SystemPropertiesInvariantRule$1.evaluate(SystemPropertiesInvariantRule.java:55)
>>         at com.carrotsearch.randomizedtesting.rules.NoShadowingOrOverridesOnMethodsRule$1.evaluate(NoShadowingOrOverridesOnMethodsRule.java:39)
>>         at com.carrotsearch.randomizedtesting.rules.NoShadowingOrOverridesOnMethodsRule$1.evaluate(NoShadowingOrOverridesOnMethodsRule.java:39)
>>         at com.carrotsearch.randomizedtesting.rules.StatementAdapter.evaluate(StatementAdapter.java:36)
>>         at com.carrotsearch.randomizedtesting.rules.StatementAdapter.evaluate(StatementAdapter.java:36)
>>         at com.carrotsearch.randomizedtesting.rules.StatementAdapter.evaluate(StatementAdapter.java:36)
>>         at org.apache.lucene.util.TestRuleAssertionsRequired$1.evaluate(TestRuleAssertionsRequired.java:43)
>>         at org.apache.lucene.util.TestRuleMarkFailure$1.evaluate(TestRuleMarkFailure.java:48)
>>         at org.apache.lucene.util.TestRuleIgnoreAfterMaxFailures$1.evaluate(TestRuleIgnoreAfterMaxFailures.java:65)
>>         at org.apache.lucene.util.TestRuleIgnoreTestSuites$1.evaluate(TestRuleIgnoreTestSuites.java:55)
>>         at com.carrotsearch.randomizedtesting.rules.StatementAdapter.evaluate(StatementAdapter.java:36)
>>         at com.carrotsearch.randomizedtesting.ThreadLeakControl$StatementRunner.run(ThreadLeakControl.java:365)
>>         at java.lang.Thread.run(Thread.java:745)
>>
>>
>> REGRESSION:  org.apache.lucene.search.TestSortedSetSelector.testMiddleMaxReverse
>>
>> Error Message:
>> codec does not support random access ordinals, cannot use selector: MIDDLE_MAX
>>
>> Stack Trace:
>> java.lang.UnsupportedOperationException: codec does not support random access ordinals, cannot use selector: MIDDLE_MAX
>>         at __randomizedtesting.SeedInfo.seed([7104C11261397844:48FA7B3AF19A619B]:0)
>>         at org.apache.lucene.search.SortedSetSelector.wrap(SortedSetSelector.java:80)
>>         at org.apache.lucene.search.SortedSetSortField$1.getSortedDocValues(SortedSetSortField.java:129)
>>         at org.apache.lucene.search.FieldComparator$TermOrdValComparator.setNextReader(FieldComparator.java:828)
>>         at org.apache.lucene.search.TopFieldCollector$OneComparatorNonScoringCollector.doSetNextReader(TopFieldCollector.java:97)
>>         at org.apache.lucene.search.SimpleCollector.getLeafCollector(SimpleCollector.java:33)
>>         at org.apache.lucene.search.IndexSearcher.search(IndexSearcher.java:605)
>>         at org.apache.lucene.search.AssertingIndexSearcher.search(AssertingIndexSearcher.java:94)
>>         at org.apache.lucene.search.IndexSearcher.search(IndexSearcher.java:573)
>>         at org.apache.lucene.search.IndexSearcher.search(IndexSearcher.java:525)
>>         at org.apache.lucene.search.IndexSearcher.search(IndexSearcher.java:502)
>>         at org.apache.lucene.search.IndexSearcher.search(IndexSearcher.java:370)
>>         at org.apache.lucene.search.TestSortedSetSelector.testMiddleMaxReverse(TestSortedSetSelector.java:415)
>>         at sun.reflect.NativeMethodAccessorImpl.invoke0(Native Method)
>>         at sun.reflect.NativeMethodAccessorImpl.invoke(NativeMethodAccessorImpl.java:57)
>>         at sun.reflect.DelegatingMethodAccessorImpl.invoke(DelegatingMethodAccessorImpl.java:43)
>>         at java.lang.reflect.Method.invoke(Method.java:606)
>>         at com.carrotsearch.randomizedtesting.RandomizedRunner.invoke(RandomizedRunner.java:1618)
>>         at com.carrotsearch.randomizedtesting.RandomizedRunner$6.evaluate(RandomizedRunner.java:827)
>>         at com.carrotsearch.randomizedtesting.RandomizedRunner$7.evaluate(RandomizedRunner.java:863)
>>         at com.carrotsearch.randomizedtesting.RandomizedRunner$8.evaluate(RandomizedRunner.java:877)
>>         at org.apache.lucene.util.TestRuleSetupTeardownChained$1.evaluate(TestRuleSetupTeardownChained.java:50)
>>         at org.apache.lucene.util.AbstractBeforeAfterRule$1.evaluate(AbstractBeforeAfterRule.java:46)
>>         at com.carrotsearch.randomizedtesting.rules.SystemPropertiesInvariantRule$1.evaluate(SystemPropertiesInvariantRule.java:55)
>>         at org.apache.lucene.util.TestRuleThreadAndTestName$1.evaluate(TestRuleThreadAndTestName.java:49)
>>         at org.apache.lucene.util.TestRuleIgnoreAfterMaxFailures$1.evaluate(TestRuleIgnoreAfterMaxFailures.java:65)
>>         at org.apache.lucene.util.TestRuleMarkFailure$1.evaluate(TestRuleMarkFailure.java:48)
>>         at com.carrotsearch.randomizedtesting.rules.StatementAdapter.evaluate(StatementAdapter.java:36)
>>         at com.carrotsearch.randomizedtesting.ThreadLeakControl$StatementRunner.run(ThreadLeakControl.java:365)
>>         at com.carrotsearch.randomizedtesting.ThreadLeakControl.forkTimeoutingTask(ThreadLeakControl.java:798)
>>         at com.carrotsearch.randomizedtesting.ThreadLeakControl$3.evaluate(ThreadLeakControl.java:458)
>>         at com.carrotsearch.randomizedtesting.RandomizedRunner.runSingleTest(RandomizedRunner.java:836)
>>         at com.carrotsearch.randomizedtesting.RandomizedRunner$3.evaluate(RandomizedRunner.java:738)
>>         at com.carrotsearch.randomizedtesting.RandomizedRunner$4.evaluate(RandomizedRunner.java:772)
>>         at com.carrotsearch.randomizedtesting.RandomizedRunner$5.evaluate(RandomizedRunner.java:783)
>>         at org.apache.lucene.util.AbstractBeforeAfterRule$1.evaluate(AbstractBeforeAfterRule.java:46)
>>         at org.apache.lucene.util.TestRuleStoreClassName$1.evaluate(TestRuleStoreClassName.java:42)
>>         at com.carrotsearch.randomizedtesting.rules.SystemPropertiesInvariantRule$1.evaluate(SystemPropertiesInvariantRule.java:55)
>>         at com.carrotsearch.randomizedtesting.rules.NoShadowingOrOverridesOnMethodsRule$1.evaluate(NoShadowingOrOverridesOnMethodsRule.java:39)
>>         at com.carrotsearch.randomizedtesting.rules.NoShadowingOrOverridesOnMethodsRule$1.evaluate(NoShadowingOrOverridesOnMethodsRule.java:39)
>>         at com.carrotsearch.randomizedtesting.rules.StatementAdapter.evaluate(StatementAdapter.java:36)
>>         at com.carrotsearch.randomizedtesting.rules.StatementAdapter.evaluate(StatementAdapter.java:36)
>>         at com.carrotsearch.randomizedtesting.rules.StatementAdapter.evaluate(StatementAdapter.java:36)
>>         at org.apache.lucene.util.TestRuleAssertionsRequired$1.evaluate(TestRuleAssertionsRequired.java:43)
>>         at org.apache.lucene.util.TestRuleMarkFailure$1.evaluate(TestRuleMarkFailure.java:48)
>>         at org.apache.lucene.util.TestRuleIgnoreAfterMaxFailures$1.evaluate(TestRuleIgnoreAfterMaxFailures.java:65)
>>         at org.apache.lucene.util.TestRuleIgnoreTestSuites$1.evaluate(TestRuleIgnoreTestSuites.java:55)
>>         at com.carrotsearch.randomizedtesting.rules.StatementAdapter.evaluate(StatementAdapter.java:36)
>>         at com.carrotsearch.randomizedtesting.ThreadLeakControl$StatementRunner.run(ThreadLeakControl.java:365)
>>         at java.lang.Thread.run(Thread.java:745)
>>
>>
>> REGRESSION:  org.apache.lucene.search.TestSortedSetSelector.testMax
>>
>> Error Message:
>> codec does not support random access ordinals, cannot use selector: MAX
>>
>> Stack Trace:
>> java.lang.UnsupportedOperationException: codec does not support random access ordinals, cannot use selector: MAX
>>         at __randomizedtesting.SeedInfo.seed([7104C11261397844:D2AC80669BF1CCAD]:0)
>>         at org.apache.lucene.search.SortedSetSelector.wrap(SortedSetSelector.java:80)
>>         at org.apache.lucene.search.SortedSetSortField$1.getSortedDocValues(SortedSetSortField.java:129)
>>         at org.apache.lucene.search.FieldComparator$TermOrdValComparator.setNextReader(FieldComparator.java:828)
>>         at org.apache.lucene.search.TopFieldCollector$OneComparatorNonScoringCollector.doSetNextReader(TopFieldCollector.java:97)
>>         at org.apache.lucene.search.SimpleCollector.getLeafCollector(SimpleCollector.java:33)
>>         at org.apache.lucene.search.IndexSearcher.search(IndexSearcher.java:605)
>>         at org.apache.lucene.search.AssertingIndexSearcher.search(AssertingIndexSearcher.java:94)
>>         at org.apache.lucene.search.IndexSearcher.search(IndexSearcher.java:573)
>>         at org.apache.lucene.search.IndexSearcher.search(IndexSearcher.java:525)
>>         at org.apache.lucene.search.IndexSearcher.search(IndexSearcher.java:502)
>>         at org.apache.lucene.search.IndexSearcher.search(IndexSearcher.java:370)
>>         at org.apache.lucene.search.TestSortedSetSelector.testMax(TestSortedSetSelector.java:55)
>>         at sun.reflect.NativeMethodAccessorImpl.invoke0(Native Method)
>>         at sun.reflect.NativeMethodAccessorImpl.invoke(NativeMethodAccessorImpl.java:57)
>>         at sun.reflect.DelegatingMethodAccessorImpl.invoke(DelegatingMethodAccessorImpl.java:43)
>>         at java.lang.reflect.Method.invoke(Method.java:606)
>>         at com.carrotsearch.randomizedtesting.RandomizedRunner.invoke(RandomizedRunner.java:1618)
>>         at com.carrotsearch.randomizedtesting.RandomizedRunner$6.evaluate(RandomizedRunner.java:827)
>>         at com.carrotsearch.randomizedtesting.RandomizedRunner$7.evaluate(RandomizedRunner.java:863)
>>         at com.carrotsearch.randomizedtesting.RandomizedRunner$8.evaluate(RandomizedRunner.java:877)
>>         at org.apache.lucene.util.TestRuleSetupTeardownChained$1.evaluate(TestRuleSetupTeardownChained.java:50)
>>         at org.apache.lucene.util.AbstractBeforeAfterRule$1.evaluate(AbstractBeforeAfterRule.java:46)
>>         at com.carrotsearch.randomizedtesting.rules.SystemPropertiesInvariantRule$1.evaluate(SystemPropertiesInvariantRule.java:55)
>>         at org.apache.lucene.util.TestRuleThreadAndTestName$1.evaluate(TestRuleThreadAndTestName.java:49)
>>         at org.apache.lucene.util.TestRuleIgnoreAfterMaxFailures$1.evaluate(TestRuleIgnoreAfterMaxFailures.java:65)
>>         at org.apache.lucene.util.TestRuleMarkFailure$1.evaluate(TestRuleMarkFailure.java:48)
>>         at com.carrotsearch.randomizedtesting.rules.StatementAdapter.evaluate(StatementAdapter.java:36)
>>         at com.carrotsearch.randomizedtesting.ThreadLeakControl$StatementRunner.run(ThreadLeakControl.java:365)
>>         at com.carrotsearch.randomizedtesting.ThreadLeakControl.forkTimeoutingTask(ThreadLeakControl.java:798)
>>         at com.carrotsearch.randomizedtesting.ThreadLeakControl$3.evaluate(ThreadLeakControl.java:458)
>>         at com.carrotsearch.randomizedtesting.RandomizedRunner.runSingleTest(RandomizedRunner.java:836)
>>         at com.carrotsearch.randomizedtesting.RandomizedRunner$3.evaluate(RandomizedRunner.java:738)
>>         at com.carrotsearch.randomizedtesting.RandomizedRunner$4.evaluate(RandomizedRunner.java:772)
>>         at com.carrotsearch.randomizedtesting.RandomizedRunner$5.evaluate(RandomizedRunner.java:783)
>>         at org.apache.lucene.util.AbstractBeforeAfterRule$1.evaluate(AbstractBeforeAfterRule.java:46)
>>         at org.apache.lucene.util.TestRuleStoreClassName$1.evaluate(TestRuleStoreClassName.java:42)
>>         at com.carrotsearch.randomizedtesting.rules.SystemPropertiesInvariantRule$1.evaluate(SystemPropertiesInvariantRule.java:55)
>>         at com.carrotsearch.randomizedtesting.rules.NoShadowingOrOverridesOnMethodsRule$1.evaluate(NoShadowingOrOverridesOnMethodsRule.java:39)
>>         at com.carrotsearch.randomizedtesting.rules.NoShadowingOrOverridesOnMethodsRule$1.evaluate(NoShadowingOrOverridesOnMethodsRule.java:39)
>>         at com.carrotsearch.randomizedtesting.rules.StatementAdapter.evaluate(StatementAdapter.java:36)
>>         at com.carrotsearch.randomizedtesting.rules.StatementAdapter.evaluate(StatementAdapter.java:36)
>>         at com.carrotsearch.randomizedtesting.rules.StatementAdapter.evaluate(StatementAdapter.java:36)
>>         at org.apache.lucene.util.TestRuleAssertionsRequired$1.evaluate(TestRuleAssertionsRequired.java:43)
>>         at org.apache.lucene.util.TestRuleMarkFailure$1.evaluate(TestRuleMarkFailure.java:48)
>>         at org.apache.lucene.util.TestRuleIgnoreAfterMaxFailures$1.evaluate(TestRuleIgnoreAfterMaxFailures.java:65)
>>         at org.apache.lucene.util.TestRuleIgnoreTestSuites$1.evaluate(TestRuleIgnoreTestSuites.java:55)
>>         at com.carrotsearch.randomizedtesting.rules.StatementAdapter.evaluate(StatementAdapter.java:36)
>>         at com.carrotsearch.randomizedtesting.ThreadLeakControl$StatementRunner.run(ThreadLeakControl.java:365)
>>         at java.lang.Thread.run(Thread.java:745)
>>
>>
>> REGRESSION:  org.apache.lucene.search.TestSortedSetSelector.testMiddleMin
>>
>> Error Message:
>> codec does not support random access ordinals, cannot use selector: MIDDLE_MIN
>>
>> Stack Trace:
>> java.lang.UnsupportedOperationException: codec does not support random access ordinals, cannot use selector: MIDDLE_MIN
>>         at __randomizedtesting.SeedInfo.seed([7104C11261397844:FCBFD170A4004B35]:0)
>>         at org.apache.lucene.search.SortedSetSelector.wrap(SortedSetSelector.java:80)
>>         at org.apache.lucene.search.SortedSetSortField$1.getSortedDocValues(SortedSetSortField.java:129)
>>         at org.apache.lucene.search.FieldComparator$TermOrdValComparator.setNextReader(FieldComparator.java:828)
>>         at org.apache.lucene.search.TopFieldCollector$OneComparatorNonScoringCollector.doSetNextReader(TopFieldCollector.java:97)
>>         at org.apache.lucene.search.SimpleCollector.getLeafCollector(SimpleCollector.java:33)
>>         at org.apache.lucene.search.IndexSearcher.search(IndexSearcher.java:605)
>>         at org.apache.lucene.search.AssertingIndexSearcher.search(AssertingIndexSearcher.java:94)
>>         at org.apache.lucene.search.IndexSearcher.search(IndexSearcher.java:573)
>>         at org.apache.lucene.search.IndexSearcher.search(IndexSearcher.java:525)
>>         at org.apache.lucene.search.IndexSearcher.search(IndexSearcher.java:502)
>>         at org.apache.lucene.search.IndexSearcher.search(IndexSearcher.java:370)
>>         at org.apache.lucene.search.TestSortedSetSelector.testMiddleMin(TestSortedSetSelector.java:218)
>>         at sun.reflect.NativeMethodAccessorImpl.invoke0(Native Method)
>>         at sun.reflect.NativeMethodAccessorImpl.invoke(NativeMethodAccessorImpl.java:57)
>>         at sun.reflect.DelegatingMethodAccessorImpl.invoke(DelegatingMethodAccessorImpl.java:43)
>>         at java.lang.reflect.Method.invoke(Method.java:606)
>>         at com.carrotsearch.randomizedtesting.RandomizedRunner.invoke(RandomizedRunner.java:1618)
>>         at com.carrotsearch.randomizedtesting.RandomizedRunner$6.evaluate(RandomizedRunner.java:827)
>>         at com.carrotsearch.randomizedtesting.RandomizedRunner$7.evaluate(RandomizedRunner.java:863)
>>         at com.carrotsearch.randomizedtesting.RandomizedRunner$8.evaluate(RandomizedRunner.java:877)
>>         at org.apache.lucene.util.TestRuleSetupTeardownChained$1.evaluate(TestRuleSetupTeardownChained.java:50)
>>         at org.apache.lucene.util.AbstractBeforeAfterRule$1.evaluate(AbstractBeforeAfterRule.java:46)
>>         at com.carrotsearch.randomizedtesting.rules.SystemPropertiesInvariantRule$1.evaluate(SystemPropertiesInvariantRule.java:55)
>>         at org.apache.lucene.util.TestRuleThreadAndTestName$1.evaluate(TestRuleThreadAndTestName.java:49)
>>         at org.apache.lucene.util.TestRuleIgnoreAfterMaxFailures$1.evaluate(TestRuleIgnoreAfterMaxFailures.java:65)
>>         at org.apache.lucene.util.TestRuleMarkFailure$1.evaluate(TestRuleMarkFailure.java:48)
>>         at com.carrotsearch.randomizedtesting.rules.StatementAdapter.evaluate(StatementAdapter.java:36)
>>         at com.carrotsearch.randomizedtesting.ThreadLeakControl$StatementRunner.run(ThreadLeakControl.java:365)
>>         at com.carrotsearch.randomizedtesting.ThreadLeakControl.forkTimeoutingTask(ThreadLeakControl.java:798)
>>         at com.carrotsearch.randomizedtesting.ThreadLeakControl$3.evaluate(ThreadLeakControl.java:458)
>>         at com.carrotsearch.randomizedtesting.RandomizedRunner.runSingleTest(RandomizedRunner.java:836)
>>         at com.carrotsearch.randomizedtesting.RandomizedRunner$3.evaluate(RandomizedRunner.java:738)
>>         at com.carrotsearch.randomizedtesting.RandomizedRunner$4.evaluate(RandomizedRunner.java:772)
>>         at com.carrotsearch.randomizedtesting.RandomizedRunner$5.evaluate(RandomizedRunner.java:783)
>>         at org.apache.lucene.util.AbstractBeforeAfterRule$1.evaluate(AbstractBeforeAfterRule.java:46)
>>         at org.apache.lucene.util.TestRuleStoreClassName$1.evaluate(TestRuleStoreClassName.java:42)
>>         at com.carrotsearch.randomizedtesting.rules.SystemPropertiesInvariantRule$1.evaluate(SystemPropertiesInvariantRule.java:55)
>>         at com.carrotsearch.randomizedtesting.rules.NoShadowingOrOverridesOnMethodsRule$1.evaluate(NoShadowingOrOverridesOnMethodsRule.java:39)
>>         at com.carrotsearch.randomizedtesting.rules.NoShadowingOrOverridesOnMethodsRule$1.evaluate(NoShadowingOrOverridesOnMethodsRule.java:39)
>>         at com.carrotsearch.randomizedtesting.rules.StatementAdapter.evaluate(StatementAdapter.java:36)
>>         at com.carrotsearch.randomizedtesting.rules.StatementAdapter.evaluate(StatementAdapter.java:36)
>>         at com.carrotsearch.randomizedtesting.rules.StatementAdapter.evaluate(StatementAdapter.java:36)
>>         at org.apache.lucene.util.TestRuleAssertionsRequired$1.evaluate(TestRuleAssertionsRequired.java:43)
>>         at org.apache.lucene.util.TestRuleMarkFailure$1.evaluate(TestRuleMarkFailure.java:48)
>>         at org.apache.lucene.util.TestRuleIgnoreAfterMaxFailures$1.evaluate(TestRuleIgnoreAfterMaxFailures.java:65)
>>         at org.apache.lucene.util.TestRuleIgnoreTestSuites$1.evaluate(TestRuleIgnoreTestSuites.java:55)
>>         at com.carrotsearch.randomizedtesting.rules.StatementAdapter.evaluate(StatementAdapter.java:36)
>>         at com.carrotsearch.randomizedtesting.ThreadLeakControl$StatementRunner.run(ThreadLeakControl.java:365)
>>         at java.lang.Thread.run(Thread.java:745)
>>
>>
>> REGRESSION:  org.apache.lucene.search.TestSortedSetSelector.testMiddleMinMissingLast
>>
>> Error Message:
>> codec does not support random access ordinals, cannot use selector: MIDDLE_MIN
>>
>> Stack Trace:
>> java.lang.UnsupportedOperationException: codec does not support random access ordinals, cannot use selector: MIDDLE_MIN
>>         at __randomizedtesting.SeedInfo.seed([7104C11261397844:C45CEDD600004E6A]:0)
>>         at org.apache.lucene.search.SortedSetSelector.wrap(SortedSetSelector.java:80)
>>         at org.apache.lucene.search.SortedSetSortField$1.getSortedDocValues(SortedSetSortField.java:129)
>>         at org.apache.lucene.search.FieldComparator$TermOrdValComparator.setNextReader(FieldComparator.java:828)
>>         at org.apache.lucene.search.TopFieldCollector$OneComparatorNonScoringCollector.doSetNextReader(TopFieldCollector.java:97)
>>         at org.apache.lucene.search.SimpleCollector.getLeafCollector(SimpleCollector.java:33)
>>         at org.apache.lucene.search.IndexSearcher.search(IndexSearcher.java:605)
>>         at org.apache.lucene.search.AssertingIndexSearcher.search(AssertingIndexSearcher.java:94)
>>         at org.apache.lucene.search.IndexSearcher.search(IndexSearcher.java:573)
>>         at org.apache.lucene.search.IndexSearcher.search(IndexSearcher.java:525)
>>         at org.apache.lucene.search.IndexSearcher.search(IndexSearcher.java:502)
>>         at org.apache.lucene.search.IndexSearcher.search(IndexSearcher.java:370)
>>         at org.apache.lucene.search.TestSortedSetSelector.testMiddleMinMissingLast(TestSortedSetSelector.java:323)
>>         at sun.reflect.NativeMethodAccessorImpl.invoke0(Native Method)
>>         at sun.reflect.NativeMethodAccessorImpl.invoke(NativeMethodAccessorImpl.java:57)
>>         at sun.reflect.DelegatingMethodAccessorImpl.invoke(DelegatingMethodAccessorImpl.java:43)
>>         at java.lang.reflect.Method.invoke(Method.java:606)
>>         at com.carrotsearch.randomizedtesting.RandomizedRunner.invoke(RandomizedRunner.java:1618)
>>         at com.carrotsearch.randomizedtesting.RandomizedRunner$6.evaluate(RandomizedRunner.java:827)
>>         at com.carrotsearch.randomizedtesting.RandomizedRunner$7.evaluate(RandomizedRunner.java:863)
>>         at com.carrotsearch.randomizedtesting.RandomizedRunner$8.evaluate(RandomizedRunner.java:877)
>>         at org.apache.lucene.util.TestRuleSetupTeardownChained$1.evaluate(TestRuleSetupTeardownChained.java:50)
>>         at org.apache.lucene.util.AbstractBeforeAfterRule$1.evaluate(AbstractBeforeAfterRule.java:46)
>>         at com.carrotsearch.randomizedtesting.rules.SystemPropertiesInvariantRule$1.evaluate(SystemPropertiesInvariantRule.java:55)
>>         at org.apache.lucene.util.TestRuleThreadAndTestName$1.evaluate(TestRuleThreadAndTestName.java:49)
>>         at org.apache.lucene.util.TestRuleIgnoreAfterMaxFailures$1.evaluate(TestRuleIgnoreAfterMaxFailures.java:65)
>>         at org.apache.lucene.util.TestRuleMarkFailure$1.evaluate(TestRuleMarkFailure.java:48)
>>         at com.carrotsearch.randomizedtesting.rules.StatementAdapter.evaluate(StatementAdapter.java:36)
>>         at com.carrotsearch.randomizedtesting.ThreadLeakControl$StatementRunner.run(ThreadLeakControl.java:365)
>>         at com.carrotsearch.randomizedtesting.ThreadLeakControl.forkTimeoutingTask(ThreadLeakControl.java:798)
>>         at com.carrotsearch.randomizedtesting.ThreadLeakControl$3.evaluate(ThreadLeakControl.java:458)
>>         at com.carrotsearch.randomizedtesting.RandomizedRunner.runSingleTest(RandomizedRunner.java:836)
>>         at com.carrotsearch.randomizedtesting.RandomizedRunner$3.evaluate(RandomizedRunner.java:738)
>>         at com.carrotsearch.randomizedtesting.RandomizedRunner$4.evaluate(RandomizedRunner.java:772)
>>         at com.carrotsearch.randomizedtesting.RandomizedRunner$5.evaluate(RandomizedRunner.java:783)
>>         at org.apache.lucene.util.AbstractBeforeAfterRule$1.evaluate(AbstractBeforeAfterRule.java:46)
>>         at org.apache.lucene.util.TestRuleStoreClassName$1.evaluate(TestRuleStoreClassName.java:42)
>>         at com.carrotsearch.randomizedtesting.rules.SystemPropertiesInvariantRule$1.evaluate(SystemPropertiesInvariantRule.java:55)
>>         at com.carrotsearch.randomizedtesting.rules.NoShadowingOrOverridesOnMethodsRule$1.evaluate(NoShadowingOrOverridesOnMethodsRule.java:39)
>>         at com.carrotsearch.randomizedtesting.rules.NoShadowingOrOverridesOnMethodsRule$1.evaluate(NoShadowingOrOverridesOnMethodsRule.java:39)
>>         at com.carrotsearch.randomizedtesting.rules.StatementAdapter.evaluate(StatementAdapter.java:36)
>>         at com.carrotsearch.randomizedtesting.rules.StatementAdapter.evaluate(StatementAdapter.java:36)
>>         at com.carrotsearch.randomizedtesting.rules.StatementAdapter.evaluate(StatementAdapter.java:36)
>>         at org.apache.lucene.util.TestRuleAssertionsRequired$1.evaluate(TestRuleAssertionsRequired.java:43)
>>         at org.apache.lucene.util.TestRuleMarkFailure$1.evaluate(TestRuleMarkFailure.java:48)
>>         at org.apache.lucene.util.TestRuleIgnoreAfterMaxFailures$1.evaluate(TestRuleIgnoreAfterMaxFailures.java:65)
>>         at org.apache.lucene.util.TestRuleIgnoreTestSuites$1.evaluate(TestRuleIgnoreTestSuites.java:55)
>>         at com.carrotsearch.randomizedtesting.rules.StatementAdapter.evaluate(StatementAdapter.java:36)
>>         at com.carrotsearch.randomizedtesting.ThreadLeakControl$StatementRunner.run(ThreadLeakControl.java:365)
>>         at java.lang.Thread.run(Thread.java:745)
>>
>>
>> REGRESSION:  org.apache.lucene.search.TestSortedSetSelector.testMaxMissingFirst
>>
>> Error Message:
>> codec does not support random access ordinals, cannot use selector: MAX
>>
>> Stack Trace:
>> java.lang.UnsupportedOperationException: codec does not support random access ordinals, cannot use selector: MAX
>>         at __randomizedtesting.SeedInfo.seed([7104C11261397844:F49AFDEBF21AC0E5]:0)
>>         at org.apache.lucene.search.SortedSetSelector.wrap(SortedSetSelector.java:80)
>>         at org.apache.lucene.search.SortedSetSortField$1.getSortedDocValues(SortedSetSortField.java:129)
>>         at org.apache.lucene.search.FieldComparator$TermOrdValComparator.setNextReader(FieldComparator.java:828)
>>         at org.apache.lucene.search.TopFieldCollector$OneComparatorNonScoringCollector.doSetNextReader(TopFieldCollector.java:97)
>>         at org.apache.lucene.search.SimpleCollector.getLeafCollector(SimpleCollector.java:33)
>>         at org.apache.lucene.search.IndexSearcher.search(IndexSearcher.java:605)
>>         at org.apache.lucene.search.AssertingIndexSearcher.search(AssertingIndexSearcher.java:94)
>>         at org.apache.lucene.search.IndexSearcher.search(IndexSearcher.java:573)
>>         at org.apache.lucene.search.IndexSearcher.search(IndexSearcher.java:525)
>>         at org.apache.lucene.search.IndexSearcher.search(IndexSearcher.java:502)
>>         at org.apache.lucene.search.IndexSearcher.search(IndexSearcher.java:370)
>>         at org.apache.lucene.search.TestSortedSetSelector.testMaxMissingFirst(TestSortedSetSelector.java:120)
>>         at sun.reflect.NativeMethodAccessorImpl.invoke0(Native Method)
>>         at sun.reflect.NativeMethodAccessorImpl.invoke(NativeMethodAccessorImpl.java:57)
>>         at sun.reflect.DelegatingMethodAccessorImpl.invoke(DelegatingMethodAccessorImpl.java:43)
>>         at java.lang.reflect.Method.invoke(Method.java:606)
>>         at com.carrotsearch.randomizedtesting.RandomizedRunner.invoke(RandomizedRunner.java:1618)
>>         at com.carrotsearch.randomizedtesting.RandomizedRunner$6.evaluate(RandomizedRunner.java:827)
>>         at com.carrotsearch.randomizedtesting.RandomizedRunner$7.evaluate(RandomizedRunner.java:863)
>>         at com.carrotsearch.randomizedtesting.RandomizedRunner$8.evaluate(RandomizedRunner.java:877)
>>         at org.apache.lucene.util.TestRuleSetupTeardownChained$1.evaluate(TestRuleSetupTeardownChained.java:50)
>>         at org.apache.lucene.util.AbstractBeforeAfterRule$1.evaluate(AbstractBeforeAfterRule.java:46)
>>         at com.carrotsearch.randomizedtesting.rules.SystemPropertiesInvariantRule$1.evaluate(SystemPropertiesInvariantRule.java:55)
>>         at org.apache.lucene.util.TestRuleThreadAndTestName$1.evaluate(TestRuleThreadAndTestName.java:49)
>>         at org.apache.lucene.util.TestRuleIgnoreAfterMaxFailures$1.evaluate(TestRuleIgnoreAfterMaxFailures.java:65)
>>         at org.apache.lucene.util.TestRuleMarkFailure$1.evaluate(TestRuleMarkFailure.java:48)
>>         at com.carrotsearch.randomizedtesting.rules.StatementAdapter.evaluate(StatementAdapter.java:36)
>>         at com.carrotsearch.randomizedtesting.ThreadLeakControl$StatementRunner.run(ThreadLeakControl.java:365)
>>         at com.carrotsearch.randomizedtesting.ThreadLeakControl.forkTimeoutingTask(ThreadLeakControl.java:798)
>>         at com.carrotsearch.randomizedtesting.ThreadLeakControl$3.evaluate(ThreadLeakControl.java:458)
>>         at com.carrotsearch.randomizedtesting.RandomizedRunner.runSingleTest(RandomizedRunner.java:836)
>>         at com.carrotsearch.randomizedtesting.RandomizedRunner$3.evaluate(RandomizedRunner.java:738)
>>         at com.carrotsearch.randomizedtesting.RandomizedRunner$4.evaluate(RandomizedRunner.java:772)
>>         at com.carrotsearch.randomizedtesting.RandomizedRunner$5.evaluate(RandomizedRunner.java:783)
>>         at org.apache.lucene.util.AbstractBeforeAfterRule$1.evaluate(AbstractBeforeAfterRule.java:46)
>>         at org.apache.lucene.util.TestRuleStoreClassName$1.evaluate(TestRuleStoreClassName.java:42)
>>         at com.carrotsearch.randomizedtesting.rules.SystemPropertiesInvariantRule$1.evaluate(SystemPropertiesInvariantRule.java:55)
>>         at com.carrotsearch.randomizedtesting.rules.NoShadowingOrOverridesOnMethodsRule$1.evaluate(NoShadowingOrOverridesOnMethodsRule.java:39)
>>         at com.carrotsearch.randomizedtesting.rules.NoShadowingOrOverridesOnMethodsRule$1.evaluate(NoShadowingOrOverridesOnMethodsRule.java:39)
>>         at com.carrotsearch.randomizedtesting.rules.StatementAdapter.evaluate(StatementAdapter.java:36)
>>         at com.carrotsearch.randomizedtesting.rules.StatementAdapter.evaluate(StatementAdapter.java:36)
>>         at com.carrotsearch.randomizedtesting.rules.StatementAdapter.evaluate(StatementAdapter.java:36)
>>         at org.apache.lucene.util.TestRuleAssertionsRequired$1.evaluate(TestRuleAssertionsRequired.java:43)
>>         at org.apache.lucene.util.TestRuleMarkFailure$1.evaluate(TestRuleMarkFailure.java:48)
>>         at org.apache.lucene.util.TestRuleIgnoreAfterMaxFailures$1.evaluate(TestRuleIgnoreAfterMaxFailures.java:65)
>>         at org.apache.lucene.util.TestRuleIgnoreTestSuites$1.evaluate(TestRuleIgnoreTestSuites.java:55)
>>         at com.carrotsearch.randomizedtesting.rules.StatementAdapter.evaluate(StatementAdapter.java:36)
>>         at com.carrotsearch.randomizedtesting.ThreadLeakControl$StatementRunner.run(ThreadLeakControl.java:365)
>>         at java.lang.Thread.run(Thread.java:745)
>>
>>
>>
>>
>> Build Log:
>> [...truncated 842 lines...]
>>    [junit4] Suite: org.apache.lucene.search.TestSortedSetSelector
>>    [junit4]   2> NOTE: reproduce with: ant test  -Dtestcase=TestSortedSetSelector -Dtests.method=testMiddleMax -Dtests.seed=7104C11261397844 -Dtests.slow=true -Dtests.locale=ar_JO -Dtests.timezone=Africa/Dar_es_Salaam -Dtests.file.encoding=US-ASCII
>>    [junit4] ERROR   0.03s | TestSortedSetSelector.testMiddleMax <<<
>>    [junit4]    > Throwable #1: java.lang.UnsupportedOperationException: codec does not support random access ordinals, cannot use selector: MIDDLE_MAX
>>    [junit4]    >        at __randomizedtesting.SeedInfo.seed([7104C11261397844:4A10894851F62D02]:0)
>>    [junit4]    >        at org.apache.lucene.search.SortedSetSelector.wrap(SortedSetSelector.java:80)
>>    [junit4]    >        at org.apache.lucene.search.SortedSetSortField$1.getSortedDocValues(SortedSetSortField.java:129)
>>    [junit4]    >        at org.apache.lucene.search.FieldComparator$TermOrdValComparator.setNextReader(FieldComparator.java:828)
>>    [junit4]    >        at org.apache.lucene.search.TopFieldCollector$OneComparatorNonScoringCollector.doSetNextReader(TopFieldCollector.java:97)
>>    [junit4]    >        at org.apache.lucene.search.SimpleCollector.getLeafCollector(SimpleCollector.java:33)
>>    [junit4]    >        at org.apache.lucene.search.IndexSearcher.search(IndexSearcher.java:605)
>>    [junit4]    >        at org.apache.lucene.search.AssertingIndexSearcher.search(AssertingIndexSearcher.java:94)
>>    [junit4]    >        at org.apache.lucene.search.IndexSearcher.search(IndexSearcher.java:573)
>>    [junit4]    >        at org.apache.lucene.search.IndexSearcher.search(IndexSearcher.java:525)
>>    [junit4]    >        at org.apache.lucene.search.IndexSearcher.search(IndexSearcher.java:502)
>>    [junit4]    >        at org.apache.lucene.search.IndexSearcher.search(IndexSearcher.java:370)
>>    [junit4]    >        at org.apache.lucene.search.TestSortedSetSelector.testMiddleMax(TestSortedSetSelector.java:384)
>>    [junit4]    >        at java.lang.Thread.run(Thread.java:745)
>>    [junit4]   2> NOTE: reproduce with: ant test  -Dtestcase=TestSortedSetSelector -Dtests.method=testMiddleMaxSingleton -Dtests.seed=7104C11261397844 -Dtests.slow=true -Dtests.locale=ar_JO -Dtests.timezone=Africa/Dar_es_Salaam -Dtests.file.encoding=US-ASCII
>>    [junit4] ERROR   0.01s | TestSortedSetSelector.testMiddleMaxSingleton <<<
>>    [junit4]    > Throwable #1: java.lang.UnsupportedOperationException: codec does not support random access ordinals, cannot use selector: MIDDLE_MAX
>>    [junit4]    >        at __randomizedtesting.SeedInfo.seed([7104C11261397844:50A308D1FBB1D3AA]:0)
>>    [junit4]    >        at org.apache.lucene.search.SortedSetSelector.wrap(SortedSetSelector.java:80)
>>    [junit4]    >        at org.apache.lucene.search.SortedSetSortField$1.getSortedDocValues(SortedSetSortField.java:129)
>>    [junit4]    >        at org.apache.lucene.search.FieldComparator$TermOrdValComparator.setNextReader(FieldComparator.java:828)
>>    [junit4]    >        at org.apache.lucene.search.TopFieldCollector$OneComparatorNonScoringCollector.doSetNextReader(TopFieldCollector.java:97)
>>    [junit4]    >        at org.apache.lucene.search.SimpleCollector.getLeafCollector(SimpleCollector.java:33)
>>    [junit4]    >        at org.apache.lucene.search.IndexSearcher.search(IndexSearcher.java:605)
>>    [junit4]    >        at org.apache.lucene.search.AssertingIndexSearcher.search(AssertingIndexSearcher.java:94)
>>    [junit4]    >        at org.apache.lucene.search.IndexSearcher.search(IndexSearcher.java:573)
>>    [junit4]    >        at org.apache.lucene.search.IndexSearcher.search(IndexSearcher.java:525)
>>    [junit4]    >        at org.apache.lucene.search.IndexSearcher.search(IndexSearcher.java:502)
>>    [junit4]    >        at org.apache.lucene.search.IndexSearcher.search(IndexSearcher.java:370)
>>    [junit4]    >        at org.apache.lucene.search.TestSortedSetSelector.testMiddleMaxSingleton(TestSortedSetSelector.java:519)
>>    [junit4]    >        at java.lang.Thread.run(Thread.java:745)
>>    [junit4]   2> NOTE: reproduce with: ant test  -Dtestcase=TestSortedSetSelector -Dtests.method=testMaxMissingLast -Dtests.seed=7104C11261397844 -Dtests.slow=true -Dtests.locale=ar_JO -Dtests.timezone=Africa/Dar_es_Salaam -Dtests.file.encoding=US-ASCII
>>    [junit4] ERROR   0.01s | TestSortedSetSelector.testMaxMissingLast <<<
>>    [junit4]    > Throwable #1: java.lang.UnsupportedOperationException: codec does not support random access ordinals, cannot use selector: MAX
>>    [junit4]    >        at __randomizedtesting.SeedInfo.seed([7104C11261397844:61DA6D5EAAE73BB8]:0)
>>    [junit4]    >        at org.apache.lucene.search.SortedSetSelector.wrap(SortedSetSelector.java:80)
>>    [junit4]    >        at org.apache.lucene.search.SortedSetSortField$1.getSortedDocValues(SortedSetSortField.java:129)
>>    [junit4]    >        at org.apache.lucene.search.FieldComparator$TermOrdValComparator.setNextReader(FieldComparator.java:828)
>>    [junit4]    >        at org.apache.lucene.search.TopFieldCollector$OneComparatorNonScoringCollector.doSetNextReader(TopFieldCollector.java:97)
>>    [junit4]    >        at org.apache.lucene.search.SimpleCollector.getLeafCollector(SimpleCollector.java:33)
>>    [junit4]    >        at org.apache.lucene.search.IndexSearcher.search(IndexSearcher.java:605)
>>    [junit4]    >        at org.apache.lucene.search.AssertingIndexSearcher.search(AssertingIndexSearcher.java:94)
>>    [junit4]    >        at org.apache.lucene.search.IndexSearcher.search(IndexSearcher.java:573)
>>    [junit4]    >        at org.apache.lucene.search.IndexSearcher.search(IndexSearcher.java:525)
>>    [junit4]    >        at org.apache.lucene.search.IndexSearcher.search(IndexSearcher.java:502)
>>    [junit4]    >        at org.apache.lucene.search.IndexSearcher.search(IndexSearcher.java:370)
>>    [junit4]    >        at org.apache.lucene.search.TestSortedSetSelector.testMaxMissingLast(TestSortedSetSelector.java:157)
>>    [junit4]    >        at java.lang.Thread.run(Thread.java:745)
>>    [junit4]   2> NOTE: reproduce with: ant test  -Dtestcase=TestSortedSetSelector -Dtests.method=testMiddleMinReverse -Dtests.seed=7104C11261397844 -Dtests.slow=true -Dtests.locale=ar_JO -Dtests.timezone=Africa/Dar_es_Salaam -Dtests.file.encoding=US-ASCII
>>    [junit4] ERROR   0.07s | TestSortedSetSelector.testMiddleMinReverse <<<
>>    [junit4]    > Throwable #1: java.lang.UnsupportedOperationException: codec does not support random access ordinals, cannot use selector: MIDDLE_MIN
>>    [junit4]    >        at __randomizedtesting.SeedInfo.seed([7104C11261397844:BC59BFFF641D13E7]:0)
>>    [junit4]    >        at org.apache.lucene.search.SortedSetSelector.wrap(SortedSetSelector.java:80)
>>    [junit4]    >        at org.apache.lucene.search.SortedSetSortField$1.getSortedDocValues(SortedSetSortField.java:129)
>>    [junit4]    >        at org.apache.lucene.search.FieldComparator$TermOrdValComparator.setNextReader(FieldComparator.java:828)
>>    [junit4]    >        at org.apache.lucene.search.TopFieldCollector$OneComparatorNonScoringCollector.doSetNextReader(TopFieldCollector.java:97)
>>    [junit4]    >        at org.apache.lucene.search.SimpleCollector.getLeafCollector(SimpleCollector.java:33)
>>    [junit4]    >        at org.apache.lucene.search.IndexSearcher.search(IndexSearcher.java:605)
>>    [junit4]    >        at org.apache.lucene.search.AssertingIndexSearcher.search(AssertingIndexSearcher.java:94)
>>    [junit4]    >        at org.apache.lucene.search.IndexSearcher.search(IndexSearcher.java:573)
>>    [junit4]    >        at org.apache.lucene.search.IndexSearcher.search(IndexSearcher.java:525)
>>    [junit4]    >        at org.apache.lucene.search.IndexSearcher.search(IndexSearcher.java:502)
>>    [junit4]    >        at org.apache.lucene.search.IndexSearcher.search(IndexSearcher.java:370)
>>    [junit4]    >        at org.apache.lucene.search.TestSortedSetSelector.testMiddleMinReverse(TestSortedSetSelector.java:249)
>>    [junit4]    >        at java.lang.Thread.run(Thread.java:745)
>>    [junit4]   2> NOTE: reproduce with: ant test  -Dtestcase=TestSortedSetSelector -Dtests.method=testMaxReverse -Dtests.seed=7104C11261397844 -Dtests.slow=true -Dtests.locale=ar_JO -Dtests.timezone=Africa/Dar_es_Salaam -Dtests.file.encoding=US-ASCII
>>    [junit4] ERROR   0.01s | TestSortedSetSelector.testMaxReverse <<<
>>    [junit4]    > Throwable #1: java.lang.UnsupportedOperationException: codec does not support random access ordinals, cannot use selector: MAX
>>    [junit4]    >        at __randomizedtesting.SeedInfo.seed([7104C11261397844:7ECFE6835D929D2C]:0)
>>    [junit4]    >        at org.apache.lucene.search.SortedSetSelector.wrap(SortedSetSelector.java:80)
>>    [junit4]    >        at org.apache.lucene.search.SortedSetSortField$1.getSortedDocValues(SortedSetSortField.java:129)
>>    [junit4]    >        at org.apache.lucene.search.FieldComparator$TermOrdValComparator.setNextReader(FieldComparator.java:828)
>>    [junit4]    >        at org.apache.lucene.search.TopFieldCollector$OneComparatorNonScoringCollector.doSetNextReader(TopFieldCollector.java:97)
>>    [junit4]    >        at org.apache.lucene.search.SimpleCollector.getLeafCollector(SimpleCollector.java:33)
>>    [junit4]    >        at org.apache.lucene.search.IndexSearcher.search(IndexSearcher.java:605)
>>    [junit4]    >        at org.apache.lucene.search.AssertingIndexSearcher.search(AssertingIndexSearcher.java:94)
>>    [junit4]    >        at org.apache.lucene.search.IndexSearcher.search(IndexSearcher.java:573)
>>    [junit4]    >        at org.apache.lucene.search.IndexSearcher.search(IndexSearcher.java:525)
>>    [junit4]    >        at org.apache.lucene.search.IndexSearcher.search(IndexSearcher.java:502)
>>    [junit4]    >        at org.apache.lucene.search.IndexSearcher.search(IndexSearcher.java:370)
>>    [junit4]    >        at org.apache.lucene.search.TestSortedSetSelector.testMaxReverse(TestSortedSetSelector.java:85)
>>    [junit4]    >        at java.lang.Thread.run(Thread.java:745)
>>    [junit4]   2> NOTE: reproduce with: ant test  -Dtestcase=TestSortedSetSelector -Dtests.method=testMiddleMinSingleton -Dtests.seed=7104C11261397844 -Dtests.slow=true -Dtests.locale=ar_JO -Dtests.timezone=Africa/Dar_es_Salaam -Dtests.file.encoding=US-ASCII
>>    [junit4] ERROR   0.01s | TestSortedSetSelector.testMiddleMinSingleton <<<
>>    [junit4]    > Throwable #1: java.lang.UnsupportedOperationException: codec does not support random access ordinals, cannot use selector: MIDDLE_MIN
>>    [junit4]    >        at __randomizedtesting.SeedInfo.seed([7104C11261397844:2B079C9B5D9CD1C1]:0)
>>    [junit4]    >        at org.apache.lucene.search.SortedSetSelector.wrap(SortedSetSelector.java:80)
>>    [junit4]    >        at org.apache.lucene.search.SortedSetSortField$1.getSortedDocValues(SortedSetSortField.java:129)
>>    [junit4]    >        at org.apache.lucene.search.FieldComparator$TermOrdValComparator.setNextReader(FieldComparator.java:828)
>>    [junit4]    >        at org.apache.lucene.search.TopFieldCollector$OneComparatorNonScoringCollector.doSetNextReader(TopFieldCollector.java:97)
>>    [junit4]    >        at org.apache.lucene.search.SimpleCollector.getLeafCollector(SimpleCollector.java:33)
>>    [junit4]    >        at org.apache.lucene.search.IndexSearcher.search(IndexSearcher.java:605)
>>    [junit4]    >        at org.apache.lucene.search.AssertingIndexSearcher.search(AssertingIndexSearcher.java:94)
>>    [junit4]    >        at org.apache.lucene.search.IndexSearcher.search(IndexSearcher.java:573)
>>    [junit4]    >        at org.apache.lucene.search.IndexSearcher.search(IndexSearcher.java:525)
>>    [junit4]    >        at org.apache.lucene.search.IndexSearcher.search(IndexSearcher.java:502)
>>    [junit4]    >        at org.apache.lucene.search.IndexSearcher.search(IndexSearcher.java:370)
>>    [junit4]    >        at org.apache.lucene.search.TestSortedSetSelector.testMiddleMinSingleton(TestSortedSetSelector.java:353)
>>    [junit4]    >        at java.lang.Thread.run(Thread.java:745)
>>    [junit4]   2> NOTE: reproduce with: ant test  -Dtestcase=TestSortedSetSelector -Dtests.method=testMiddleMinMissingFirst -Dtests.seed=7104C11261397844 -Dtests.slow=true -Dtests.locale=ar_JO -Dtests.timezone=Africa/Dar_es_Salaam -Dtests.file.encoding=US-ASCII
>>    [junit4] ERROR   0.01s | TestSortedSetSelector.testMiddleMinMissingFirst <<<
>>    [junit4]    > Throwable #1: java.lang.UnsupportedOperationException: codec does not support random access ordinals, cannot use selector: MIDDLE_MIN
>>    [junit4]    >        at __randomizedtesting.SeedInfo.seed([7104C11261397844:8444C12B5FE304BF]:0)
>>    [junit4]    >        at org.apache.lucene.search.SortedSetSelector.wrap(SortedSetSelector.java:80)
>>    [junit4]    >        at org.apache.lucene.search.SortedSetSortField$1.getSortedDocValues(SortedSetSortField.java:129)
>>    [junit4]    >        at org.apache.lucene.search.FieldComparator$TermOrdValComparator.setNextReader(FieldComparator.java:828)
>>    [junit4]    >        at org.apache.lucene.search.TopFieldCollector$OneComparatorNonScoringCollector.doSetNextReader(TopFieldCollector.java:97)
>>    [junit4]    >        at org.apache.lucene.search.SimpleCollector.getLeafCollector(SimpleCollector.java:33)
>>    [junit4]    >        at org.apache.lucene.search.IndexSearcher.search(IndexSearcher.java:605)
>>    [junit4]    >        at org.apache.lucene.search.AssertingIndexSearcher.search(AssertingIndexSearcher.java:94)
>>    [junit4]    >        at org.apache.lucene.search.IndexSearcher.search(IndexSearcher.java:573)
>>    [junit4]    >        at org.apache.lucene.search.IndexSearcher.search(IndexSearcher.java:525)
>>    [junit4]    >        at org.apache.lucene.search.IndexSearcher.search(IndexSearcher.java:502)
>>    [junit4]    >        at org.apache.lucene.search.IndexSearcher.search(IndexSearcher.java:370)
>>    [junit4]    >        at org.apache.lucene.search.TestSortedSetSelector.testMiddleMinMissingFirst(TestSortedSetSelector.java:285)
>>    [junit4]    >        at java.lang.Thread.run(Thread.java:745)
>>    [junit4]   2> NOTE: reproduce with: ant test  -Dtestcase=TestSortedSetSelector -Dtests.method=testMiddleMaxMissingFirst -Dtests.seed=7104C11261397844 -Dtests.slow=true -Dtests.locale=ar_JO -Dtests.timezone=Africa/Dar_es_Salaam -Dtests.file.encoding=US-ASCII
>>    [junit4] ERROR   0.01s | TestSortedSetSelector.testMiddleMaxMissingFirst <<<
>>    [junit4]    > Throwable #1: java.lang.UnsupportedOperationException: codec does not support random access ordinals, cannot use selector: MIDDLE_MAX
>>    [junit4]    >        at __randomizedtesting.SeedInfo.seed([7104C11261397844:8522AE52293D6589]:0)
>>    [junit4]    >        at org.apache.lucene.search.SortedSetSelector.wrap(SortedSetSelector.java:80)
>>    [junit4]    >        at org.apache.lucene.search.SortedSetSortField$1.getSortedDocValues(SortedSetSortField.java:129)
>>    [junit4]    >        at org.apache.lucene.search.FieldComparator$TermOrdValComparator.setNextReader(FieldComparator.java:828)
>>    [junit4]    >        at org.apache.lucene.search.TopFieldCollector$OneComparatorNonScoringCollector.doSetNextReader(TopFieldCollector.java:97)
>>    [junit4]    >        at org.apache.lucene.search.SimpleCollector.getLeafCollector(SimpleCollector.java:33)
>>    [junit4]    >        at org.apache.lucene.search
>>
>> [...truncated too long message...]
>>
>> codec does not support random access ordinals, cannot use selector: MIDDLE_MIN
>>    [junit4]    >        at __randomizedtesting.SeedInfo.seed([7104C11261397844:FCBFD170A4004B35]:0)
>>    [junit4]    >        at org.apache.lucene.search.SortedSetSelector.wrap(SortedSetSelector.java:80)
>>    [junit4]    >        at org.apache.lucene.search.SortedSetSortField$1.getSortedDocValues(SortedSetSortField.java:129)
>>    [junit4]    >        at org.apache.lucene.search.FieldComparator$TermOrdValComparator.setNextReader(FieldComparator.java:828)
>>    [junit4]    >        at org.apache.lucene.search.TopFieldCollector$OneComparatorNonScoringCollector.doSetNextReader(TopFieldCollector.java:97)
>>    [junit4]    >        at org.apache.lucene.search.SimpleCollector.getLeafCollector(SimpleCollector.java:33)
>>    [junit4]    >        at org.apache.lucene.search.IndexSearcher.search(IndexSearcher.java:605)
>>    [junit4]    >        at org.apache.lucene.search.AssertingIndexSearcher.search(AssertingIndexSearcher.java:94)
>>    [junit4]    >        at org.apache.lucene.search.IndexSearcher.search(IndexSearcher.java:573)
>>    [junit4]    >        at org.apache.lucene.search.IndexSearcher.search(IndexSearcher.java:525)
>>    [junit4]    >        at org.apache.lucene.search.IndexSearcher.search(IndexSearcher.java:502)
>>    [junit4]    >        at org.apache.lucene.search.IndexSearcher.search(IndexSearcher.java:370)
>>    [junit4]    >        at org.apache.lucene.search.TestSortedSetSelector.testMiddleMin(TestSortedSetSelector.java:218)
>>    [junit4]    >        at java.lang.Thread.run(Thread.java:745)
>>    [junit4]   2> NOTE: reproduce with: ant test  -Dtestcase=TestSortedSetSelector -Dtests.method=testMiddleMinMissingLast -Dtests.seed=7104C11261397844 -Dtests.slow=true -Dtests.locale=ar_JO -Dtests.timezone=Africa/Dar_es_Salaam -Dtests.file.encoding=US-ASCII
>>    [junit4] ERROR   0.01s | TestSortedSetSelector.testMiddleMinMissingLast <<<
>>    [junit4]    > Throwable #1: java.lang.UnsupportedOperationException: codec does not support random access ordinals, cannot use selector: MIDDLE_MIN
>>    [junit4]    >        at __randomizedtesting.SeedInfo.seed([7104C11261397844:C45CEDD600004E6A]:0)
>>    [junit4]    >        at org.apache.lucene.search.SortedSetSelector.wrap(SortedSetSelector.java:80)
>>    [junit4]    >        at org.apache.lucene.search.SortedSetSortField$1.getSortedDocValues(SortedSetSortField.java:129)
>>    [junit4]    >        at org.apache.lucene.search.FieldComparator$TermOrdValComparator.setNextReader(FieldComparator.java:828)
>>    [junit4]    >        at org.apache.lucene.search.TopFieldCollector$OneComparatorNonScoringCollector.doSetNextReader(TopFieldCollector.java:97)
>>    [junit4]    >        at org.apache.lucene.search.SimpleCollector.getLeafCollector(SimpleCollector.java:33)
>>    [junit4]    >        at org.apache.lucene.search.IndexSearcher.search(IndexSearcher.java:605)
>>    [junit4]    >        at org.apache.lucene.search.AssertingIndexSearcher.search(AssertingIndexSearcher.java:94)
>>    [junit4]    >        at org.apache.lucene.search.IndexSearcher.search(IndexSearcher.java:573)
>>    [junit4]    >        at org.apache.lucene.search.IndexSearcher.search(IndexSearcher.java:525)
>>    [junit4]    >        at org.apache.lucene.search.IndexSearcher.search(IndexSearcher.java:502)
>>    [junit4]    >        at org.apache.lucene.search.IndexSearcher.search(IndexSearcher.java:370)
>>    [junit4]    >        at org.apache.lucene.search.TestSortedSetSelector.testMiddleMinMissingLast(TestSortedSetSelector.java:323)
>>    [junit4]    >        at java.lang.Thread.run(Thread.java:745)
>>    [junit4]   2> NOTE: reproduce with: ant test  -Dtestcase=TestSortedSetSelector -Dtests.method=testMaxMissingFirst -Dtests.seed=7104C11261397844 -Dtests.slow=true -Dtests.locale=ar_JO -Dtests.timezone=Africa/Dar_es_Salaam -Dtests.file.encoding=US-ASCII
>>    [junit4] ERROR   0.01s | TestSortedSetSelector.testMaxMissingFirst <<<
>>    [junit4]    > Throwable #1: java.lang.UnsupportedOperationException: codec does not support random access ordinals, cannot use selector: MAX
>>    [junit4]    >        at __randomizedtesting.SeedInfo.seed([7104C11261397844:F49AFDEBF21AC0E5]:0)
>>    [junit4]    >        at org.apache.lucene.search.SortedSetSelector.wrap(SortedSetSelector.java:80)
>>    [junit4]    >        at org.apache.lucene.search.SortedSetSortField$1.getSortedDocValues(SortedSetSortField.java:129)
>>    [junit4]    >        at org.apache.lucene.search.FieldComparator$TermOrdValComparator.setNextReader(FieldComparator.java:828)
>>    [junit4]    >        at org.apache.lucene.search.TopFieldCollector$OneComparatorNonScoringCollector.doSetNextReader(TopFieldCollector.java:97)
>>    [junit4]    >        at org.apache.lucene.search.SimpleCollector.getLeafCollector(SimpleCollector.java:33)
>>    [junit4]    >        at org.apache.lucene.search.IndexSearcher.search(IndexSearcher.java:605)
>>    [junit4]    >        at org.apache.lucene.search.AssertingIndexSearcher.search(AssertingIndexSearcher.java:94)
>>    [junit4]    >        at org.apache.lucene.search.IndexSearcher.search(IndexSearcher.java:573)
>>    [junit4]    >        at org.apache.lucene.search.IndexSearcher.search(IndexSearcher.java:525)
>>    [junit4]    >        at org.apache.lucene.search.IndexSearcher.search(IndexSearcher.java:502)
>>    [junit4]    >        at org.apache.lucene.search.IndexSearcher.search(IndexSearcher.java:370)
>>    [junit4]    >        at org.apache.lucene.search.TestSortedSetSelector.testMaxMissingFirst(TestSortedSetSelector.java:120)
>>    [junit4]    >        at java.lang.Thread.run(Thread.java:745)
>>    [junit4]   2> NOTE: test params are: codec=Lucene410: {id=PostingsFormat(name=Lucene41VarGapFixedInterval)}, docValues:{value=DocValuesFormat(name=SimpleText)}, sim=DefaultSimilarity, locale=ar_JO, timezone=Africa/Dar_es_Salaam
>>    [junit4]   2> NOTE: Mac OS X 10.8.5 x86_64/Oracle Corporation 1.7.0_67 (64-bit)/cpus=2,threads=1,free=196104760,total=272105472
>>    [junit4]   2> NOTE: All tests run in this JVM: [TestLiveFieldValues, TestNoDeletionPolicy, TestFilterSpans, TestDocBoost, TestSimpleFSDirectory, TestSloppyMath, TestElevationComparator, TestEarlyTermination, TestFieldCacheRangeFilter, TestFieldsReader, TestIndexWriterMergePolicy, TestDocumentsWriterStallControl, TestAutomatonQueryUnicode, TestSimpleAttributeImpl, TestMixedDocValuesUpdates, TestExternalCodecs, TestFilterDirectory, TestCustomNorms, TestNeverDelete, TestSearchAfter, TestByteSlices, TestManyFields, TestOmitNorms, TestSearchForDuplicates, TestSubScorerFreqs, TestTermVectors, TestIndexWriterNRTIsCurrent, TestNumericUtils, TestTermdocPerf, TestRollingBuffer, TestScorerPerf, TestFilterAtomicReader, TestSetOnce, TestNamedSPILoader, TestIndexWriterMaxDocs, TestCharFilter, TestNormsFormat, TestCachingWrapperFilter, TestTwoPhaseCommitTool, TestSearcherManager, FuzzyTermOnShortTermsTest, TestDoc, TestCharsRef, Before3, Before3, TestIndexWriterForceMerge, TestBooleanQueryVisitSubscorers, TestPackedInts, TestTermVectorsFormat, TestAssertingPostingsFormat, TestBroadWord, TestMathUtil, TestIndexWriterOnJRECrash, TestParallelTermEnum, TestDeterminizeLexicon, TestIndexWriterDelete, TestTermScorer, TestPayloadsOnVectors, TestMinimize, TestMultiThreadTermVectors, TestEliasFanoDocIdSet, TestLucene49NormsFormat, TestBinaryDocument, Test2BNumericDocValues, TestRegexpRandom, TestPositiveScoresOnlyCollector, TestLogMergePolicy, TestSegmentTermEnum, TestRecyclingByteBlockAllocator, TestPerFieldDocValuesFormat, TestPerSegmentDeletes, TestSimilarityProvider, TestDeterminism, TestStoredFieldsFormat, TestCompiledAutomaton, TestConsistentFieldNumbers, TestFastDecompressionMode, TestTerm, TestNGramPhraseQuery, TestQueryRescorer, TestConstantScoreQuery, TestScoreCachingWrappingScorer, TestCachingCollector, TestConjunctions, TestFieldType, TestLucene410DocValuesFormat, TestIndexFileDeleter, TestBufferedChecksum, NestedSetupChain, NestedTeardownChain, TestSortRescorer, Nested, TestTopDocsMerge, TestFlex, InBeforeClass, InAfterClass, InTestMethod, NonStringProperties, TestTopFieldCollector, TestTopScoreDocCollector, TestOpenBitSet, TestForceMergeForever, TestPersistentSnapshotDeletionPolicy, TestSizeBoundedForceMerge, Nested, Nested, Nested, Nested, Nested, Nested, Nested, Nested, Nested, Nested, Nested, Nested, Nested, Nested, Nested, Nested, Nested, Nested, Nested, Nested, Nested, TestIndexReaderClose, TestSortRandom, TestAddIndexes, TestDocInverterPerFieldErrorInfo, TestCompressingStoredFieldsFormat, TestPayloadTermQuery, TestMmapDirectory, TestCollectionUtil, TestSloppyPhraseQuery2, TestTotalHitCountCollector, TestDocsAndPositions, TestMultiTermQueryRewrites, TestQueryWrapperFilter, TestPrefixQuery, TestMultiPhraseQuery, TestDuelingCodecs, TestDateFilter, TestWildcardRandom, TestOrdinalMap, TestUTF32ToUTF8, TestField, TestBytesRefHash, TestNumericRangeQuery32, TestLock, TestConcurrentMergeScheduler, TestSpanFirstQuery, TestSearchWithThreads, TestOmitTf, TestSortedSetSelector]
>>    [junit4] Completed in 0.25s, 15 tests, 15 errors <<< FAILURES!
>>
>> [...truncated 888 lines...]
>> BUILD FAILED
>> /Users/jenkins/workspace/Lucene-Solr-trunk-MacOSX/build.xml:491: The following error occurred while executing this line:
>> /Users/jenkins/workspace/Lucene-Solr-trunk-MacOSX/build.xml:471: The following error occurred while executing this line:
>> /Users/jenkins/workspace/Lucene-Solr-trunk-MacOSX/build.xml:60: The following error occurred while executing this line:
>> /Users/jenkins/workspace/Lucene-Solr-trunk-MacOSX/extra-targets.xml:39: The following error occurred while executing this line:
>> /Users/jenkins/workspace/Lucene-Solr-trunk-MacOSX/lucene/build.xml:49: The following error occurred while executing this line:
>> /Users/jenkins/workspace/Lucene-Solr-trunk-MacOSX/lucene/common-build.xml:1358: The following error occurred while executing this line:
>> /Users/jenkins/workspace/Lucene-Solr-trunk-MacOSX/lucene/common-build.xml:961: There were test failures: 400 suites, 3250 tests, 15 errors, 62 ignored (51 assumptions)
>>
>> Total time: 20 minutes 57 seconds
>> Build step 'Invoke Ant' marked build as failure
>> [description-setter] Description set: Java: 64bit/jdk1.7.0 -XX:+UseCompressedOops -XX:+UseParallelGC
>> Archiving artifacts
>> Recording test results
>> Email was triggered for: Failure - Any
>> Sending email for trigger: Failure - Any
>>
>>
>>
>>
>> ---------------------------------------------------------------------
>> To unsubscribe, e-mail: dev-unsubscribe@lucene.apache.org
>> For additional commands, e-mail: dev-help@lucene.apache.org

---------------------------------------------------------------------
To unsubscribe, e-mail: dev-unsubscribe@lucene.apache.org
For additional commands, e-mail: dev-help@lucene.apache.org


Mime
View raw message