lucene-dev mailing list archives

Site index · List index
Message view « Date » · « Thread »
Top « Date » · « Thread »
From Robert Muir <rcm...@gmail.com>
Subject Re: [JENKINS] Lucene-Solr-NightlyTests-trunk - Build # 627 - Still Failing
Date Sun, 14 Sep 2014 17:02:53 GMT
I will take a look. my favorite test.

On Sun, Sep 14, 2014 at 12:55 PM, Apache Jenkins Server
<jenkins@builds.apache.org> wrote:
> Build: https://builds.apache.org/job/Lucene-Solr-NightlyTests-trunk/627/
>
> 10 tests failed.
> FAILED:  junit.framework.TestSuite.org.apache.lucene.index.TestIndexWriterOnJRECrash
>
> Error Message:
> Resource in scope SUITE failed to close. Resource was registered from thread Thread[id=3203, name=TEST-TestIndexWriterOnJRECrash.testNRTThreads-seed#[5205AA7E864A31F], state=RUNNABLE, group=TGRP-TestIndexWriterOnJRECrash], registration stack trace below.
>
> Stack Trace:
> com.carrotsearch.randomizedtesting.ResourceDisposalError: Resource in scope SUITE failed to close. Resource was registered from thread Thread[id=3203, name=TEST-TestIndexWriterOnJRECrash.testNRTThreads-seed#[5205AA7E864A31F], state=RUNNABLE, group=TGRP-TestIndexWriterOnJRECrash], registration stack trace below.
>         at java.lang.Thread.getStackTrace(Thread.java:1589)
>         at com.carrotsearch.randomizedtesting.RandomizedContext.closeAtEnd(RandomizedContext.java:166)
>         at org.apache.lucene.util.LuceneTestCase.closeAfterSuite(LuceneTestCase.java:731)
>         at org.apache.lucene.util.LuceneTestCase.wrapDirectory(LuceneTestCase.java:1274)
>         at org.apache.lucene.util.LuceneTestCase.newFSDirectory(LuceneTestCase.java:1216)
>         at org.apache.lucene.util.LuceneTestCase.newFSDirectory(LuceneTestCase.java:1196)
>         at org.apache.lucene.util.LuceneTestCase.newFSDirectory(LuceneTestCase.java:1191)
>         at org.apache.lucene.index.TestIndexWriterOnJRECrash$2.postVisitDirectory(TestIndexWriterOnJRECrash.java:162)
>         at org.apache.lucene.index.TestIndexWriterOnJRECrash$2.postVisitDirectory(TestIndexWriterOnJRECrash.java:156)
>         at java.nio.file.FileTreeWalker.walk(FileTreeWalker.java:224)
>         at java.nio.file.FileTreeWalker.walk(FileTreeWalker.java:199)
>         at java.nio.file.FileTreeWalker.walk(FileTreeWalker.java:199)
>         at java.nio.file.FileTreeWalker.walk(FileTreeWalker.java:69)
>         at java.nio.file.Files.walkFileTree(Files.java:2602)
>         at java.nio.file.Files.walkFileTree(Files.java:2635)
>         at org.apache.lucene.index.TestIndexWriterOnJRECrash.checkIndexes(TestIndexWriterOnJRECrash.java:156)
>         at org.apache.lucene.index.TestIndexWriterOnJRECrash.testNRTThreads(TestIndexWriterOnJRECrash.java:61)
>         at sun.reflect.NativeMethodAccessorImpl.invoke0(Native Method)
>         at sun.reflect.NativeMethodAccessorImpl.invoke(NativeMethodAccessorImpl.java:57)
>         at sun.reflect.DelegatingMethodAccessorImpl.invoke(DelegatingMethodAccessorImpl.java:43)
>         at java.lang.reflect.Method.invoke(Method.java:606)
>         at com.carrotsearch.randomizedtesting.RandomizedRunner.invoke(RandomizedRunner.java:1618)
>         at com.carrotsearch.randomizedtesting.RandomizedRunner$6.evaluate(RandomizedRunner.java:827)
>         at com.carrotsearch.randomizedtesting.RandomizedRunner$7.evaluate(RandomizedRunner.java:863)
>         at com.carrotsearch.randomizedtesting.RandomizedRunner$8.evaluate(RandomizedRunner.java:877)
>         at org.apache.lucene.util.TestRuleSetupTeardownChained$1.evaluate(TestRuleSetupTeardownChained.java:50)
>         at org.apache.lucene.util.AbstractBeforeAfterRule$1.evaluate(AbstractBeforeAfterRule.java:46)
>         at com.carrotsearch.randomizedtesting.rules.SystemPropertiesInvariantRule$1.evaluate(SystemPropertiesInvariantRule.java:55)
>         at org.apache.lucene.util.TestRuleThreadAndTestName$1.evaluate(TestRuleThreadAndTestName.java:49)
>         at org.apache.lucene.util.TestRuleIgnoreAfterMaxFailures$1.evaluate(TestRuleIgnoreAfterMaxFailures.java:65)
>         at org.apache.lucene.util.TestRuleMarkFailure$1.evaluate(TestRuleMarkFailure.java:48)
>         at com.carrotsearch.randomizedtesting.rules.StatementAdapter.evaluate(StatementAdapter.java:36)
>         at com.carrotsearch.randomizedtesting.ThreadLeakControl$StatementRunner.run(ThreadLeakControl.java:365)
>         at com.carrotsearch.randomizedtesting.ThreadLeakControl.forkTimeoutingTask(ThreadLeakControl.java:798)
>         at com.carrotsearch.randomizedtesting.ThreadLeakControl$3.evaluate(ThreadLeakControl.java:458)
>         at com.carrotsearch.randomizedtesting.RandomizedRunner.runSingleTest(RandomizedRunner.java:836)
>         at com.carrotsearch.randomizedtesting.RandomizedRunner$3.evaluate(RandomizedRunner.java:738)
>         at com.carrotsearch.randomizedtesting.RandomizedRunner$4.evaluate(RandomizedRunner.java:772)
>         at com.carrotsearch.randomizedtesting.RandomizedRunner$5.evaluate(RandomizedRunner.java:783)
>         at org.apache.lucene.util.AbstractBeforeAfterRule$1.evaluate(AbstractBeforeAfterRule.java:46)
>         at org.apache.lucene.util.TestRuleStoreClassName$1.evaluate(TestRuleStoreClassName.java:42)
>         at com.carrotsearch.randomizedtesting.rules.SystemPropertiesInvariantRule$1.evaluate(SystemPropertiesInvariantRule.java:55)
>         at com.carrotsearch.randomizedtesting.rules.NoShadowingOrOverridesOnMethodsRule$1.evaluate(NoShadowingOrOverridesOnMethodsRule.java:39)
>         at com.carrotsearch.randomizedtesting.rules.NoShadowingOrOverridesOnMethodsRule$1.evaluate(NoShadowingOrOverridesOnMethodsRule.java:39)
>         at com.carrotsearch.randomizedtesting.rules.StatementAdapter.evaluate(StatementAdapter.java:36)
>         at com.carrotsearch.randomizedtesting.rules.StatementAdapter.evaluate(StatementAdapter.java:36)
>         at com.carrotsearch.randomizedtesting.rules.StatementAdapter.evaluate(StatementAdapter.java:36)
>         at org.apache.lucene.util.TestRuleAssertionsRequired$1.evaluate(TestRuleAssertionsRequired.java:43)
>         at org.apache.lucene.util.TestRuleMarkFailure$1.evaluate(TestRuleMarkFailure.java:48)
>         at org.apache.lucene.util.TestRuleIgnoreAfterMaxFailures$1.evaluate(TestRuleIgnoreAfterMaxFailures.java:65)
>         at org.apache.lucene.util.TestRuleIgnoreTestSuites$1.evaluate(TestRuleIgnoreTestSuites.java:55)
>         at com.carrotsearch.randomizedtesting.rules.StatementAdapter.evaluate(StatementAdapter.java:36)
>         at com.carrotsearch.randomizedtesting.ThreadLeakControl$StatementRunner.run(ThreadLeakControl.java:365)
>         at java.lang.Thread.run(Thread.java:745)
> Caused by: java.lang.AssertionError: Directory not closed: MockDirectoryWrapper(RateLimitedDirectoryWrapper(SimpleFSDirectory@/usr/home/jenkins/jenkins-slave/workspace/Lucene-Solr-NightlyTests-trunk/lucene/build/core/test/J3/temp/lucene.index.TestIndexWriterOnJRECrash-5205AA7E864A31F-001/jrecrash-001/lucene.index.TestIndexWriterOnJRECrash-10C9D1188CF0C871-001/jrecrash-001 lockFactory=NativeFSLockFactory@/usr/home/jenkins/jenkins-slave/workspace/Lucene-Solr-NightlyTests-trunk/lucene/build/core/test/J3/temp/lucene.index.TestIndexWriterOnJRECrash-5205AA7E864A31F-001/jrecrash-001/lucene.index.TestIndexWriterOnJRECrash-10C9D1188CF0C871-001/jrecrash-001))
>         at org.junit.Assert.fail(Assert.java:93)
>         at org.apache.lucene.util.CloseableDirectory.close(CloseableDirectory.java:47)
>         at com.carrotsearch.randomizedtesting.RandomizedRunner$2$1.apply(RandomizedRunner.java:699)
>         at com.carrotsearch.randomizedtesting.RandomizedRunner$2$1.apply(RandomizedRunner.java:696)
>         at com.carrotsearch.randomizedtesting.RandomizedContext.closeResources(RandomizedContext.java:183)
>         at com.carrotsearch.randomizedtesting.RandomizedRunner$2.afterAlways(RandomizedRunner.java:712)
>         at com.carrotsearch.randomizedtesting.rules.StatementAdapter.evaluate(StatementAdapter.java:43)
>         ... 2 more
>
>
> FAILED:  junit.framework.TestSuite.org.apache.lucene.index.TestIndexWriterOnJRECrash
>
> Error Message:
> Resource in scope SUITE failed to close. Resource was registered from thread Thread[id=3203, name=TEST-TestIndexWriterOnJRECrash.testNRTThreads-seed#[5205AA7E864A31F], state=RUNNABLE, group=TGRP-TestIndexWriterOnJRECrash], registration stack trace below.
>
> Stack Trace:
> com.carrotsearch.randomizedtesting.ResourceDisposalError: Resource in scope SUITE failed to close. Resource was registered from thread Thread[id=3203, name=TEST-TestIndexWriterOnJRECrash.testNRTThreads-seed#[5205AA7E864A31F], state=RUNNABLE, group=TGRP-TestIndexWriterOnJRECrash], registration stack trace below.
>         at java.lang.Thread.getStackTrace(Thread.java:1589)
>         at com.carrotsearch.randomizedtesting.RandomizedContext.closeAtEnd(RandomizedContext.java:166)
>         at org.apache.lucene.util.LuceneTestCase.closeAfterSuite(LuceneTestCase.java:731)
>         at org.apache.lucene.util.LuceneTestCase.wrapDirectory(LuceneTestCase.java:1274)
>         at org.apache.lucene.util.LuceneTestCase.newFSDirectory(LuceneTestCase.java:1216)
>         at org.apache.lucene.util.LuceneTestCase.newFSDirectory(LuceneTestCase.java:1196)
>         at org.apache.lucene.util.LuceneTestCase.newFSDirectory(LuceneTestCase.java:1191)
>         at org.apache.lucene.index.TestIndexWriterOnJRECrash$2.postVisitDirectory(TestIndexWriterOnJRECrash.java:162)
>         at org.apache.lucene.index.TestIndexWriterOnJRECrash$2.postVisitDirectory(TestIndexWriterOnJRECrash.java:156)
>         at java.nio.file.FileTreeWalker.walk(FileTreeWalker.java:224)
>         at java.nio.file.FileTreeWalker.walk(FileTreeWalker.java:199)
>         at java.nio.file.FileTreeWalker.walk(FileTreeWalker.java:199)
>         at java.nio.file.FileTreeWalker.walk(FileTreeWalker.java:69)
>         at java.nio.file.Files.walkFileTree(Files.java:2602)
>         at java.nio.file.Files.walkFileTree(Files.java:2635)
>         at org.apache.lucene.index.TestIndexWriterOnJRECrash.checkIndexes(TestIndexWriterOnJRECrash.java:156)
>         at org.apache.lucene.index.TestIndexWriterOnJRECrash.testNRTThreads(TestIndexWriterOnJRECrash.java:61)
>         at sun.reflect.NativeMethodAccessorImpl.invoke0(Native Method)
>         at sun.reflect.NativeMethodAccessorImpl.invoke(NativeMethodAccessorImpl.java:57)
>         at sun.reflect.DelegatingMethodAccessorImpl.invoke(DelegatingMethodAccessorImpl.java:43)
>         at java.lang.reflect.Method.invoke(Method.java:606)
>         at com.carrotsearch.randomizedtesting.RandomizedRunner.invoke(RandomizedRunner.java:1618)
>         at com.carrotsearch.randomizedtesting.RandomizedRunner$6.evaluate(RandomizedRunner.java:827)
>         at com.carrotsearch.randomizedtesting.RandomizedRunner$7.evaluate(RandomizedRunner.java:863)
>         at com.carrotsearch.randomizedtesting.RandomizedRunner$8.evaluate(RandomizedRunner.java:877)
>         at org.apache.lucene.util.TestRuleSetupTeardownChained$1.evaluate(TestRuleSetupTeardownChained.java:50)
>         at org.apache.lucene.util.AbstractBeforeAfterRule$1.evaluate(AbstractBeforeAfterRule.java:46)
>         at com.carrotsearch.randomizedtesting.rules.SystemPropertiesInvariantRule$1.evaluate(SystemPropertiesInvariantRule.java:55)
>         at org.apache.lucene.util.TestRuleThreadAndTestName$1.evaluate(TestRuleThreadAndTestName.java:49)
>         at org.apache.lucene.util.TestRuleIgnoreAfterMaxFailures$1.evaluate(TestRuleIgnoreAfterMaxFailures.java:65)
>         at org.apache.lucene.util.TestRuleMarkFailure$1.evaluate(TestRuleMarkFailure.java:48)
>         at com.carrotsearch.randomizedtesting.rules.StatementAdapter.evaluate(StatementAdapter.java:36)
>         at com.carrotsearch.randomizedtesting.ThreadLeakControl$StatementRunner.run(ThreadLeakControl.java:365)
>         at com.carrotsearch.randomizedtesting.ThreadLeakControl.forkTimeoutingTask(ThreadLeakControl.java:798)
>         at com.carrotsearch.randomizedtesting.ThreadLeakControl$3.evaluate(ThreadLeakControl.java:458)
>         at com.carrotsearch.randomizedtesting.RandomizedRunner.runSingleTest(RandomizedRunner.java:836)
>         at com.carrotsearch.randomizedtesting.RandomizedRunner$3.evaluate(RandomizedRunner.java:738)
>         at com.carrotsearch.randomizedtesting.RandomizedRunner$4.evaluate(RandomizedRunner.java:772)
>         at com.carrotsearch.randomizedtesting.RandomizedRunner$5.evaluate(RandomizedRunner.java:783)
>         at org.apache.lucene.util.AbstractBeforeAfterRule$1.evaluate(AbstractBeforeAfterRule.java:46)
>         at org.apache.lucene.util.TestRuleStoreClassName$1.evaluate(TestRuleStoreClassName.java:42)
>         at com.carrotsearch.randomizedtesting.rules.SystemPropertiesInvariantRule$1.evaluate(SystemPropertiesInvariantRule.java:55)
>         at com.carrotsearch.randomizedtesting.rules.NoShadowingOrOverridesOnMethodsRule$1.evaluate(NoShadowingOrOverridesOnMethodsRule.java:39)
>         at com.carrotsearch.randomizedtesting.rules.NoShadowingOrOverridesOnMethodsRule$1.evaluate(NoShadowingOrOverridesOnMethodsRule.java:39)
>         at com.carrotsearch.randomizedtesting.rules.StatementAdapter.evaluate(StatementAdapter.java:36)
>         at com.carrotsearch.randomizedtesting.rules.StatementAdapter.evaluate(StatementAdapter.java:36)
>         at com.carrotsearch.randomizedtesting.rules.StatementAdapter.evaluate(StatementAdapter.java:36)
>         at org.apache.lucene.util.TestRuleAssertionsRequired$1.evaluate(TestRuleAssertionsRequired.java:43)
>         at org.apache.lucene.util.TestRuleMarkFailure$1.evaluate(TestRuleMarkFailure.java:48)
>         at org.apache.lucene.util.TestRuleIgnoreAfterMaxFailures$1.evaluate(TestRuleIgnoreAfterMaxFailures.java:65)
>         at org.apache.lucene.util.TestRuleIgnoreTestSuites$1.evaluate(TestRuleIgnoreTestSuites.java:55)
>         at com.carrotsearch.randomizedtesting.rules.StatementAdapter.evaluate(StatementAdapter.java:36)
>         at com.carrotsearch.randomizedtesting.ThreadLeakControl$StatementRunner.run(ThreadLeakControl.java:365)
>         at java.lang.Thread.run(Thread.java:745)
> Caused by: java.lang.AssertionError: Directory not closed: MockDirectoryWrapper(RateLimitedDirectoryWrapper(SimpleFSDirectory@/usr/home/jenkins/jenkins-slave/workspace/Lucene-Solr-NightlyTests-trunk/lucene/build/core/test/J3/temp/lucene.index.TestIndexWriterOnJRECrash-5205AA7E864A31F-001/jrecrash-001/lucene.index.TestIndexWriterOnJRECrash-10C9D1188CF0C871-001/TestNRTThreads-001 lockFactory=NativeFSLockFactory@/usr/home/jenkins/jenkins-slave/workspace/Lucene-Solr-NightlyTests-trunk/lucene/build/core/test/J3/temp/lucene.index.TestIndexWriterOnJRECrash-5205AA7E864A31F-001/jrecrash-001/lucene.index.TestIndexWriterOnJRECrash-10C9D1188CF0C871-001/TestNRTThreads-001))
>         at org.junit.Assert.fail(Assert.java:93)
>         at org.apache.lucene.util.CloseableDirectory.close(CloseableDirectory.java:47)
>         at com.carrotsearch.randomizedtesting.RandomizedRunner$2$1.apply(RandomizedRunner.java:699)
>         at com.carrotsearch.randomizedtesting.RandomizedRunner$2$1.apply(RandomizedRunner.java:696)
>         at com.carrotsearch.randomizedtesting.RandomizedContext.closeResources(RandomizedContext.java:183)
>         at com.carrotsearch.randomizedtesting.RandomizedRunner$2.afterAlways(RandomizedRunner.java:712)
>         at com.carrotsearch.randomizedtesting.rules.StatementAdapter.evaluate(StatementAdapter.java:43)
>         ... 2 more
>
>
> FAILED:  junit.framework.TestSuite.org.apache.lucene.index.TestIndexWriterOnJRECrash
>
> Error Message:
> Resource in scope SUITE failed to close. Resource was registered from thread Thread[id=3203, name=TEST-TestIndexWriterOnJRECrash.testNRTThreads-seed#[5205AA7E864A31F], state=RUNNABLE, group=TGRP-TestIndexWriterOnJRECrash], registration stack trace below.
>
> Stack Trace:
> com.carrotsearch.randomizedtesting.ResourceDisposalError: Resource in scope SUITE failed to close. Resource was registered from thread Thread[id=3203, name=TEST-TestIndexWriterOnJRECrash.testNRTThreads-seed#[5205AA7E864A31F], state=RUNNABLE, group=TGRP-TestIndexWriterOnJRECrash], registration stack trace below.
>         at java.lang.Thread.getStackTrace(Thread.java:1589)
>         at com.carrotsearch.randomizedtesting.RandomizedContext.closeAtEnd(RandomizedContext.java:166)
>         at org.apache.lucene.util.LuceneTestCase.closeAfterSuite(LuceneTestCase.java:731)
>         at org.apache.lucene.util.LuceneTestCase.wrapDirectory(LuceneTestCase.java:1268)
>         at org.apache.lucene.util.LuceneTestCase.newFSDirectory(LuceneTestCase.java:1216)
>         at org.apache.lucene.util.LuceneTestCase.newFSDirectory(LuceneTestCase.java:1196)
>         at org.apache.lucene.util.LuceneTestCase.newFSDirectory(LuceneTestCase.java:1191)
>         at org.apache.lucene.index.TestIndexWriterOnJRECrash$2.postVisitDirectory(TestIndexWriterOnJRECrash.java:162)
>         at org.apache.lucene.index.TestIndexWriterOnJRECrash$2.postVisitDirectory(TestIndexWriterOnJRECrash.java:156)
>         at java.nio.file.FileTreeWalker.walk(FileTreeWalker.java:224)
>         at java.nio.file.FileTreeWalker.walk(FileTreeWalker.java:199)
>         at java.nio.file.FileTreeWalker.walk(FileTreeWalker.java:69)
>         at java.nio.file.Files.walkFileTree(Files.java:2602)
>         at java.nio.file.Files.walkFileTree(Files.java:2635)
>         at org.apache.lucene.index.TestIndexWriterOnJRECrash.checkIndexes(TestIndexWriterOnJRECrash.java:156)
>         at org.apache.lucene.index.TestIndexWriterOnJRECrash.testNRTThreads(TestIndexWriterOnJRECrash.java:61)
>         at sun.reflect.NativeMethodAccessorImpl.invoke0(Native Method)
>         at sun.reflect.NativeMethodAccessorImpl.invoke(NativeMethodAccessorImpl.java:57)
>         at sun.reflect.DelegatingMethodAccessorImpl.invoke(DelegatingMethodAccessorImpl.java:43)
>         at java.lang.reflect.Method.invoke(Method.java:606)
>         at com.carrotsearch.randomizedtesting.RandomizedRunner.invoke(RandomizedRunner.java:1618)
>         at com.carrotsearch.randomizedtesting.RandomizedRunner$6.evaluate(RandomizedRunner.java:827)
>         at com.carrotsearch.randomizedtesting.RandomizedRunner$7.evaluate(RandomizedRunner.java:863)
>         at com.carrotsearch.randomizedtesting.RandomizedRunner$8.evaluate(RandomizedRunner.java:877)
>         at org.apache.lucene.util.TestRuleSetupTeardownChained$1.evaluate(TestRuleSetupTeardownChained.java:50)
>         at org.apache.lucene.util.AbstractBeforeAfterRule$1.evaluate(AbstractBeforeAfterRule.java:46)
>         at com.carrotsearch.randomizedtesting.rules.SystemPropertiesInvariantRule$1.evaluate(SystemPropertiesInvariantRule.java:55)
>         at org.apache.lucene.util.TestRuleThreadAndTestName$1.evaluate(TestRuleThreadAndTestName.java:49)
>         at org.apache.lucene.util.TestRuleIgnoreAfterMaxFailures$1.evaluate(TestRuleIgnoreAfterMaxFailures.java:65)
>         at org.apache.lucene.util.TestRuleMarkFailure$1.evaluate(TestRuleMarkFailure.java:48)
>         at com.carrotsearch.randomizedtesting.rules.StatementAdapter.evaluate(StatementAdapter.java:36)
>         at com.carrotsearch.randomizedtesting.ThreadLeakControl$StatementRunner.run(ThreadLeakControl.java:365)
>         at com.carrotsearch.randomizedtesting.ThreadLeakControl.forkTimeoutingTask(ThreadLeakControl.java:798)
>         at com.carrotsearch.randomizedtesting.ThreadLeakControl$3.evaluate(ThreadLeakControl.java:458)
>         at com.carrotsearch.randomizedtesting.RandomizedRunner.runSingleTest(RandomizedRunner.java:836)
>         at com.carrotsearch.randomizedtesting.RandomizedRunner$3.evaluate(RandomizedRunner.java:738)
>         at com.carrotsearch.randomizedtesting.RandomizedRunner$4.evaluate(RandomizedRunner.java:772)
>         at com.carrotsearch.randomizedtesting.RandomizedRunner$5.evaluate(RandomizedRunner.java:783)
>         at org.apache.lucene.util.AbstractBeforeAfterRule$1.evaluate(AbstractBeforeAfterRule.java:46)
>         at org.apache.lucene.util.TestRuleStoreClassName$1.evaluate(TestRuleStoreClassName.java:42)
>         at com.carrotsearch.randomizedtesting.rules.SystemPropertiesInvariantRule$1.evaluate(SystemPropertiesInvariantRule.java:55)
>         at com.carrotsearch.randomizedtesting.rules.NoShadowingOrOverridesOnMethodsRule$1.evaluate(NoShadowingOrOverridesOnMethodsRule.java:39)
>         at com.carrotsearch.randomizedtesting.rules.NoShadowingOrOverridesOnMethodsRule$1.evaluate(NoShadowingOrOverridesOnMethodsRule.java:39)
>         at com.carrotsearch.randomizedtesting.rules.StatementAdapter.evaluate(StatementAdapter.java:36)
>         at com.carrotsearch.randomizedtesting.rules.StatementAdapter.evaluate(StatementAdapter.java:36)
>         at com.carrotsearch.randomizedtesting.rules.StatementAdapter.evaluate(StatementAdapter.java:36)
>         at org.apache.lucene.util.TestRuleAssertionsRequired$1.evaluate(TestRuleAssertionsRequired.java:43)
>         at org.apache.lucene.util.TestRuleMarkFailure$1.evaluate(TestRuleMarkFailure.java:48)
>         at org.apache.lucene.util.TestRuleIgnoreAfterMaxFailures$1.evaluate(TestRuleIgnoreAfterMaxFailures.java:65)
>         at org.apache.lucene.util.TestRuleIgnoreTestSuites$1.evaluate(TestRuleIgnoreTestSuites.java:55)
>         at com.carrotsearch.randomizedtesting.rules.StatementAdapter.evaluate(StatementAdapter.java:36)
>         at com.carrotsearch.randomizedtesting.ThreadLeakControl$StatementRunner.run(ThreadLeakControl.java:365)
>         at java.lang.Thread.run(Thread.java:745)
> Caused by: java.lang.AssertionError: Directory not closed: BaseDirectoryWrapper(SimpleFSDirectory@/usr/home/jenkins/jenkins-slave/workspace/Lucene-Solr-NightlyTests-trunk/lucene/build/core/test/J3/temp/lucene.index.TestIndexWriterOnJRECrash-5205AA7E864A31F-001/jrecrash-001/lucene.index.TestIndexWriterOnJRECrash-10C9D1188CF0C871-001 lockFactory=NativeFSLockFactory@/usr/home/jenkins/jenkins-slave/workspace/Lucene-Solr-NightlyTests-trunk/lucene/build/core/test/J3/temp/lucene.index.TestIndexWriterOnJRECrash-5205AA7E864A31F-001/jrecrash-001/lucene.index.TestIndexWriterOnJRECrash-10C9D1188CF0C871-001)
>         at org.junit.Assert.fail(Assert.java:93)
>         at org.apache.lucene.util.CloseableDirectory.close(CloseableDirectory.java:47)
>         at com.carrotsearch.randomizedtesting.RandomizedRunner$2$1.apply(RandomizedRunner.java:699)
>         at com.carrotsearch.randomizedtesting.RandomizedRunner$2$1.apply(RandomizedRunner.java:696)
>         at com.carrotsearch.randomizedtesting.RandomizedContext.closeResources(RandomizedContext.java:183)
>         at com.carrotsearch.randomizedtesting.RandomizedRunner$2.afterAlways(RandomizedRunner.java:712)
>         at com.carrotsearch.randomizedtesting.rules.StatementAdapter.evaluate(StatementAdapter.java:43)
>         ... 2 more
>
>
> FAILED:  junit.framework.TestSuite.org.apache.lucene.index.TestIndexWriterOnJRECrash
>
> Error Message:
> Resource in scope SUITE failed to close. Resource was registered from thread Thread[id=3203, name=TEST-TestIndexWriterOnJRECrash.testNRTThreads-seed#[5205AA7E864A31F], state=RUNNABLE, group=TGRP-TestIndexWriterOnJRECrash], registration stack trace below.
>
> Stack Trace:
> com.carrotsearch.randomizedtesting.ResourceDisposalError: Resource in scope SUITE failed to close. Resource was registered from thread Thread[id=3203, name=TEST-TestIndexWriterOnJRECrash.testNRTThreads-seed#[5205AA7E864A31F], state=RUNNABLE, group=TGRP-TestIndexWriterOnJRECrash], registration stack trace below.
>         at java.lang.Thread.getStackTrace(Thread.java:1589)
>         at com.carrotsearch.randomizedtesting.RandomizedContext.closeAtEnd(RandomizedContext.java:166)
>         at org.apache.lucene.util.LuceneTestCase.closeAfterSuite(LuceneTestCase.java:731)
>         at org.apache.lucene.util.LuceneTestCase.wrapDirectory(LuceneTestCase.java:1274)
>         at org.apache.lucene.util.LuceneTestCase.newFSDirectory(LuceneTestCase.java:1216)
>         at org.apache.lucene.util.LuceneTestCase.newFSDirectory(LuceneTestCase.java:1196)
>         at org.apache.lucene.util.LuceneTestCase.newFSDirectory(LuceneTestCase.java:1191)
>         at org.apache.lucene.index.TestIndexWriterOnJRECrash$2.postVisitDirectory(TestIndexWriterOnJRECrash.java:162)
>         at org.apache.lucene.index.TestIndexWriterOnJRECrash$2.postVisitDirectory(TestIndexWriterOnJRECrash.java:156)
>         at java.nio.file.FileTreeWalker.walk(FileTreeWalker.java:224)
>         at java.nio.file.FileTreeWalker.walk(FileTreeWalker.java:69)
>         at java.nio.file.Files.walkFileTree(Files.java:2602)
>         at java.nio.file.Files.walkFileTree(Files.java:2635)
>         at org.apache.lucene.index.TestIndexWriterOnJRECrash.checkIndexes(TestIndexWriterOnJRECrash.java:156)
>         at org.apache.lucene.index.TestIndexWriterOnJRECrash.testNRTThreads(TestIndexWriterOnJRECrash.java:61)
>         at sun.reflect.NativeMethodAccessorImpl.invoke0(Native Method)
>         at sun.reflect.NativeMethodAccessorImpl.invoke(NativeMethodAccessorImpl.java:57)
>         at sun.reflect.DelegatingMethodAccessorImpl.invoke(DelegatingMethodAccessorImpl.java:43)
>         at java.lang.reflect.Method.invoke(Method.java:606)
>         at com.carrotsearch.randomizedtesting.RandomizedRunner.invoke(RandomizedRunner.java:1618)
>         at com.carrotsearch.randomizedtesting.RandomizedRunner$6.evaluate(RandomizedRunner.java:827)
>         at com.carrotsearch.randomizedtesting.RandomizedRunner$7.evaluate(RandomizedRunner.java:863)
>         at com.carrotsearch.randomizedtesting.RandomizedRunner$8.evaluate(RandomizedRunner.java:877)
>         at org.apache.lucene.util.TestRuleSetupTeardownChained$1.evaluate(TestRuleSetupTeardownChained.java:50)
>         at org.apache.lucene.util.AbstractBeforeAfterRule$1.evaluate(AbstractBeforeAfterRule.java:46)
>         at com.carrotsearch.randomizedtesting.rules.SystemPropertiesInvariantRule$1.evaluate(SystemPropertiesInvariantRule.java:55)
>         at org.apache.lucene.util.TestRuleThreadAndTestName$1.evaluate(TestRuleThreadAndTestName.java:49)
>         at org.apache.lucene.util.TestRuleIgnoreAfterMaxFailures$1.evaluate(TestRuleIgnoreAfterMaxFailures.java:65)
>         at org.apache.lucene.util.TestRuleMarkFailure$1.evaluate(TestRuleMarkFailure.java:48)
>         at com.carrotsearch.randomizedtesting.rules.StatementAdapter.evaluate(StatementAdapter.java:36)
>         at com.carrotsearch.randomizedtesting.ThreadLeakControl$StatementRunner.run(ThreadLeakControl.java:365)
>         at com.carrotsearch.randomizedtesting.ThreadLeakControl.forkTimeoutingTask(ThreadLeakControl.java:798)
>         at com.carrotsearch.randomizedtesting.ThreadLeakControl$3.evaluate(ThreadLeakControl.java:458)
>         at com.carrotsearch.randomizedtesting.RandomizedRunner.runSingleTest(RandomizedRunner.java:836)
>         at com.carrotsearch.randomizedtesting.RandomizedRunner$3.evaluate(RandomizedRunner.java:738)
>         at com.carrotsearch.randomizedtesting.RandomizedRunner$4.evaluate(RandomizedRunner.java:772)
>         at com.carrotsearch.randomizedtesting.RandomizedRunner$5.evaluate(RandomizedRunner.java:783)
>         at org.apache.lucene.util.AbstractBeforeAfterRule$1.evaluate(AbstractBeforeAfterRule.java:46)
>         at org.apache.lucene.util.TestRuleStoreClassName$1.evaluate(TestRuleStoreClassName.java:42)
>         at com.carrotsearch.randomizedtesting.rules.SystemPropertiesInvariantRule$1.evaluate(SystemPropertiesInvariantRule.java:55)
>         at com.carrotsearch.randomizedtesting.rules.NoShadowingOrOverridesOnMethodsRule$1.evaluate(NoShadowingOrOverridesOnMethodsRule.java:39)
>         at com.carrotsearch.randomizedtesting.rules.NoShadowingOrOverridesOnMethodsRule$1.evaluate(NoShadowingOrOverridesOnMethodsRule.java:39)
>         at com.carrotsearch.randomizedtesting.rules.StatementAdapter.evaluate(StatementAdapter.java:36)
>         at com.carrotsearch.randomizedtesting.rules.StatementAdapter.evaluate(StatementAdapter.java:36)
>         at com.carrotsearch.randomizedtesting.rules.StatementAdapter.evaluate(StatementAdapter.java:36)
>         at org.apache.lucene.util.TestRuleAssertionsRequired$1.evaluate(TestRuleAssertionsRequired.java:43)
>         at org.apache.lucene.util.TestRuleMarkFailure$1.evaluate(TestRuleMarkFailure.java:48)
>         at org.apache.lucene.util.TestRuleIgnoreAfterMaxFailures$1.evaluate(TestRuleIgnoreAfterMaxFailures.java:65)
>         at org.apache.lucene.util.TestRuleIgnoreTestSuites$1.evaluate(TestRuleIgnoreTestSuites.java:55)
>         at com.carrotsearch.randomizedtesting.rules.StatementAdapter.evaluate(StatementAdapter.java:36)
>         at com.carrotsearch.randomizedtesting.ThreadLeakControl$StatementRunner.run(ThreadLeakControl.java:365)
>         at java.lang.Thread.run(Thread.java:745)
> Caused by: java.lang.AssertionError: Directory not closed: MockDirectoryWrapper(SimpleFSDirectory@/usr/home/jenkins/jenkins-slave/workspace/Lucene-Solr-NightlyTests-trunk/lucene/build/core/test/J3/temp/lucene.index.TestIndexWriterOnJRECrash-5205AA7E864A31F-001/jrecrash-001 lockFactory=NativeFSLockFactory@/usr/home/jenkins/jenkins-slave/workspace/Lucene-Solr-NightlyTests-trunk/lucene/build/core/test/J3/temp/lucene.index.TestIndexWriterOnJRECrash-5205AA7E864A31F-001/jrecrash-001)
>         at org.junit.Assert.fail(Assert.java:93)
>         at org.apache.lucene.util.CloseableDirectory.close(CloseableDirectory.java:47)
>         at com.carrotsearch.randomizedtesting.RandomizedRunner$2$1.apply(RandomizedRunner.java:699)
>         at com.carrotsearch.randomizedtesting.RandomizedRunner$2$1.apply(RandomizedRunner.java:696)
>         at com.carrotsearch.randomizedtesting.RandomizedContext.closeResources(RandomizedContext.java:183)
>         at com.carrotsearch.randomizedtesting.RandomizedRunner$2.afterAlways(RandomizedRunner.java:712)
>         at com.carrotsearch.randomizedtesting.rules.StatementAdapter.evaluate(StatementAdapter.java:43)
>         ... 2 more
>
>
> FAILED:  junit.framework.TestSuite.org.apache.lucene.index.TestIndexWriterOnJRECrash
>
> Error Message:
> Resource in scope SUITE failed to close. Resource was registered from thread Thread[id=3203, name=TEST-TestIndexWriterOnJRECrash.testNRTThreads-seed#[5205AA7E864A31F], state=RUNNABLE, group=TGRP-TestIndexWriterOnJRECrash], registration stack trace below.
>
> Stack Trace:
> com.carrotsearch.randomizedtesting.ResourceDisposalError: Resource in scope SUITE failed to close. Resource was registered from thread Thread[id=3203, name=TEST-TestIndexWriterOnJRECrash.testNRTThreads-seed#[5205AA7E864A31F], state=RUNNABLE, group=TGRP-TestIndexWriterOnJRECrash], registration stack trace below.
>         at java.lang.Thread.getStackTrace(Thread.java:1589)
>         at com.carrotsearch.randomizedtesting.RandomizedContext.closeAtEnd(RandomizedContext.java:166)
>         at org.apache.lucene.util.LuceneTestCase.closeAfterSuite(LuceneTestCase.java:731)
>         at org.apache.lucene.util.LuceneTestCase.wrapDirectory(LuceneTestCase.java:1274)
>         at org.apache.lucene.util.LuceneTestCase.newFSDirectory(LuceneTestCase.java:1216)
>         at org.apache.lucene.util.LuceneTestCase.newFSDirectory(LuceneTestCase.java:1196)
>         at org.apache.lucene.util.LuceneTestCase.newFSDirectory(LuceneTestCase.java:1191)
>         at org.apache.lucene.index.TestIndexWriterOnJRECrash$2.postVisitDirectory(TestIndexWriterOnJRECrash.java:162)
>         at org.apache.lucene.index.TestIndexWriterOnJRECrash$2.postVisitDirectory(TestIndexWriterOnJRECrash.java:156)
>         at java.nio.file.FileTreeWalker.walk(FileTreeWalker.java:224)
>         at java.nio.file.FileTreeWalker.walk(FileTreeWalker.java:199)
>         at java.nio.file.FileTreeWalker.walk(FileTreeWalker.java:199)
>         at java.nio.file.FileTreeWalker.walk(FileTreeWalker.java:69)
>         at java.nio.file.Files.walkFileTree(Files.java:2602)
>         at java.nio.file.Files.walkFileTree(Files.java:2635)
>         at org.apache.lucene.index.TestIndexWriterOnJRECrash.checkIndexes(TestIndexWriterOnJRECrash.java:156)
>         at org.apache.lucene.index.TestIndexWriterOnJRECrash.testNRTThreads(TestIndexWriterOnJRECrash.java:61)
>         at sun.reflect.NativeMethodAccessorImpl.invoke0(Native Method)
>         at sun.reflect.NativeMethodAccessorImpl.invoke(NativeMethodAccessorImpl.java:57)
>         at sun.reflect.DelegatingMethodAccessorImpl.invoke(DelegatingMethodAccessorImpl.java:43)
>         at java.lang.reflect.Method.invoke(Method.java:606)
>         at com.carrotsearch.randomizedtesting.RandomizedRunner.invoke(RandomizedRunner.java:1618)
>         at com.carrotsearch.randomizedtesting.RandomizedRunner$6.evaluate(RandomizedRunner.java:827)
>         at com.carrotsearch.randomizedtesting.RandomizedRunner$7.evaluate(RandomizedRunner.java:863)
>         at com.carrotsearch.randomizedtesting.RandomizedRunner$8.evaluate(RandomizedRunner.java:877)
>         at org.apache.lucene.util.TestRuleSetupTeardownChained$1.evaluate(TestRuleSetupTeardownChained.java:50)
>         at org.apache.lucene.util.AbstractBeforeAfterRule$1.evaluate(AbstractBeforeAfterRule.java:46)
>         at com.carrotsearch.randomizedtesting.rules.SystemPropertiesInvariantRule$1.evaluate(SystemPropertiesInvariantRule.java:55)
>         at org.apache.lucene.util.TestRuleThreadAndTestName$1.evaluate(TestRuleThreadAndTestName.java:49)
>         at org.apache.lucene.util.TestRuleIgnoreAfterMaxFailures$1.evaluate(TestRuleIgnoreAfterMaxFailures.java:65)
>         at org.apache.lucene.util.TestRuleMarkFailure$1.evaluate(TestRuleMarkFailure.java:48)
>         at com.carrotsearch.randomizedtesting.rules.StatementAdapter.evaluate(StatementAdapter.java:36)
>         at com.carrotsearch.randomizedtesting.ThreadLeakControl$StatementRunner.run(ThreadLeakControl.java:365)
>         at com.carrotsearch.randomizedtesting.ThreadLeakControl.forkTimeoutingTask(ThreadLeakControl.java:798)
>         at com.carrotsearch.randomizedtesting.ThreadLeakControl$3.evaluate(ThreadLeakControl.java:458)
>         at com.carrotsearch.randomizedtesting.RandomizedRunner.runSingleTest(RandomizedRunner.java:836)
>         at com.carrotsearch.randomizedtesting.RandomizedRunner$3.evaluate(RandomizedRunner.java:738)
>         at com.carrotsearch.randomizedtesting.RandomizedRunner$4.evaluate(RandomizedRunner.java:772)
>         at com.carrotsearch.randomizedtesting.RandomizedRunner$5.evaluate(RandomizedRunner.java:783)
>         at org.apache.lucene.util.AbstractBeforeAfterRule$1.evaluate(AbstractBeforeAfterRule.java:46)
>         at org.apache.lucene.util.TestRuleStoreClassName$1.evaluate(TestRuleStoreClassName.java:42)
>         at com.carrotsearch.randomizedtesting.rules.SystemPropertiesInvariantRule$1.evaluate(SystemPropertiesInvariantRule.java:55)
>         at com.carrotsearch.randomizedtesting.rules.NoShadowingOrOverridesOnMethodsRule$1.evaluate(NoShadowingOrOverridesOnMethodsRule.java:39)
>         at com.carrotsearch.randomizedtesting.rules.NoShadowingOrOverridesOnMethodsRule$1.evaluate(NoShadowingOrOverridesOnMethodsRule.java:39)
>         at com.carrotsearch.randomizedtesting.rules.StatementAdapter.evaluate(StatementAdapter.java:36)
>         at com.carrotsearch.randomizedtesting.rules.StatementAdapter.evaluate(StatementAdapter.java:36)
>         at com.carrotsearch.randomizedtesting.rules.StatementAdapter.evaluate(StatementAdapter.java:36)
>         at org.apache.lucene.util.TestRuleAssertionsRequired$1.evaluate(TestRuleAssertionsRequired.java:43)
>         at org.apache.lucene.util.TestRuleMarkFailure$1.evaluate(TestRuleMarkFailure.java:48)
>         at org.apache.lucene.util.TestRuleIgnoreAfterMaxFailures$1.evaluate(TestRuleIgnoreAfterMaxFailures.java:65)
>         at org.apache.lucene.util.TestRuleIgnoreTestSuites$1.evaluate(TestRuleIgnoreTestSuites.java:55)
>         at com.carrotsearch.randomizedtesting.rules.StatementAdapter.evaluate(StatementAdapter.java:36)
>         at com.carrotsearch.randomizedtesting.ThreadLeakControl$StatementRunner.run(ThreadLeakControl.java:365)
>         at java.lang.Thread.run(Thread.java:745)
> Caused by: java.lang.AssertionError: Directory not closed: MockDirectoryWrapper(SimpleFSDirectory@/usr/home/jenkins/jenkins-slave/workspace/Lucene-Solr-NightlyTests-trunk/lucene/build/core/test/J3/temp/lucene.index.TestIndexWriterOnJRECrash-5205AA7E864A31F-001/jrecrash-001/lucene.index.TestIndexWriterOnJRECrash-10C9D1188CF0C871-001/jrecrash-001 lockFactory=NativeFSLockFactory@/usr/home/jenkins/jenkins-slave/workspace/Lucene-Solr-NightlyTests-trunk/lucene/build/core/test/J3/temp/lucene.index.TestIndexWriterOnJRECrash-5205AA7E864A31F-001/jrecrash-001/lucene.index.TestIndexWriterOnJRECrash-10C9D1188CF0C871-001/jrecrash-001)
>         at org.junit.Assert.fail(Assert.java:93)
>         at org.apache.lucene.util.CloseableDirectory.close(CloseableDirectory.java:47)
>         at com.carrotsearch.randomizedtesting.RandomizedRunner$2$1.apply(RandomizedRunner.java:699)
>         at com.carrotsearch.randomizedtesting.RandomizedRunner$2$1.apply(RandomizedRunner.java:696)
>         at com.carrotsearch.randomizedtesting.RandomizedContext.closeResources(RandomizedContext.java:183)
>         at com.carrotsearch.randomizedtesting.RandomizedRunner$2.afterAlways(RandomizedRunner.java:712)
>         at com.carrotsearch.randomizedtesting.rules.StatementAdapter.evaluate(StatementAdapter.java:43)
>         ... 2 more
>
>
> FAILED:  junit.framework.TestSuite.org.apache.lucene.index.TestIndexWriterOnJRECrash
>
> Error Message:
> Resource in scope SUITE failed to close. Resource was registered from thread Thread[id=3203, name=TEST-TestIndexWriterOnJRECrash.testNRTThreads-seed#[5205AA7E864A31F], state=RUNNABLE, group=TGRP-TestIndexWriterOnJRECrash], registration stack trace below.
>
> Stack Trace:
> com.carrotsearch.randomizedtesting.ResourceDisposalError: Resource in scope SUITE failed to close. Resource was registered from thread Thread[id=3203, name=TEST-TestIndexWriterOnJRECrash.testNRTThreads-seed#[5205AA7E864A31F], state=RUNNABLE, group=TGRP-TestIndexWriterOnJRECrash], registration stack trace below.
>         at java.lang.Thread.getStackTrace(Thread.java:1589)
>         at com.carrotsearch.randomizedtesting.RandomizedContext.closeAtEnd(RandomizedContext.java:166)
>         at org.apache.lucene.util.LuceneTestCase.closeAfterSuite(LuceneTestCase.java:731)
>         at org.apache.lucene.util.LuceneTestCase.wrapDirectory(LuceneTestCase.java:1268)
>         at org.apache.lucene.util.LuceneTestCase.newFSDirectory(LuceneTestCase.java:1216)
>         at org.apache.lucene.util.LuceneTestCase.newFSDirectory(LuceneTestCase.java:1196)
>         at org.apache.lucene.util.LuceneTestCase.newFSDirectory(LuceneTestCase.java:1191)
>         at org.apache.lucene.index.TestIndexWriterOnJRECrash$2.postVisitDirectory(TestIndexWriterOnJRECrash.java:162)
>         at org.apache.lucene.index.TestIndexWriterOnJRECrash$2.postVisitDirectory(TestIndexWriterOnJRECrash.java:156)
>         at java.nio.file.FileTreeWalker.walk(FileTreeWalker.java:224)
>         at java.nio.file.FileTreeWalker.walk(FileTreeWalker.java:199)
>         at java.nio.file.FileTreeWalker.walk(FileTreeWalker.java:199)
>         at java.nio.file.FileTreeWalker.walk(FileTreeWalker.java:69)
>         at java.nio.file.Files.walkFileTree(Files.java:2602)
>         at java.nio.file.Files.walkFileTree(Files.java:2635)
>         at org.apache.lucene.index.TestIndexWriterOnJRECrash.checkIndexes(TestIndexWriterOnJRECrash.java:156)
>         at org.apache.lucene.index.TestIndexWriterOnJRECrash.testNRTThreads(TestIndexWriterOnJRECrash.java:61)
>         at sun.reflect.NativeMethodAccessorImpl.invoke0(Native Method)
>         at sun.reflect.NativeMethodAccessorImpl.invoke(NativeMethodAccessorImpl.java:57)
>         at sun.reflect.DelegatingMethodAccessorImpl.invoke(DelegatingMethodAccessorImpl.java:43)
>         at java.lang.reflect.Method.invoke(Method.java:606)
>         at com.carrotsearch.randomizedtesting.RandomizedRunner.invoke(RandomizedRunner.java:1618)
>         at com.carrotsearch.randomizedtesting.RandomizedRunner$6.evaluate(RandomizedRunner.java:827)
>         at com.carrotsearch.randomizedtesting.RandomizedRunner$7.evaluate(RandomizedRunner.java:863)
>         at com.carrotsearch.randomizedtesting.RandomizedRunner$8.evaluate(RandomizedRunner.java:877)
>         at org.apache.lucene.util.TestRuleSetupTeardownChained$1.evaluate(TestRuleSetupTeardownChained.java:50)
>         at org.apache.lucene.util.AbstractBeforeAfterRule$1.evaluate(AbstractBeforeAfterRule.java:46)
>         at com.carrotsearch.randomizedtesting.rules.SystemPropertiesInvariantRule$1.evaluate(SystemPropertiesInvariantRule.java:55)
>         at org.apache.lucene.util.TestRuleThreadAndTestName$1.evaluate(TestRuleThreadAndTestName.java:49)
>         at org.apache.lucene.util.TestRuleIgnoreAfterMaxFailures$1.evaluate(TestRuleIgnoreAfterMaxFailures.java:65)
>         at org.apache.lucene.util.TestRuleMarkFailure$1.evaluate(TestRuleMarkFailure.java:48)
>         at com.carrotsearch.randomizedtesting.rules.StatementAdapter.evaluate(StatementAdapter.java:36)
>         at com.carrotsearch.randomizedtesting.ThreadLeakControl$StatementRunner.run(ThreadLeakControl.java:365)
>         at com.carrotsearch.randomizedtesting.ThreadLeakControl.forkTimeoutingTask(ThreadLeakControl.java:798)
>         at com.carrotsearch.randomizedtesting.ThreadLeakControl$3.evaluate(ThreadLeakControl.java:458)
>         at com.carrotsearch.randomizedtesting.RandomizedRunner.runSingleTest(RandomizedRunner.java:836)
>         at com.carrotsearch.randomizedtesting.RandomizedRunner$3.evaluate(RandomizedRunner.java:738)
>         at com.carrotsearch.randomizedtesting.RandomizedRunner$4.evaluate(RandomizedRunner.java:772)
>         at com.carrotsearch.randomizedtesting.RandomizedRunner$5.evaluate(RandomizedRunner.java:783)
>         at org.apache.lucene.util.AbstractBeforeAfterRule$1.evaluate(AbstractBeforeAfterRule.java:46)
>         at org.apache.lucene.util.TestRuleStoreClassName$1.evaluate(TestRuleStoreClassName.java:42)
>         at com.carrotsearch.randomizedtesting.rules.SystemPropertiesInvariantRule$1.evaluate(SystemPropertiesInvariantRule.java:55)
>         at com.carrotsearch.randomizedtesting.rules.NoShadowingOrOverridesOnMethodsRule$1.evaluate(NoShadowingOrOverridesOnMethodsRule.java:39)
>         at com.carrotsearch.randomizedtesting.rules.NoShadowingOrOverridesOnMethodsRule$1.evaluate(NoShadowingOrOverridesOnMethodsRule.java:39)
>         at com.carrotsearch.randomizedtesting.rules.StatementAdapter.evaluate(StatementAdapter.java:36)
>         at com.carrotsearch.randomizedtesting.rules.StatementAdapter.evaluate(StatementAdapter.java:36)
>         at com.carrotsearch.randomizedtesting.rules.StatementAdapter.evaluate(StatementAdapter.java:36)
>         at org.apache.lucene.util.TestRuleAssertionsRequired$1.evaluate(TestRuleAssertionsRequired.java:43)
>         at org.apache.lucene.util.TestRuleMarkFailure$1.evaluate(TestRuleMarkFailure.java:48)
>         at org.apache.lucene.util.TestRuleIgnoreAfterMaxFailures$1.evaluate(TestRuleIgnoreAfterMaxFailures.java:65)
>         at org.apache.lucene.util.TestRuleIgnoreTestSuites$1.evaluate(TestRuleIgnoreTestSuites.java:55)
>         at com.carrotsearch.randomizedtesting.rules.StatementAdapter.evaluate(StatementAdapter.java:36)
>         at com.carrotsearch.randomizedtesting.ThreadLeakControl$StatementRunner.run(ThreadLeakControl.java:365)
>         at java.lang.Thread.run(Thread.java:745)
> Caused by: java.lang.AssertionError: Directory not closed: BaseDirectoryWrapper(NIOFSDirectory@/usr/home/jenkins/jenkins-slave/workspace/Lucene-Solr-NightlyTests-trunk/lucene/build/core/test/J3/temp/lucene.index.TestIndexWriterOnJRECrash-5205AA7E864A31F-001/jrecrash-001/lucene.index.TestIndexWriterOnJRECrash-10C9D1188CF0C871-001/TestNRTThreads-001 lockFactory=NativeFSLockFactory@/usr/home/jenkins/jenkins-slave/workspace/Lucene-Solr-NightlyTests-trunk/lucene/build/core/test/J3/temp/lucene.index.TestIndexWriterOnJRECrash-5205AA7E864A31F-001/jrecrash-001/lucene.index.TestIndexWriterOnJRECrash-10C9D1188CF0C871-001/TestNRTThreads-001)
>         at org.junit.Assert.fail(Assert.java:93)
>         at org.apache.lucene.util.CloseableDirectory.close(CloseableDirectory.java:47)
>         at com.carrotsearch.randomizedtesting.RandomizedRunner$2$1.apply(RandomizedRunner.java:699)
>         at com.carrotsearch.randomizedtesting.RandomizedRunner$2$1.apply(RandomizedRunner.java:696)
>         at com.carrotsearch.randomizedtesting.RandomizedContext.closeResources(RandomizedContext.java:183)
>         at com.carrotsearch.randomizedtesting.RandomizedRunner$2.afterAlways(RandomizedRunner.java:712)
>         at com.carrotsearch.randomizedtesting.rules.StatementAdapter.evaluate(StatementAdapter.java:43)
>         ... 2 more
>
>
> FAILED:  junit.framework.TestSuite.org.apache.lucene.index.TestIndexWriterOnJRECrash
>
> Error Message:
> Resource in scope SUITE failed to close. Resource was registered from thread Thread[id=3203, name=TEST-TestIndexWriterOnJRECrash.testNRTThreads-seed#[5205AA7E864A31F], state=RUNNABLE, group=TGRP-TestIndexWriterOnJRECrash], registration stack trace below.
>
> Stack Trace:
> com.carrotsearch.randomizedtesting.ResourceDisposalError: Resource in scope SUITE failed to close. Resource was registered from thread Thread[id=3203, name=TEST-TestIndexWriterOnJRECrash.testNRTThreads-seed#[5205AA7E864A31F], state=RUNNABLE, group=TGRP-TestIndexWriterOnJRECrash], registration stack trace below.
>         at java.lang.Thread.getStackTrace(Thread.java:1589)
>         at com.carrotsearch.randomizedtesting.RandomizedContext.closeAtEnd(RandomizedContext.java:166)
>         at org.apache.lucene.util.LuceneTestCase.closeAfterSuite(LuceneTestCase.java:731)
>         at org.apache.lucene.util.LuceneTestCase.wrapDirectory(LuceneTestCase.java:1274)
>         at org.apache.lucene.util.LuceneTestCase.newFSDirectory(LuceneTestCase.java:1216)
>         at org.apache.lucene.util.LuceneTestCase.newFSDirectory(LuceneTestCase.java:1196)
>         at org.apache.lucene.util.LuceneTestCase.newFSDirectory(LuceneTestCase.java:1191)
>         at org.apache.lucene.index.TestIndexWriterOnJRECrash$2.postVisitDirectory(TestIndexWriterOnJRECrash.java:162)
>         at org.apache.lucene.index.TestIndexWriterOnJRECrash$2.postVisitDirectory(TestIndexWriterOnJRECrash.java:156)
>         at java.nio.file.FileTreeWalker.walk(FileTreeWalker.java:224)
>         at java.nio.file.FileTreeWalker.walk(FileTreeWalker.java:199)
>         at java.nio.file.FileTreeWalker.walk(FileTreeWalker.java:69)
>         at java.nio.file.Files.walkFileTree(Files.java:2602)
>         at java.nio.file.Files.walkFileTree(Files.java:2635)
>         at org.apache.lucene.index.TestIndexWriterOnJRECrash.checkIndexes(TestIndexWriterOnJRECrash.java:156)
>         at org.apache.lucene.index.TestIndexWriterOnJRECrash.testNRTThreads(TestIndexWriterOnJRECrash.java:61)
>         at sun.reflect.NativeMethodAccessorImpl.invoke0(Native Method)
>         at sun.reflect.NativeMethodAccessorImpl.invoke(NativeMethodAccessorImpl.java:57)
>         at sun.reflect.DelegatingMethodAccessorImpl.invoke(DelegatingMethodAccessorImpl.java:43)
>         at java.lang.reflect.Method.invoke(Method.java:606)
>         at com.carrotsearch.randomizedtesting.RandomizedRunner.invoke(RandomizedRunner.java:1618)
>         at com.carrotsearch.randomizedtesting.RandomizedRunner$6.evaluate(RandomizedRunner.java:827)
>         at com.carrotsearch.randomizedtesting.RandomizedRunner$7.evaluate(RandomizedRunner.java:863)
>         at com.carrotsearch.randomizedtesting.RandomizedRunner$8.evaluate(RandomizedRunner.java:877)
>         at org.apache.lucene.util.TestRuleSetupTeardownChained$1.evaluate(TestRuleSetupTeardownChained.java:50)
>         at org.apache.lucene.util.AbstractBeforeAfterRule$1.evaluate(AbstractBeforeAfterRule.java:46)
>         at com.carrotsearch.randomizedtesting.rules.SystemPropertiesInvariantRule$1.evaluate(SystemPropertiesInvariantRule.java:55)
>         at org.apache.lucene.util.TestRuleThreadAndTestName$1.evaluate(TestRuleThreadAndTestName.java:49)
>         at org.apache.lucene.util.TestRuleIgnoreAfterMaxFailures$1.evaluate(TestRuleIgnoreAfterMaxFailures.java:65)
>         at org.apache.lucene.util.TestRuleMarkFailure$1.evaluate(TestRuleMarkFailure.java:48)
>         at com.carrotsearch.randomizedtesting.rules.StatementAdapter.evaluate(StatementAdapter.java:36)
>         at com.carrotsearch.randomizedtesting.ThreadLeakControl$StatementRunner.run(ThreadLeakControl.java:365)
>         at com.carrotsearch.randomizedtesting.ThreadLeakControl.forkTimeoutingTask(ThreadLeakControl.java:798)
>         at com.carrotsearch.randomizedtesting.ThreadLeakControl$3.evaluate(ThreadLeakControl.java:458)
>         at com.carrotsearch.randomizedtesting.RandomizedRunner.runSingleTest(RandomizedRunner.java:836)
>         at com.carrotsearch.randomizedtesting.RandomizedRunner$3.evaluate(RandomizedRunner.java:738)
>         at com.carrotsearch.randomizedtesting.RandomizedRunner$4.evaluate(RandomizedRunner.java:772)
>         at com.carrotsearch.randomizedtesting.RandomizedRunner$5.evaluate(RandomizedRunner.java:783)
>         at org.apache.lucene.util.AbstractBeforeAfterRule$1.evaluate(AbstractBeforeAfterRule.java:46)
>         at org.apache.lucene.util.TestRuleStoreClassName$1.evaluate(TestRuleStoreClassName.java:42)
>         at com.carrotsearch.randomizedtesting.rules.SystemPropertiesInvariantRule$1.evaluate(SystemPropertiesInvariantRule.java:55)
>         at com.carrotsearch.randomizedtesting.rules.NoShadowingOrOverridesOnMethodsRule$1.evaluate(NoShadowingOrOverridesOnMethodsRule.java:39)
>         at com.carrotsearch.randomizedtesting.rules.NoShadowingOrOverridesOnMethodsRule$1.evaluate(NoShadowingOrOverridesOnMethodsRule.java:39)
>         at com.carrotsearch.randomizedtesting.rules.StatementAdapter.evaluate(StatementAdapter.java:36)
>         at com.carrotsearch.randomizedtesting.rules.StatementAdapter.evaluate(StatementAdapter.java:36)
>         at com.carrotsearch.randomizedtesting.rules.StatementAdapter.evaluate(StatementAdapter.java:36)
>         at org.apache.lucene.util.TestRuleAssertionsRequired$1.evaluate(TestRuleAssertionsRequired.java:43)
>         at org.apache.lucene.util.TestRuleMarkFailure$1.evaluate(TestRuleMarkFailure.java:48)
>         at org.apache.lucene.util.TestRuleIgnoreAfterMaxFailures$1.evaluate(TestRuleIgnoreAfterMaxFailures.java:65)
>         at org.apache.lucene.util.TestRuleIgnoreTestSuites$1.evaluate(TestRuleIgnoreTestSuites.java:55)
>         at com.carrotsearch.randomizedtesting.rules.StatementAdapter.evaluate(StatementAdapter.java:36)
>         at com.carrotsearch.randomizedtesting.ThreadLeakControl$StatementRunner.run(ThreadLeakControl.java:365)
>         at java.lang.Thread.run(Thread.java:745)
> Caused by: java.lang.AssertionError: Directory not closed: MockDirectoryWrapper(NRTCachingDirectory(MMapDirectory@/usr/home/jenkins/jenkins-slave/workspace/Lucene-Solr-NightlyTests-trunk/lucene/build/core/test/J3/temp/lucene.index.TestIndexWriterOnJRECrash-5205AA7E864A31F-001/jrecrash-001/lucene.index.TestIndexWriterOnJRECrash-10C9D1188CF0C871-001 lockFactory=NativeFSLockFactory@/usr/home/jenkins/jenkins-slave/workspace/Lucene-Solr-NightlyTests-trunk/lucene/build/core/test/J3/temp/lucene.index.TestIndexWriterOnJRECrash-5205AA7E864A31F-001/jrecrash-001/lucene.index.TestIndexWriterOnJRECrash-10C9D1188CF0C871-001; maxCacheMB=0.1376953125 maxMergeSizeMB=0.16015625))
>         at org.junit.Assert.fail(Assert.java:93)
>         at org.apache.lucene.util.CloseableDirectory.close(CloseableDirectory.java:47)
>         at com.carrotsearch.randomizedtesting.RandomizedRunner$2$1.apply(RandomizedRunner.java:699)
>         at com.carrotsearch.randomizedtesting.RandomizedRunner$2$1.apply(RandomizedRunner.java:696)
>         at com.carrotsearch.randomizedtesting.RandomizedContext.closeResources(RandomizedContext.java:183)
>         at com.carrotsearch.randomizedtesting.RandomizedRunner$2.afterAlways(RandomizedRunner.java:712)
>         at com.carrotsearch.randomizedtesting.rules.StatementAdapter.evaluate(StatementAdapter.java:43)
>         ... 2 more
>
>
> FAILED:  junit.framework.TestSuite.org.apache.lucene.index.TestIndexWriterOnJRECrash
>
> Error Message:
> Resource in scope SUITE failed to close. Resource was registered from thread Thread[id=3203, name=TEST-TestIndexWriterOnJRECrash.testNRTThreads-seed#[5205AA7E864A31F], state=RUNNABLE, group=TGRP-TestIndexWriterOnJRECrash], registration stack trace below.
>
> Stack Trace:
> com.carrotsearch.randomizedtesting.ResourceDisposalError: Resource in scope SUITE failed to close. Resource was registered from thread Thread[id=3203, name=TEST-TestIndexWriterOnJRECrash.testNRTThreads-seed#[5205AA7E864A31F], state=RUNNABLE, group=TGRP-TestIndexWriterOnJRECrash], registration stack trace below.
>         at java.lang.Thread.getStackTrace(Thread.java:1589)
>         at com.carrotsearch.randomizedtesting.RandomizedContext.closeAtEnd(RandomizedContext.java:166)
>         at org.apache.lucene.util.LuceneTestCase.closeAfterSuite(LuceneTestCase.java:731)
>         at org.apache.lucene.util.LuceneTestCase.wrapDirectory(LuceneTestCase.java:1274)
>         at org.apache.lucene.util.LuceneTestCase.newFSDirectory(LuceneTestCase.java:1216)
>         at org.apache.lucene.util.LuceneTestCase.newFSDirectory(LuceneTestCase.java:1196)
>         at org.apache.lucene.util.LuceneTestCase.newFSDirectory(LuceneTestCase.java:1191)
>         at org.apache.lucene.index.TestIndexWriterOnJRECrash$2.postVisitDirectory(TestIndexWriterOnJRECrash.java:162)
>         at org.apache.lucene.index.TestIndexWriterOnJRECrash$2.postVisitDirectory(TestIndexWriterOnJRECrash.java:156)
>         at java.nio.file.FileTreeWalker.walk(FileTreeWalker.java:224)
>         at java.nio.file.FileTreeWalker.walk(FileTreeWalker.java:199)
>         at java.nio.file.FileTreeWalker.walk(FileTreeWalker.java:199)
>         at java.nio.file.FileTreeWalker.walk(FileTreeWalker.java:69)
>         at java.nio.file.Files.walkFileTree(Files.java:2602)
>         at java.nio.file.Files.walkFileTree(Files.java:2635)
>         at org.apache.lucene.index.TestIndexWriterOnJRECrash.checkIndexes(TestIndexWriterOnJRECrash.java:156)
>         at org.apache.lucene.index.TestIndexWriterOnJRECrash.testNRTThreads(TestIndexWriterOnJRECrash.java:61)
>         at sun.reflect.NativeMethodAccessorImpl.invoke0(Native Method)
>         at sun.reflect.NativeMethodAccessorImpl.invoke(NativeMethodAccessorImpl.java:57)
>         at sun.reflect.DelegatingMethodAccessorImpl.invoke(DelegatingMethodAccessorImpl.java:43)
>         at java.lang.reflect.Method.invoke(Method.java:606)
>         at com.carrotsearch.randomizedtesting.RandomizedRunner.invoke(RandomizedRunner.java:1618)
>         at com.carrotsearch.randomizedtesting.RandomizedRunner$6.evaluate(RandomizedRunner.java:827)
>         at com.carrotsearch.randomizedtesting.RandomizedRunner$7.evaluate(RandomizedRunner.java:863)
>         at com.carrotsearch.randomizedtesting.RandomizedRunner$8.evaluate(RandomizedRunner.java:877)
>         at org.apache.lucene.util.TestRuleSetupTeardownChained$1.evaluate(TestRuleSetupTeardownChained.java:50)
>         at org.apache.lucene.util.AbstractBeforeAfterRule$1.evaluate(AbstractBeforeAfterRule.java:46)
>         at com.carrotsearch.randomizedtesting.rules.SystemPropertiesInvariantRule$1.evaluate(SystemPropertiesInvariantRule.java:55)
>         at org.apache.lucene.util.TestRuleThreadAndTestName$1.evaluate(TestRuleThreadAndTestName.java:49)
>         at org.apache.lucene.util.TestRuleIgnoreAfterMaxFailures$1.evaluate(TestRuleIgnoreAfterMaxFailures.java:65)
>         at org.apache.lucene.util.TestRuleMarkFailure$1.evaluate(TestRuleMarkFailure.java:48)
>         at com.carrotsearch.randomizedtesting.rules.StatementAdapter.evaluate(StatementAdapter.java:36)
>         at com.carrotsearch.randomizedtesting.ThreadLeakControl$StatementRunner.run(ThreadLeakControl.java:365)
>         at com.carrotsearch.randomizedtesting.ThreadLeakControl.forkTimeoutingTask(ThreadLeakControl.java:798)
>         at com.carrotsearch.randomizedtesting.ThreadLeakControl$3.evaluate(ThreadLeakControl.java:458)
>         at com.carrotsearch.randomizedtesting.RandomizedRunner.runSingleTest(RandomizedRunner.java:836)
>         at com.carrotsearch.randomizedtesting.RandomizedRunner$3.evaluate(RandomizedRunner.java:738)
>         at com.carrotsearch.randomizedtesting.RandomizedRunner$4.evaluate(RandomizedRunner.java:772)
>         at com.carrotsearch.randomizedtesting.RandomizedRunner$5.evaluate(RandomizedRunner.java:783)
>         at org.apache.lucene.util.AbstractBeforeAfterRule$1.evaluate(AbstractBeforeAfterRule.java:46)
>         at org.apache.lucene.util.TestRuleStoreClassName$1.evaluate(TestRuleStoreClassName.java:42)
>         at com.carrotsearch.randomizedtesting.rules.SystemPropertiesInvariantRule$1.evaluate(SystemPropertiesInvariantRule.java:55)
>         at com.carrotsearch.randomizedtesting.rules.NoShadowingOrOverridesOnMethodsRule$1.evaluate(NoShadowingOrOverridesOnMethodsRule.java:39)
>         at com.carrotsearch.randomizedtesting.rules.NoShadowingOrOverridesOnMethodsRule$1.evaluate(NoShadowingOrOverridesOnMethodsRule.java:39)
>         at com.carrotsearch.randomizedtesting.rules.StatementAdapter.evaluate(StatementAdapter.java:36)
>         at com.carrotsearch.randomizedtesting.rules.StatementAdapter.evaluate(StatementAdapter.java:36)
>         at com.carrotsearch.randomizedtesting.rules.StatementAdapter.evaluate(StatementAdapter.java:36)
>         at org.apache.lucene.util.TestRuleAssertionsRequired$1.evaluate(TestRuleAssertionsRequired.java:43)
>         at org.apache.lucene.util.TestRuleMarkFailure$1.evaluate(TestRuleMarkFailure.java:48)
>         at org.apache.lucene.util.TestRuleIgnoreAfterMaxFailures$1.evaluate(TestRuleIgnoreAfterMaxFailures.java:65)
>         at org.apache.lucene.util.TestRuleIgnoreTestSuites$1.evaluate(TestRuleIgnoreTestSuites.java:55)
>         at com.carrotsearch.randomizedtesting.rules.StatementAdapter.evaluate(StatementAdapter.java:36)
>         at com.carrotsearch.randomizedtesting.ThreadLeakControl$StatementRunner.run(ThreadLeakControl.java:365)
>         at java.lang.Thread.run(Thread.java:745)
> Caused by: java.lang.AssertionError: Directory not closed: MockDirectoryWrapper(NIOFSDirectory@/usr/home/jenkins/jenkins-slave/workspace/Lucene-Solr-NightlyTests-trunk/lucene/build/core/test/J3/temp/lucene.index.TestIndexWriterOnJRECrash-5205AA7E864A31F-001/jrecrash-001/lucene.index.TestIndexWriterOnJRECrash-A641CAE0E9D5A76B-001/jrecrash-001 lockFactory=NativeFSLockFactory@/usr/home/jenkins/jenkins-slave/workspace/Lucene-Solr-NightlyTests-trunk/lucene/build/core/test/J3/temp/lucene.index.TestIndexWriterOnJRECrash-5205AA7E864A31F-001/jrecrash-001/lucene.index.TestIndexWriterOnJRECrash-A641CAE0E9D5A76B-001/jrecrash-001)
>         at org.junit.Assert.fail(Assert.java:93)
>         at org.apache.lucene.util.CloseableDirectory.close(CloseableDirectory.java:47)
>         at com.carrotsearch.randomizedtesting.RandomizedRunner$2$1.apply(RandomizedRunner.java:699)
>         at com.carrotsearch.randomizedtesting.RandomizedRunner$2$1.apply(RandomizedRunner.java:696)
>         at com.carrotsearch.randomizedtesting.RandomizedContext.closeResources(RandomizedContext.java:183)
>         at com.carrotsearch.randomizedtesting.RandomizedRunner$2.afterAlways(RandomizedRunner.java:712)
>         at com.carrotsearch.randomizedtesting.rules.StatementAdapter.evaluate(StatementAdapter.java:43)
>         ... 2 more
>
>
> FAILED:  junit.framework.TestSuite.org.apache.lucene.index.TestIndexWriterOnJRECrash
>
> Error Message:
> Resource in scope SUITE failed to close. Resource was registered from thread Thread[id=3203, name=TEST-TestIndexWriterOnJRECrash.testNRTThreads-seed#[5205AA7E864A31F], state=RUNNABLE, group=TGRP-TestIndexWriterOnJRECrash], registration stack trace below.
>
> Stack Trace:
> com.carrotsearch.randomizedtesting.ResourceDisposalError: Resource in scope SUITE failed to close. Resource was registered from thread Thread[id=3203, name=TEST-TestIndexWriterOnJRECrash.testNRTThreads-seed#[5205AA7E864A31F], state=RUNNABLE, group=TGRP-TestIndexWriterOnJRECrash], registration stack trace below.
>         at java.lang.Thread.getStackTrace(Thread.java:1589)
>         at com.carrotsearch.randomizedtesting.RandomizedContext.closeAtEnd(RandomizedContext.java:166)
>         at org.apache.lucene.util.LuceneTestCase.closeAfterSuite(LuceneTestCase.java:731)
>         at org.apache.lucene.util.LuceneTestCase.wrapDirectory(LuceneTestCase.java:1274)
>         at org.apache.lucene.util.LuceneTestCase.newFSDirectory(LuceneTestCase.java:1216)
>         at org.apache.lucene.util.LuceneTestCase.newFSDirectory(LuceneTestCase.java:1196)
>         at org.apache.lucene.util.LuceneTestCase.newFSDirectory(LuceneTestCase.java:1191)
>         at org.apache.lucene.index.TestIndexWriterOnJRECrash$2.postVisitDirectory(TestIndexWriterOnJRECrash.java:162)
>         at org.apache.lucene.index.TestIndexWriterOnJRECrash$2.postVisitDirectory(TestIndexWriterOnJRECrash.java:156)
>         at java.nio.file.FileTreeWalker.walk(FileTreeWalker.java:224)
>         at java.nio.file.FileTreeWalker.walk(FileTreeWalker.java:199)
>         at java.nio.file.FileTreeWalker.walk(FileTreeWalker.java:69)
>         at java.nio.file.Files.walkFileTree(Files.java:2602)
>         at java.nio.file.Files.walkFileTree(Files.java:2635)
>         at org.apache.lucene.index.TestIndexWriterOnJRECrash.checkIndexes(TestIndexWriterOnJRECrash.java:156)
>         at org.apache.lucene.index.TestIndexWriterOnJRECrash.testNRTThreads(TestIndexWriterOnJRECrash.java:61)
>         at sun.reflect.NativeMethodAccessorImpl.invoke0(Native Method)
>         at sun.reflect.NativeMethodAccessorImpl.invoke(NativeMethodAccessorImpl.java:57)
>         at sun.reflect.DelegatingMethodAccessorImpl.invoke(DelegatingMethodAccessorImpl.java:43)
>         at java.lang.reflect.Method.invoke(Method.java:606)
>         at com.carrotsearch.randomizedtesting.RandomizedRunner.invoke(RandomizedRunner.java:1618)
>         at com.carrotsearch.randomizedtesting.RandomizedRunner$6.evaluate(RandomizedRunner.java:827)
>         at com.carrotsearch.randomizedtesting.RandomizedRunner$7.evaluate(RandomizedRunner.java:863)
>         at com.carrotsearch.randomizedtesting.RandomizedRunner$8.evaluate(RandomizedRunner.java:877)
>         at org.apache.lucene.util.TestRuleSetupTeardownChained$1.evaluate(TestRuleSetupTeardownChained.java:50)
>         at org.apache.lucene.util.AbstractBeforeAfterRule$1.evaluate(AbstractBeforeAfterRule.java:46)
>         at com.carrotsearch.randomizedtesting.rules.SystemPropertiesInvariantRule$1.evaluate(SystemPropertiesInvariantRule.java:55)
>         at org.apache.lucene.util.TestRuleThreadAndTestName$1.evaluate(TestRuleThreadAndTestName.java:49)
>         at org.apache.lucene.util.TestRuleIgnoreAfterMaxFailures$1.evaluate(TestRuleIgnoreAfterMaxFailures.java:65)
>         at org.apache.lucene.util.TestRuleMarkFailure$1.evaluate(TestRuleMarkFailure.java:48)
>         at com.carrotsearch.randomizedtesting.rules.StatementAdapter.evaluate(StatementAdapter.java:36)
>         at com.carrotsearch.randomizedtesting.ThreadLeakControl$StatementRunner.run(ThreadLeakControl.java:365)
>         at com.carrotsearch.randomizedtesting.ThreadLeakControl.forkTimeoutingTask(ThreadLeakControl.java:798)
>         at com.carrotsearch.randomizedtesting.ThreadLeakControl$3.evaluate(ThreadLeakControl.java:458)
>         at com.carrotsearch.randomizedtesting.RandomizedRunner.runSingleTest(RandomizedRunner.java:836)
>         at com.carrotsearch.randomizedtesting.RandomizedRunner$3.evaluate(RandomizedRunner.java:738)
>         at com.carrotsearch.randomizedtesting.RandomizedRunner$4.evaluate(RandomizedRunner.java:772)
>         at com.carrotsearch.randomizedtesting.RandomizedRunner$5.evaluate(RandomizedRunner.java:783)
>         at org.apache.lucene.util.AbstractBeforeAfterRule$1.evaluate(AbstractBeforeAfterRule.java:46)
>         at org.apache.lucene.util.TestRuleStoreClassName$1.evaluate(TestRuleStoreClassName.java:42)
>         at com.carrotsearch.randomizedtesting.rules.SystemPropertiesInvariantRule$1.evaluate(SystemPropertiesInvariantRule.java:55)
>         at com.carrotsearch.randomizedtesting.rules.NoShadowingOrOverridesOnMethodsRule$1.evaluate(NoShadowingOrOverridesOnMethodsRule.java:39)
>         at com.carrotsearch.randomizedtesting.rules.NoShadowingOrOverridesOnMethodsRule$1.evaluate(NoShadowingOrOverridesOnMethodsRule.java:39)
>         at com.carrotsearch.randomizedtesting.rules.StatementAdapter.evaluate(StatementAdapter.java:36)
>         at com.carrotsearch.randomizedtesting.rules.StatementAdapter.evaluate(StatementAdapter.java:36)
>         at com.carrotsearch.randomizedtesting.rules.StatementAdapter.evaluate(StatementAdapter.java:36)
>         at org.apache.lucene.util.TestRuleAssertionsRequired$1.evaluate(TestRuleAssertionsRequired.java:43)
>         at org.apache.lucene.util.TestRuleMarkFailure$1.evaluate(TestRuleMarkFailure.java:48)
>         at org.apache.lucene.util.TestRuleIgnoreAfterMaxFailures$1.evaluate(TestRuleIgnoreAfterMaxFailures.java:65)
>         at org.apache.lucene.util.TestRuleIgnoreTestSuites$1.evaluate(TestRuleIgnoreTestSuites.java:55)
>         at com.carrotsearch.randomizedtesting.rules.StatementAdapter.evaluate(StatementAdapter.java:36)
>         at com.carrotsearch.randomizedtesting.ThreadLeakControl$StatementRunner.run(ThreadLeakControl.java:365)
>         at java.lang.Thread.run(Thread.java:745)
> Caused by: java.lang.AssertionError: Directory not closed: MockDirectoryWrapper(SimpleFSDirectory@/usr/home/jenkins/jenkins-slave/workspace/Lucene-Solr-NightlyTests-trunk/lucene/build/core/test/J3/temp/lucene.index.TestIndexWriterOnJRECrash-5205AA7E864A31F-001/jrecrash-001/lucene.index.TestIndexWriterOnJRECrash-A641CAE0E9D5A76B-001 lockFactory=NativeFSLockFactory@/usr/home/jenkins/jenkins-slave/workspace/Lucene-Solr-NightlyTests-trunk/lucene/build/core/test/J3/temp/lucene.index.TestIndexWriterOnJRECrash-5205AA7E864A31F-001/jrecrash-001/lucene.index.TestIndexWriterOnJRECrash-A641CAE0E9D5A76B-001)
>         at org.junit.Assert.fail(Assert.java:93)
>         at org.apache.lucene.util.CloseableDirectory.close(CloseableDirectory.java:47)
>         at com.carrotsearch.randomizedtesting.RandomizedRunner$2$1.apply(RandomizedRunner.java:699)
>         at com.carrotsearch.randomizedtesting.RandomizedRunner$2$1.apply(RandomizedRunner.java:696)
>         at com.carrotsearch.randomizedtesting.RandomizedContext.closeResources(RandomizedContext.java:183)
>         at com.carrotsearch.randomizedtesting.RandomizedRunner$2.afterAlways(RandomizedRunner.java:712)
>         at com.carrotsearch.randomizedtesting.rules.StatementAdapter.evaluate(StatementAdapter.java:43)
>         ... 2 more
>
>
> FAILED:  junit.framework.TestSuite.org.apache.lucene.index.TestIndexWriterOnJRECrash
>
> Error Message:
> Resource in scope SUITE failed to close. Resource was registered from thread Thread[id=3203, name=TEST-TestIndexWriterOnJRECrash.testNRTThreads-seed#[5205AA7E864A31F], state=RUNNABLE, group=TGRP-TestIndexWriterOnJRECrash], registration stack trace below.
>
> Stack Trace:
> com.carrotsearch.randomizedtesting.ResourceDisposalError: Resource in scope SUITE failed to close. Resource was registered from thread Thread[id=3203, name=TEST-TestIndexWriterOnJRECrash.testNRTThreads-seed#[5205AA7E864A31F], state=RUNNABLE, group=TGRP-TestIndexWriterOnJRECrash], registration stack trace below.
>         at java.lang.Thread.getStackTrace(Thread.java:1589)
>         at com.carrotsearch.randomizedtesting.RandomizedContext.closeAtEnd(RandomizedContext.java:166)
>         at org.apache.lucene.util.LuceneTestCase.closeAfterSuite(LuceneTestCase.java:731)
>         at org.apache.lucene.util.LuceneTestCase.wrapDirectory(LuceneTestCase.java:1274)
>         at org.apache.lucene.util.LuceneTestCase.newFSDirectory(LuceneTestCase.java:1216)
>         at org.apache.lucene.util.LuceneTestCase.newFSDirectory(LuceneTestCase.java:1196)
>         at org.apache.lucene.util.LuceneTestCase.newFSDirectory(LuceneTestCase.java:1191)
>         at org.apache.lucene.index.TestIndexWriterOnJRECrash$2.postVisitDirectory(TestIndexWriterOnJRECrash.java:162)
>         at org.apache.lucene.index.TestIndexWriterOnJRECrash$2.postVisitDirectory(TestIndexWriterOnJRECrash.java:156)
>         at java.nio.file.FileTreeWalker.walk(FileTreeWalker.java:224)
>         at java.nio.file.FileTreeWalker.walk(FileTreeWalker.java:69)
>         at java.nio.file.Files.walkFileTree(Files.java:2602)
>         at java.nio.file.Files.walkFileTree(Files.java:2635)
>         at org.apache.lucene.index.TestIndexWriterOnJRECrash.checkIndexes(TestIndexWriterOnJRECrash.java:156)
>         at org.apache.lucene.index.TestIndexWriterOnJRECrash.testNRTThreads(TestIndexWriterOnJRECrash.java:61)
>         at sun.reflect.NativeMethodAccessorImpl.invoke0(Native Method)
>         at sun.reflect.NativeMethodAccessorImpl.invoke(NativeMethodAccessorImpl.java:57)
>         at sun.reflect.DelegatingMethodAccessorImpl.invoke(DelegatingMethodAccessorImpl.java:43)
>         at java.lang.reflect.Method.invoke(Method.java:606)
>         at com.carrotsearch.randomizedtesting.RandomizedRunner.invoke(RandomizedRunner.java:1618)
>         at com.carrotsearch.randomizedtesting.RandomizedRunner$6.evaluate(RandomizedRunner.java:827)
>         at com.carrotsearch.randomizedtesting.RandomizedRunner$7.evaluate(RandomizedRunner.java:863)
>         at com.carrotsearch.randomizedtesting.RandomizedRunner$8.evaluate(RandomizedRunner.java:877)
>         at org.apache.lucene.util.TestRuleSetupTeardownChained$1.evaluate(TestRuleSetupTeardownChained.java:50)
>         at org.apache.lucene.util.AbstractBeforeAfterRule$1.evaluate(AbstractBeforeAfterRule.java:46)
>         at com.carrotsearch.randomizedtesting.rules.SystemPropertiesInvariantRule$1.evaluate(SystemPropertiesInvariantRule.java:55)
>         at org.apache.lucene.util.TestRuleThreadAndTestName$1.evaluate(TestRuleThreadAndTestName.java:49)
>         at org.apache.lucene.util.TestRuleIgnoreAfterMaxFailures$1.evaluate(TestRuleIgnoreAfterMaxFailures.java:65)
>         at org.apache.lucene.util.TestRuleMarkFailure$1.evaluate(TestRuleMarkFailure.java:48)
>         at com.carrotsearch.randomizedtesting.rules.StatementAdapter.evaluate(StatementAdapter.java:36)
>         at com.carrotsearch.randomizedtesting.ThreadLeakControl$StatementRunner.run(ThreadLeakControl.java:365)
>         at com.carrotsearch.randomizedtesting.ThreadLeakControl.forkTimeoutingTask(ThreadLeakControl.java:798)
>         at com.carrotsearch.randomizedtesting.ThreadLeakControl$3.evaluate(ThreadLeakControl.java:458)
>         at com.carrotsearch.randomizedtesting.RandomizedRunner.runSingleTest(RandomizedRunner.java:836)
>         at com.carrotsearch.randomizedtesting.RandomizedRunner$3.evaluate(RandomizedRunner.java:738)
>         at com.carrotsearch.randomizedtesting.RandomizedRunner$4.evaluate(RandomizedRunner.java:772)
>         at com.carrotsearch.randomizedtesting.RandomizedRunner$5.evaluate(RandomizedRunner.java:783)
>         at org.apache.lucene.util.AbstractBeforeAfterRule$1.evaluate(AbstractBeforeAfterRule.java:46)
>         at org.apache.lucene.util.TestRuleStoreClassName$1.evaluate(TestRuleStoreClassName.java:42)
>         at com.carrotsearch.randomizedtesting.rules.SystemPropertiesInvariantRule$1.evaluate(SystemPropertiesInvariantRule.java:55)
>         at com.carrotsearch.randomizedtesting.rules.NoShadowingOrOverridesOnMethodsRule$1.evaluate(NoShadowingOrOverridesOnMethodsRule.java:39)
>         at com.carrotsearch.randomizedtesting.rules.NoShadowingOrOverridesOnMethodsRule$1.evaluate(NoShadowingOrOverridesOnMethodsRule.java:39)
>         at com.carrotsearch.randomizedtesting.rules.StatementAdapter.evaluate(StatementAdapter.java:36)
>         at com.carrotsearch.randomizedtesting.rules.StatementAdapter.evaluate(StatementAdapter.java:36)
>         at com.carrotsearch.randomizedtesting.rules.StatementAdapter.evaluate(StatementAdapter.java:36)
>         at org.apache.lucene.util.TestRuleAssertionsRequired$1.evaluate(TestRuleAssertionsRequired.java:43)
>         at org.apache.lucene.util.TestRuleMarkFailure$1.evaluate(TestRuleMarkFailure.java:48)
>         at org.apache.lucene.util.TestRuleIgnoreAfterMaxFailures$1.evaluate(TestRuleIgnoreAfterMaxFailures.java:65)
>         at org.apache.lucene.util.TestRuleIgnoreTestSuites$1.evaluate(TestRuleIgnoreTestSuites.java:55)
>         at com.carrotsearch.randomizedtesting.rules.StatementAdapter.evaluate(StatementAdapter.java:36)
>         at com.carrotsearch.randomizedtesting.ThreadLeakControl$StatementRunner.run(ThreadLeakControl.java:365)
>         at java.lang.Thread.run(Thread.java:745)
> Caused by: java.lang.AssertionError: Directory not closed: MockDirectoryWrapper(MMapDirectory@/usr/home/jenkins/jenkins-slave/workspace/Lucene-Solr-NightlyTests-trunk/lucene/build/core/test/J3/temp/lucene.index.TestIndexWriterOnJRECrash-5205AA7E864A31F-001/jrecrash-001 lockFactory=NativeFSLockFactory@/usr/home/jenkins/jenkins-slave/workspace/Lucene-Solr-NightlyTests-trunk/lucene/build/core/test/J3/temp/lucene.index.TestIndexWriterOnJRECrash-5205AA7E864A31F-001/jrecrash-001)
>         at org.junit.Assert.fail(Assert.java:93)
>         at org.apache.lucene.util.CloseableDirectory.close(CloseableDirectory.java:47)
>         at com.carrotsearch.randomizedtesting.RandomizedRunner$2$1.apply(RandomizedRunner.java:699)
>         at com.carrotsearch.randomizedtesting.RandomizedRunner$2$1.apply(RandomizedRunner.java:696)
>         at com.carrotsearch.randomizedtesting.RandomizedContext.closeResources(RandomizedContext.java:183)
>         at com.carrotsearch.randomizedtesting.RandomizedRunner$2.afterAlways(RandomizedRunner.java:712)
>         at com.carrotsearch.randomizedtesting.rules.StatementAdapter.evaluate(StatementAdapter.java:43)
>         ... 2 more
>
>
>
>
> Build Log:
> [...truncated 1655 lines...]
>    [junit4] Suite: org.apache.lucene.index.TestIndexWriterOnJRECrash
>    [junit4]   2> NOTE: test params are: codec=Lucene410: {}, docValues:{}, sim=DefaultSimilarity, locale=sr_BA, timezone=Pacific/Rarotonga
>    [junit4]   2> NOTE: FreeBSD 9.1-RELEASE-p3 amd64/Oracle Corporation 1.7.0_65 (64-bit)/cpus=16,threads=1,free=136328648,total=466092032
>    [junit4]   2> NOTE: All tests run in this JVM: [TestAssertions, TestBagOfPostings, TestSpanExplanationsOfNonMatches, TestStringHelper, TestDocumentsWriterStallControl, TestParallelAtomicReader, TestDocument, TestPerFieldPostingsFormat2, TestMockDirectoryWrapper, TestAllFilesHaveChecksumFooter, TestFastDecompressionMode, TestSearchAfter, TestFieldValueFilter, TestBagOfPositions, TestLockFactory, TestIndexWriterForceMerge, TestDocCount, Nested1, TestIntsRef, TestIntBlockPool, TestBooleanScorer, TestOperations, TestConjunctions, TestCrash, TestDocsAndPositions, TestFieldMaskingSpanQuery, TestPositiveScoresOnlyCollector, TestMaxTermFrequency, TestBlockPostingsFormat3, TestBooleanQueryVisitSubscorers, TestLongPostings, TestNamedSPILoader, TestOmitTf, TestAutomatonQueryUnicode, TestUniqueTermCount, TestIndexWriterReader, TestPrefixQuery, TestCrashCausesCorruptIndex, TestIndexWriterOutOfFileDescriptors, TestIndexWriterCommit, TestTermVectorsFormat, Test2BPagedBytes, TestFilterAtomicReader, Nested, Nested, TestFieldCacheRewriteMethod, TestPrefixRandom, TestCharFilter, TestLongBitSet, TestFlex, TestIntroSorter, TestIndexWriter, TestDocValuesFormat, TestNumericRangeQuery64, TestAddIndexes, TestMultiMMap, TestSearcherManager, TestFixedBitSet, TestMultiDocValues, TestBooleanMinShouldMatch, TestTermsEnum2, TestPayloadSpans, TestTransactionRollback, TestUTF32ToUTF8, TestMultiPhraseQuery, TestLazyProxSkipping, TestMergeSchedulerExternal, TestFieldCacheRangeFilter, TestIndexInput, TestForceMergeForever, TestNearSpansOrdered, TestSameScoresWithThreads, TestQueryWrapperFilter, TestMultiFields, TestMultiTermConstantScore, TestLiveFieldValues, Nested, Nested, Nested, Nested, Nested, Nested, Nested, Nested, Nested, Nested, Nested, Nested, Nested, Nested, Nested, Nested, Nested, Nested, Nested, Nested, Nested, TestSpanSearchEquivalence, TestDoc, TestTermRangeFilter, TestExternalCodecs, TestNoDeletionPolicy, TestSimpleExplanationsOfNonMatches, TestTermVectors, TestRegexpQuery, TestTermVectorsReader, TestPerSegmentDeletes, TestMultiValuedNumericRangeQuery, TestPrefixInBooleanQuery, TestSegmentTermEnum, TestBooleanQuery, TestComplexExplanationsOfNonMatches, TestPrefixCodedTerms, TestAutomatonQuery, TestForUtil, TestTermScorer, TestSumDocFreq, TestIndexableField, TestDocValuesScoring, TestSentinelIntSet, TestWindowsMMap, TestMultiLevelSkipList, TestCheckIndex, Nested2, Nested3, Nested1, TestSpanMultiTermQueryWrapper, InBeforeClass, InAfterClass, InTestMethod, NonStringProperties, TestConstantScoreQuery, TestMatchAllDocsQuery, TestDocIdSet, TestElevationComparator, TestFilteredSearch, TestBinaryTerms, TestField, TestSimilarity, TestSmallFloat, TestSimilarityProvider, TestNumericTokenStream, TestSearch, TestCachingTokenFilter, ThrowInUncaught, TestFilterIterator, TestDateFilter, TestPriorityQueue, TestSameTokenSamePosition, TestCachingCollector, TestBinaryDocument, NestedSetupChain, NestedTeardownChain, TestFieldCacheTermsFilter, TestAttributeSource, Nested, TestIsCurrent, TestNoMergePolicy, TestNoMergeScheduler, TestIndexWriterLockRelease, TestPhrasePrefixQuery, TestTwoPhaseCommitTool, TestNot, TestCloseableThreadLocal, TestMockCharFilter, TestIndexWriterOnJRECrash]
>    [junit4]   2> NOTE: download the large Jenkins line-docs file by running 'ant get-jenkins-line-docs' in the lucene directory.
>    [junit4]   2> NOTE: reproduce with: ant test  -Dtestcase=TestIndexWriterOnJRECrash -Dtests.seed=5205AA7E864A31F -Dtests.multiplier=2 -Dtests.nightly=true -Dtests.slow=true -Dtests.linedocsfile=/home/jenkins/lucene-data/enwiki.random.lines.txt -Dtests.locale=sr_BA -Dtests.timezone=Pacific/Rarotonga -Dtests.file.encoding=ISO-8859-1
>    [junit4] ERROR   0.00s J3 | TestIndexWriterOnJRECrash (suite) <<<
>    [junit4]    > Throwable #1: com.carrotsearch.randomizedtesting.ResourceDisposalError: Resource in scope SUITE failed to close. Resource was registered from thread Thread[id=3203, name=TEST-TestIndexWriterOnJRECrash.testNRTThreads-seed#[5205AA7E864A31F], state=RUNNABLE, group=TGRP-TestIndexWriterOnJRECrash], registration stack trace below.
>    [junit4]    >        at java.lang.Thread.getStackTrace(Thread.java:1589)
>    [junit4]    >        at com.carrotsearch.randomizedtesting.RandomizedContext.closeAtEnd(RandomizedContext.java:166)
>    [junit4]    >        at org.apache.lucene.util.LuceneTestCase.closeAfterSuite(LuceneTestCase.java:731)
>    [junit4]    >        at org.apache.lucene.util.LuceneTestCase.wrapDirectory(LuceneTestCase.java:1274)
>    [junit4]    >        at org.apache.lucene.util.LuceneTestCase.newFSDirectory(LuceneTestCase.java:1216)
>    [junit4]    >        at org.apache.lucene.util.LuceneTestCase.newFSDirectory(LuceneTestCase.java:1196)
>    [junit4]    >        at org.apache.lucene.util.LuceneTestCase.newFSDirectory(LuceneTestCase.java:1191)
>    [junit4]    >        at org.apache.lucene.index.TestIndexWriterOnJRECrash$2.postVisitDirectory(TestIndexWriterOnJRECrash.java:162)
>    [junit4]    >        at org.apache.lucene.index.TestIndexWriterOnJRECrash$2.postVisitDirectory(TestIndexWriterOnJRECrash.java:156)
>    [junit4]    >        at java.nio.file.FileTreeWalker.walk(FileTreeWalker.java:224)
>    [junit4]    >        at java.nio.file.FileTreeWalker.walk(FileTreeWalker.java:199)
>    [junit4]    >        at java.nio.file.FileTreeWalker.walk(FileTreeWalker.java:199)
>    [junit4]    >        at java.nio.file.FileTreeWalker.walk(FileTreeWalker.java:69)
>    [junit4]    >        at java.nio.file.Files.walkFileTree(Files.java:2602)
>    [junit4]    >        at java.nio.file.Files.walkFileTree(Files.java:2635)
>    [junit4]    >        at org.apache.lucene.index.TestIndexWriterOnJRECrash.checkIndexes(TestIndexWriterOnJRECrash.java:156)
>    [junit4]    >        at org.apache.lucene.index.TestIndexWriterOnJRECrash.testNRTThreads(TestIndexWriterOnJRECrash.java:61)
>    [junit4]    >        at java.lang.Thread.run(Thread.java:745)
>    [junit4]    > Caused by: java.lang.AssertionError: Directory not closed: MockDirectoryWrapper(RateLimitedDirectoryWrapper(SimpleFSDirectory@/usr/home/jenkins/jenkins-slave/workspace/Lucene-Solr-NightlyTests-trunk/lucene/build/core/test/J3/temp/lucene.index.TestIndexWriterOnJRECrash-5205AA7E864A31F-001/jrecrash-001/lucene.index.TestIndexWriterOnJRECrash-10C9D1188CF0C871-001/jrecrash-001 lockFactory=NativeFSLockFactory@/usr/home/jenkins/jenkins-slave/workspace/Lucene-Solr-NightlyTests-trunk/lucene/build/core/test/J3/temp/lucene.index.TestIndexWriterOnJRECrash-5205AA7E864A31F-001/jrecrash-001/lucene.index.TestIndexWriterOnJRECrash-10C9D1188CF0C871-001/jrecrash-001))
>    [junit4]    >        at org.apache.lucene.util.CloseableDirectory.close(CloseableDirectory.java:47)
>    [junit4]    >        at com.carrotsearch.randomizedtesting.RandomizedContext.closeResources(RandomizedContext.java:183)
>    [junit4]    >        ... 2 moreThrowable #2: com.carrotsearch.randomizedtesting.ResourceDisposalError: Resource in scope SUITE failed to close. Resource was registered from thread Thread[id=3203, name=TEST-TestIndexWriterOnJRECrash.testNRTThreads-seed#[5205AA7E864A31F], state=RUNNABLE, group=TGRP-TestIndexWriterOnJRECrash], registration stack trace below.
>    [junit4]    >        at java.lang.Thread.getStackTrace(Thread.java:1589)
>    [junit4]    >        at com.carrotsearch.randomizedtesting.RandomizedContext.closeAtEnd(RandomizedContext.java:166)
>    [junit4]    >        at org.apache.lucene.util.LuceneTestCase.closeAfterSuite(LuceneTestCase.java:731)
>    [junit4]    >        at org.apache.lucene.util.LuceneTestCase.wrapDirectory(LuceneTestCase.java:1274)
>    [junit4]    >        at org.apache.lucene.util.LuceneTestCase.newFSDirectory(LuceneTestCase.java:1216)
>    [junit4]    >        at org.apache.lucene.util.LuceneTestCase.newFSDirectory(LuceneTestCase.java:1196)
>    [junit4]    >        at org.apache.lucene.util.LuceneTestCase.newFSDirectory(LuceneTestCase.java:1191)
>    [junit4]    >        at org.apache.lucene.index.TestIndexWriterOnJRECrash$2.postVisitDirectory(TestIndexWriterOnJRECrash.java:162)
>    [junit4]    >        at org.apache.lucene.index.TestIndexWriterOnJRECrash$2.postVisitDirectory(TestIndexWriterOnJRECrash.java:156)
>    [junit4]    >        at java.nio.file.FileTreeWalker.walk(FileTreeWalker.java:224)
>    [junit4]    >        at java.nio.file.FileTreeWalker.walk(FileTreeWalker.java:199)
>    [junit4]    >        at java.nio.file.FileTreeWalker.walk(FileTreeWalker.java:199)
>    [junit4]    >        at java.nio.file.FileTreeWalker.walk(FileTreeWalker.java:69)
>    [junit4]    >        at java.nio.file.Files.walkFileTree(Files.java:2602)
>    [junit4]    >        at java.nio.file.Files.walkFileTree(Files.java:2635)
>    [junit4]    >        at org.apache.lucene.index.TestIndexWriterOnJRECrash.checkIndexes(TestIndexWriterOnJRECrash.java:156)
>    [junit4]    >        at org.apache.lucene.index.TestIndexWriterOnJRECrash.testNRTThreads(TestIndexWriterOnJRECrash.java:61)
>    [junit4]    >        at java.lang.Thread.run(Thread.java:745)
>    [junit4]    > Caused by: java.lang.AssertionError: Directory not closed: MockDirectoryWrapper(RateLimitedDirectoryWrapper(SimpleFSDirectory@/usr/home/jenkins/jenkins-slave/workspace/Lucene-Solr-NightlyTests-trunk/lucene/build/core/test/J3/temp/lucene.index.TestIndexWriterOnJRECrash-5205AA7E864A31F-001/jrecrash-001/lucene.index.TestIndexWriterOnJRECrash-10C9D1188CF0C871-001/TestNRTThreads-001 lockFactory=NativeFSLockFactory@/usr/home/jenkins/jenkins-slave/workspace/Lucene-Solr-NightlyTests-trunk/lucene/build/core/test/J3/temp/lucene.index.TestIndexWriterOnJRECrash-5205AA7E864A31F-001/jrecrash-001/lucene.index.TestIndexWriterOnJRECrash-10C9D1188CF0C871-001/TestNRTThreads-001))
>    [junit4]    >        at org.apache.lucene.util.CloseableDirectory.close(CloseableDirectory.java:47)
>    [junit4]    >        at com.carrotsearch.randomizedtesting.RandomizedContext.closeResources(RandomizedContext.java:183)
>    [junit4]    >        ... 2 moreThrowable #3: com.carrotsearch.randomizedtesting.ResourceDisposalError: Resource in scope SUITE failed to close. Resource was registered from thread Thread[id=3203, name=TEST-TestIndexWriterOnJRECrash.testNRTThreads-seed#[5205AA7E864A31F], state=RUNNABLE, group=TGRP-TestIndexWriterOnJRECrash], registration stack trace below.
>    [junit4]    >        at java.lang.Thread.getStackTrace(Thread.java:1589)
>    [junit4]    >        at com.carrotsearch.randomizedtesting.RandomizedContext.closeAtEnd(RandomizedContext.java:166)
>    [junit4]    >        at org.apache.lucene.util.LuceneTestCase.closeAfterSuite(LuceneTestCase.java:731)
>    [junit4]    >        at org.apache.lucene.util.LuceneTestCase.wrapDirectory(LuceneTestCase.java:1268)
>    [junit4]    >        at org.apache.lucene.util.LuceneTestCase.newFSDirectory(LuceneTestCase.java:1216)
>    [junit4]    >        at org.apache.lucene.util.LuceneTestCase.newFSDirectory(LuceneTestCase.java:1196)
>    [junit4]    >        at org.apache.lucene.util.LuceneTestCase.newFSDirectory(LuceneTestCase.java:1191)
>    [junit4]    >        at org.apache.lucene.index.TestIndexWriterOnJRECrash$2.postVisitDirectory(TestIndexWriterOnJRECrash.java:162)
>    [junit4]    >        at org.apache.lucene.index.TestIndexWriterOnJRECrash$2.postVisitDirectory(TestIndexWriterOnJRECrash.java:156)
>    [junit4]    >        at java.nio.file.FileTreeWalker.walk(FileTreeWalker.java:224)
>    [junit4]    >        at java.nio.file.FileTreeWalker.walk(FileTreeWalker.java:199)
>    [junit4]    >        at java.nio.file.FileTreeWalker.walk(FileTreeWalker.java:69)
>    [junit4]    >        at java.nio.file.Files.walkFileTree(Files.java:2602)
>    [junit4]    >        at java.nio.file.Files.walkFileTree(Files.java:2635)
>    [junit4]    >        at org.apache.lucene.index.TestIndexWriterOnJRECrash.checkIndexes(TestIndexWriterOnJRECrash.java:156)
>    [junit4]    >        at org.apache.lucene.index.TestIndexWriterOnJRECrash.testNRTThreads(TestIndexWriterOnJRECrash.java:61)
>    [junit4]    >        at java.lang.Thread.run(Thread.java:745)
>    [junit4]    > Caused by: java.lang.AssertionError: Directory not closed: BaseDirectoryWrapper(SimpleFSDirectory@/usr/home/jenkins/jenkins-slave/workspace/Lucene-Solr-NightlyTests-trunk/lucene/build/core/test/J3/temp/lucene.index.TestIndexWriterOnJRECrash-5205AA7E864A31F-001/jrecrash-001/lucene.index.TestIndexWriterOnJRECrash-10C9D1188CF0C871-001 lockFactory=NativeFSLockFactory@/usr/home/jenkins/jenkins-slave/workspace/Lucene-Solr-NightlyTests-trunk/lucene/build/core/test/J3/temp/lucene.index.TestIndexWriterOnJRECrash-5205AA7E864A31F-001/jrecrash-001/lucene.index.TestIndexWriterOnJRECrash-10C9D1188CF0C871-001)
>    [junit4]    >        at org.apache.lucene.util.CloseableDirectory.close(CloseableDirectory.java:47)
>    [junit4]    >        at com.carrotsearch.randomizedtesting.RandomizedContext.closeResources(RandomizedContext.java:183)
>    [junit4]    >        ... 2 moreThrowable #4: com.carrotsearch.randomizedtesting.ResourceDisposalError: Resource in scope SUITE failed to close. Resource was registered from thread Thread[id=3203, name=TEST-TestIndexWriterOnJRECrash.testNRTThreads-seed#[5205AA7E864A31F], state=RUNNABLE, group=TGRP-TestIndexWriterOnJRECrash], registration stack trace below.
>    [junit4]    >        at java.lang.Thread.getStackTrace(Thread.java:1589)
>    [junit4]    >        at com.carrotsearch.randomizedtesting.RandomizedContext.closeAtEnd(RandomizedContext.java:166)
>    [junit4]    >        at org.apache.lucene.util.LuceneTestCase.closeAfterSuite(LuceneTestCase.java:731)
>    [junit4]    >        at org.apache.lucene.util.LuceneTestCase.wrapDirectory(LuceneTestCase.java:1274)
>    [junit4]    >        at org.apache.lucene.util.LuceneTestCase.newFSDirectory(LuceneTestCase.java:1216)
>    [junit4]    >        at org.apache.lucene.util.LuceneTestCase.newFSDirectory(LuceneTestCase.java:1196)
>    [junit4]    >        at org.apache.lucene.util.LuceneTestCase.newFSDirectory(LuceneTestCase.java:1191)
>    [junit4]    >        at org.apache.lucene.index.TestIndexWriterOnJRECrash$2.postVisitDirectory(TestIndexWriterOnJRECrash.java:162)
>    [junit4]    >        at org.apache.lucene.index.TestIndexWriterOnJRECrash$2.postVisitDirectory(TestIndexWriterOnJRECrash.java:156)
>    [junit4]    >        at java.nio.file.FileTreeWalker.walk(FileTreeWalker.java:224)
>    [junit4]    >        at java.nio.file.FileTreeWalker.walk(FileTreeWalker.java:69)
>    [junit4]    >        at java.nio.file.Files.walkFileTree(Files.java:2602)
>    [junit4]    >        at java.nio.file.Files.walkFileTree(Files.java:2635)
>    [junit4]    >        at org.apache.lucene.index.TestIndexWriterOnJRECrash.checkIndexes(TestIndexWriterOnJRECrash.java:156)
>    [junit4]    >        at org.apache.lucene.index.TestIndexWriterOnJRECrash.testNRTThreads(TestIndexWriterOnJRECrash.java:61)
>    [junit4]    >        at java.lang.Thread.run(Thread.java:745)
>    [junit4]    > Caused by: java.lang.AssertionError: Directory not closed: MockDirectoryWrapper(SimpleFSDirectory@/usr/home/jenkins/jenkins-slave/workspace/Lucene-Solr-NightlyTests-trunk/lucene/build/core/test/J3/temp/lucene.index.TestIndexWriterOnJRECrash-5205AA7E864A31F-001/jrecrash-001 lockFactory=NativeFSLockFactory@/usr/home/jenkins/jenkins-slave/workspace/Lucene-Solr-NightlyTests-trunk/lucene/build/core/test/J3/temp/lucene.index.TestIndexWriterOnJRECrash-5205AA7E864A31F-001/jrecrash-001)
>    [junit4]    >        at org.apache.lucene.util.CloseableDirectory.close(CloseableDirectory.java:47)
>    [junit4]    >        at com.carrotsearch.randomizedtesting.RandomizedContext.closeResources(RandomizedContext.java:183)
>    [junit4]    >        ... 2 moreThrowable #5: com.carrotsearch.randomizedtesting.ResourceDisposalError: Resource in scope SUITE failed to close. Resource was registered from thread Thread[id=3203, name=TEST-TestIndexWriterOnJRECrash.testNRTThreads-seed#[5205AA7E864A31F], state=RUNNABLE, group=TGRP-TestIndexWriterOnJRECrash], registration stack trace below.
>    [junit4]    >        at java.lang.Thread.getStackTrace(Thread.java:1589)
>    [junit4]    >        at com.carrotsearch.randomizedtesting.RandomizedContext.closeAtEnd(RandomizedContext.java:166)
>    [junit4]    >        at org.apache.lucene.util.LuceneTestCase.closeAfterSuite(LuceneTestCase.java:731)
>    [junit4]    >        at org.apache.lucene.util.LuceneTestCase.wrapDirectory(LuceneTestCase.java:1274)
>    [junit4]    >        at org.apache.lucene.util.LuceneTestCase.newFSDirectory(LuceneTestCase.java:1216)
>    [junit4]    >        at org.apache.lucene.util.LuceneTestCase.newFSDirectory(LuceneTestCase.java:1196)
>    [junit4]    >        at org.apache.lucene.util.LuceneTestCase.newFSDirectory(LuceneTestCase.java:1191)
>    [junit4]    >        at org.apache.lucene.index.TestIndexWriterOnJRECrash$2.postVisitDirectory(TestIndexWriterOnJRECrash.java:162)
>    [junit4]    >        at org.apache.lucene.index.TestIndexWriterOnJRECrash$2.postVisitDirectory(TestIndexWriterOnJRECrash.java:156)
>    [junit4]    >        at java.nio.file.FileTreeWalker.walk(FileTreeWalker.java:224)
>    [junit4]    >        at java.nio.file.FileTreeWalker.walk(FileTreeWalker.java:199)
>    [junit4]    >        at java.nio.file.FileTreeWalker.walk(FileTreeWalker.java:199)
>    [junit4]    >        at java.nio.file.FileTreeWalker.walk(FileTreeWalker.java:69)
>    [junit4]    >        at java.nio.file.Files.walkFileTree(Files.java:2602)
>    [junit4]    >        at java.nio.file.Files.walkFileTree(Files.java:2635)
>    [junit4]    >        at org.apache.lucene.index.TestIndexWriterOnJRECrash.checkIndexes(TestIndexWriterOnJRECrash.java:156)
>    [junit4]    >        at org.apache.lucene.index.TestIndexWriterOnJRECrash.testNRTThreads(TestIndexWriterOnJRECrash.java:61)
>    [junit4]    >        at java.lang.Thread.run(Thread.java:745)
>    [junit4]    > Caused by: java.lang.AssertionError: Directory not closed: MockDirectoryWrapper(SimpleFSDirectory@/usr/home/jenkins/jenkins-slave/workspace/Lucene-Solr-NightlyTests-trunk/lucene/build/core/test/J3/temp/lucene.index.TestIndexWriterOnJRECrash-5205AA7E864A31F-001/jrecrash-001/lucene.index.TestIndexWriterOnJRECrash-10C9D1188CF0C871-001/jrecrash-001 lockFactory=NativeFSLockFactory@/usr/home/jenkins/jenkins-slave/workspace/Lucene-Solr-NightlyTests-trunk/lucene/build/core/test/J3/temp/lucene.index.TestIndexWriterOnJRECrash-5205AA7E864A31F-001/jrecrash-001/lucene.index.TestIndexWriterOnJRECrash-10C9D1188CF0C871-001/jrecrash-001)
>    [junit4]    >        at org.apache.lucene.util.CloseableDirectory.close(CloseableDirectory.java:47)
>    [junit4]    >        at com.carrotsearch.randomizedtesting.RandomizedContext.closeResources(RandomizedContext.java:183)
>    [junit4]    >        ... 2 moreThrowable #6: com.carrotsearch.randomizedtesting.ResourceDisposalError: Resource in scope SUITE failed to close. Resource was registered from thread Thread[id=3203, name=TEST-TestIndexWriterOnJRECrash.testNRTThreads-seed#[5205AA7E864A31F], state=RUNNABLE, group=TGRP-TestIndexWriterOnJRECrash], registration stack trace below.
>    [junit4]    >        at java.lang.Thread.getStackTrace(Thread.java:1589)
>    [junit4]    >        at com.carrotsearch.randomizedtesting.RandomizedContext.closeAtEnd(RandomizedContext.java:166)
>    [junit4]    >        at org.apache.lucene.util.LuceneTestCase.closeAfterSuite(LuceneTestCase.java:731)
>    [junit4]    >        at org.apache.lucene.util.LuceneTestCase.wrapDirectory(LuceneTestCase.java:1268)
>    [junit4]    >        at org.apache.lucene.util.LuceneTestCase.newFSDirectory(LuceneTestCase.java:1216)
>    [junit4]    >        at org.apache.lucene.util.LuceneTestCase.newFSDirectory(LuceneTestCase.java:1196)
>    [junit4]    >        at org.apache.lucene.util.LuceneTestCase.newFSDirectory(LuceneTestCase.java:1191)
>    [junit4]    >        at org.apache.lucene.index.TestIndexWriterOnJRECrash$2.postVisitDirectory(TestIndexWriterOnJRECrash.java:162)
>    [junit4]    >        at org.apache.lucene.index.TestIndexWriterOnJRECrash$2.postVisitDirectory(TestIndexWriterOnJRECrash.java:156)
>    [junit4]    >        at java.nio.file.FileTreeWalker.walk(FileTreeWalker.java:224)
>    [junit4]    >        at java.nio.file.FileTreeWalker.walk(FileTreeWalker.java:199)
>    [junit4]    >        at java.nio.file.FileTreeWalker.walk(FileTreeWalker.java:199)
>    [junit4]    >        at java.nio.file.FileTreeWalker.walk(FileTreeWalker.java:69)
>    [junit4]    >        at java.nio.file.Files.walkFileTree(Files.java:2602)
>    [junit4]    >        at java.nio.file.Files.walkFileTree(Files.java:2635)
>    [junit4]    >        at org.apache.lucene.index.TestIndexWriterOnJRECrash.checkIndexes(TestIndexWriterOnJRECrash.java:156)
>    [junit4]    >        at org.apache.lucene.index.TestIndexWriterOnJRECrash.testNRTThreads(TestIndexWriterOnJRECrash.java:61)
>    [junit4]    >        at java.lang.Thread.run(Thread.java:745)
>    [junit4]    > Caused by: java.lang.AssertionError: Directory not closed: BaseDirectoryWrapper(NIOFSDirectory@/usr/home/jenkins/jenkins-slave/workspace/Lucene-Solr-NightlyTests-trunk/lucene/build/core/test/J3/temp/lucene.index.TestIndexWriterOnJRECrash-5205AA7E864A31F-001/jrecrash-001/lucene.index.TestIndexWriterOnJRECrash-10C9D1188CF0C871-001/TestNRTThreads-001 lockFactory=NativeFSLockFactory@/usr/home/jenkins/jenkins-slave/workspace/Lucene-Solr-NightlyTests-trunk/lucene/build/core/test/J3/temp/lucene.index.TestIndexWriterOnJRECrash-5205AA7E864A31F-001/jrecrash-001/lucene.index.TestIndexWriterOnJRECrash-10C9D1188CF0C871-001/TestNRTThreads-001)
>    [junit4]    >        at org.apache.lucene.util.CloseableDirectory.close(CloseableDirectory.java:47)
>    [junit4]    >        at com.carrotsearch.randomizedtesting.RandomizedContext.closeResources(RandomizedContext.java:183)
>    [junit4]    >        ... 2 moreThrowable #7: com.carrotsearch.randomizedtesting.ResourceDisposalError: Resource in scope SUITE failed to close. Resource was registered from thread Thread[id=3203, name=TEST-TestIndexWriterOnJRECrash.testNRTThreads-seed#[5205AA7E864A31F], state=RUNNABLE, group=TGRP-TestIndexWriterOnJRECrash], registration stack trace below.
>    [junit4]    >        at java.lang.Thread.getStackTrace(Thread.java:1589)
>    [junit4]    >        at com.carrotsearch.randomizedtesting.RandomizedContext.closeAtEnd(RandomizedContext.java:166)
>    [junit4]    >        at org.apache.lucene.util.LuceneTestCase.closeAfterSuite(LuceneTestCase.java:731)
>    [junit4]    >        at org.apache.lucene.util.LuceneTestCase.wrapDirectory(LuceneTestCase.java:1274)
>
>
> [...truncated too long message...]
>
> ndomizedContext.closeResources(RandomizedContext.java:183)
>    [junit4]    >        ... 2 moreThrowable #8: com.carrotsearch.randomizedtesting.ResourceDisposalError: Resource in scope SUITE failed to close. Resource was registered from thread Thread[id=3203, name=TEST-TestIndexWriterOnJRECrash.testNRTThreads-seed#[5205AA7E864A31F], state=RUNNABLE, group=TGRP-TestIndexWriterOnJRECrash], registration stack trace below.
>    [junit4]    >        at java.lang.Thread.getStackTrace(Thread.java:1589)
>    [junit4]    >        at com.carrotsearch.randomizedtesting.RandomizedContext.closeAtEnd(RandomizedContext.java:166)
>    [junit4]    >        at org.apache.lucene.util.LuceneTestCase.closeAfterSuite(LuceneTestCase.java:731)
>    [junit4]    >        at org.apache.lucene.util.LuceneTestCase.wrapDirectory(LuceneTestCase.java:1274)
>    [junit4]    >        at org.apache.lucene.util.LuceneTestCase.newFSDirectory(LuceneTestCase.java:1216)
>    [junit4]    >        at org.apache.lucene.util.LuceneTestCase.newFSDirectory(LuceneTestCase.java:1196)
>    [junit4]    >        at org.apache.lucene.util.LuceneTestCase.newFSDirectory(LuceneTestCase.java:1191)
>    [junit4]    >        at org.apache.lucene.index.TestIndexWriterOnJRECrash$2.postVisitDirectory(TestIndexWriterOnJRECrash.java:162)
>    [junit4]    >        at org.apache.lucene.index.TestIndexWriterOnJRECrash$2.postVisitDirectory(TestIndexWriterOnJRECrash.java:156)
>    [junit4]    >        at java.nio.file.FileTreeWalker.walk(FileTreeWalker.java:224)
>    [junit4]    >        at java.nio.file.FileTreeWalker.walk(FileTreeWalker.java:199)
>    [junit4]    >        at java.nio.file.FileTreeWalker.walk(FileTreeWalker.java:199)
>    [junit4]    >        at java.nio.file.FileTreeWalker.walk(FileTreeWalker.java:69)
>    [junit4]    >        at java.nio.file.Files.walkFileTree(Files.java:2602)
>    [junit4]    >        at java.nio.file.Files.walkFileTree(Files.java:2635)
>    [junit4]    >        at org.apache.lucene.index.TestIndexWriterOnJRECrash.checkIndexes(TestIndexWriterOnJRECrash.java:156)
>    [junit4]    >        at org.apache.lucene.index.TestIndexWriterOnJRECrash.testNRTThreads(TestIndexWriterOnJRECrash.java:61)
>    [junit4]    >        at java.lang.Thread.run(Thread.java:745)
>    [junit4]    > Caused by: java.lang.AssertionError: Directory not closed: MockDirectoryWrapper(NIOFSDirectory@/usr/home/jenkins/jenkins-slave/workspace/Lucene-Solr-NightlyTests-trunk/lucene/build/core/test/J3/temp/lucene.index.TestIndexWriterOnJRECrash-5205AA7E864A31F-001/jrecrash-001/lucene.index.TestIndexWriterOnJRECrash-A641CAE0E9D5A76B-001/jrecrash-001 lockFactory=NativeFSLockFactory@/usr/home/jenkins/jenkins-slave/workspace/Lucene-Solr-NightlyTests-trunk/lucene/build/core/test/J3/temp/lucene.index.TestIndexWriterOnJRECrash-5205AA7E864A31F-001/jrecrash-001/lucene.index.TestIndexWriterOnJRECrash-A641CAE0E9D5A76B-001/jrecrash-001)
>    [junit4]    >        at org.apache.lucene.util.CloseableDirectory.close(CloseableDirectory.java:47)
>    [junit4]    >        at com.carrotsearch.randomizedtesting.RandomizedContext.closeResources(RandomizedContext.java:183)
>    [junit4]    >        ... 2 moreThrowable #9: com.carrotsearch.randomizedtesting.ResourceDisposalError: Resource in scope SUITE failed to close. Resource was registered from thread Thread[id=3203, name=TEST-TestIndexWriterOnJRECrash.testNRTThreads-seed#[5205AA7E864A31F], state=RUNNABLE, group=TGRP-TestIndexWriterOnJRECrash], registration stack trace below.
>    [junit4]    >        at java.lang.Thread.getStackTrace(Thread.java:1589)
>    [junit4]    >        at com.carrotsearch.randomizedtesting.RandomizedContext.closeAtEnd(RandomizedContext.java:166)
>    [junit4]    >        at org.apache.lucene.util.LuceneTestCase.closeAfterSuite(LuceneTestCase.java:731)
>    [junit4]    >        at org.apache.lucene.util.LuceneTestCase.wrapDirectory(LuceneTestCase.java:1274)
>    [junit4]    >        at org.apache.lucene.util.LuceneTestCase.newFSDirectory(LuceneTestCase.java:1216)
>    [junit4]    >        at org.apache.lucene.util.LuceneTestCase.newFSDirectory(LuceneTestCase.java:1196)
>    [junit4]    >        at org.apache.lucene.util.LuceneTestCase.newFSDirectory(LuceneTestCase.java:1191)
>    [junit4]    >        at org.apache.lucene.index.TestIndexWriterOnJRECrash$2.postVisitDirectory(TestIndexWriterOnJRECrash.java:162)
>    [junit4]    >        at org.apache.lucene.index.TestIndexWriterOnJRECrash$2.postVisitDirectory(TestIndexWriterOnJRECrash.java:156)
>    [junit4]    >        at java.nio.file.FileTreeWalker.walk(FileTreeWalker.java:224)
>    [junit4]    >        at java.nio.file.FileTreeWalker.walk(FileTreeWalker.java:199)
>    [junit4]    >        at java.nio.file.FileTreeWalker.walk(FileTreeWalker.java:69)
>    [junit4]    >        at java.nio.file.Files.walkFileTree(Files.java:2602)
>    [junit4]    >        at java.nio.file.Files.walkFileTree(Files.java:2635)
>    [junit4]    >        at org.apache.lucene.index.TestIndexWriterOnJRECrash.checkIndexes(TestIndexWriterOnJRECrash.java:156)
>    [junit4]    >        at org.apache.lucene.index.TestIndexWriterOnJRECrash.testNRTThreads(TestIndexWriterOnJRECrash.java:61)
>    [junit4]    >        at java.lang.Thread.run(Thread.java:745)
>    [junit4]    > Caused by: java.lang.AssertionError: Directory not closed: MockDirectoryWrapper(SimpleFSDirectory@/usr/home/jenkins/jenkins-slave/workspace/Lucene-Solr-NightlyTests-trunk/lucene/build/core/test/J3/temp/lucene.index.TestIndexWriterOnJRECrash-5205AA7E864A31F-001/jrecrash-001/lucene.index.TestIndexWriterOnJRECrash-A641CAE0E9D5A76B-001 lockFactory=NativeFSLockFactory@/usr/home/jenkins/jenkins-slave/workspace/Lucene-Solr-NightlyTests-trunk/lucene/build/core/test/J3/temp/lucene.index.TestIndexWriterOnJRECrash-5205AA7E864A31F-001/jrecrash-001/lucene.index.TestIndexWriterOnJRECrash-A641CAE0E9D5A76B-001)
>    [junit4]    >        at org.apache.lucene.util.CloseableDirectory.close(CloseableDirectory.java:47)
>    [junit4]    >        at com.carrotsearch.randomizedtesting.RandomizedContext.closeResources(RandomizedContext.java:183)
>    [junit4]    >        ... 2 moreThrowable #10: com.carrotsearch.randomizedtesting.ResourceDisposalError: Resource in scope SUITE failed to close. Resource was registered from thread Thread[id=3203, name=TEST-TestIndexWriterOnJRECrash.testNRTThreads-seed#[5205AA7E864A31F], state=RUNNABLE, group=TGRP-TestIndexWriterOnJRECrash], registration stack trace below.
>    [junit4]    >        at java.lang.Thread.getStackTrace(Thread.java:1589)
>    [junit4]    >        at com.carrotsearch.randomizedtesting.RandomizedContext.closeAtEnd(RandomizedContext.java:166)
>    [junit4]    >        at org.apache.lucene.util.LuceneTestCase.closeAfterSuite(LuceneTestCase.java:731)
>    [junit4]    >        at org.apache.lucene.util.LuceneTestCase.wrapDirectory(LuceneTestCase.java:1274)
>    [junit4]    >        at org.apache.lucene.util.LuceneTestCase.newFSDirectory(LuceneTestCase.java:1216)
>    [junit4]    >        at org.apache.lucene.util.LuceneTestCase.newFSDirectory(LuceneTestCase.java:1196)
>    [junit4]    >        at org.apache.lucene.util.LuceneTestCase.newFSDirectory(LuceneTestCase.java:1191)
>    [junit4]    >        at org.apache.lucene.index.TestIndexWriterOnJRECrash$2.postVisitDirectory(TestIndexWriterOnJRECrash.java:162)
>    [junit4]    >        at org.apache.lucene.index.TestIndexWriterOnJRECrash$2.postVisitDirectory(TestIndexWriterOnJRECrash.java:156)
>    [junit4]    >        at java.nio.file.FileTreeWalker.walk(FileTreeWalker.java:224)
>    [junit4]    >        at java.nio.file.FileTreeWalker.walk(FileTreeWalker.java:69)
>    [junit4]    >        at java.nio.file.Files.walkFileTree(Files.java:2602)
>    [junit4]    >        at java.nio.file.Files.walkFileTree(Files.java:2635)
>    [junit4]    >        at org.apache.lucene.index.TestIndexWriterOnJRECrash.checkIndexes(TestIndexWriterOnJRECrash.java:156)
>    [junit4]    >        at org.apache.lucene.index.TestIndexWriterOnJRECrash.testNRTThreads(TestIndexWriterOnJRECrash.java:61)
>    [junit4]    >        at java.lang.Thread.run(Thread.java:745)
>    [junit4]    > Caused by: java.lang.AssertionError: Directory not closed: MockDirectoryWrapper(MMapDirectory@/usr/home/jenkins/jenkins-slave/workspace/Lucene-Solr-NightlyTests-trunk/lucene/build/core/test/J3/temp/lucene.index.TestIndexWriterOnJRECrash-5205AA7E864A31F-001/jrecrash-001 lockFactory=NativeFSLockFactory@/usr/home/jenkins/jenkins-slave/workspace/Lucene-Solr-NightlyTests-trunk/lucene/build/core/test/J3/temp/lucene.index.TestIndexWriterOnJRECrash-5205AA7E864A31F-001/jrecrash-001)
>    [junit4]    >        at org.apache.lucene.util.CloseableDirectory.close(CloseableDirectory.java:47)
>    [junit4]    >        at com.carrotsearch.randomizedtesting.RandomizedContext.closeResources(RandomizedContext.java:183)
>    [junit4]    >        ... 2 more
>    [junit4] Completed on J3 in 18.30s, 1 test, 10 errors <<< FAILURES!
>
> [...truncated 237 lines...]
> BUILD FAILED
> /usr/home/jenkins/jenkins-slave/workspace/Lucene-Solr-NightlyTests-trunk/build.xml:498: The following error occurred while executing this line:
> /usr/home/jenkins/jenkins-slave/workspace/Lucene-Solr-NightlyTests-trunk/build.xml:471: The following error occurred while executing this line:
> /usr/home/jenkins/jenkins-slave/workspace/Lucene-Solr-NightlyTests-trunk/build.xml:60: The following error occurred while executing this line:
> /usr/home/jenkins/jenkins-slave/workspace/Lucene-Solr-NightlyTests-trunk/extra-targets.xml:39: The following error occurred while executing this line:
> /usr/home/jenkins/jenkins-slave/workspace/Lucene-Solr-NightlyTests-trunk/lucene/build.xml:49: The following error occurred while executing this line:
> /usr/home/jenkins/jenkins-slave/workspace/Lucene-Solr-NightlyTests-trunk/lucene/common-build.xml:1358: The following error occurred while executing this line:
> /usr/home/jenkins/jenkins-slave/workspace/Lucene-Solr-NightlyTests-trunk/lucene/common-build.xml:961: There were test failures: 395 suites, 3127 tests, 10 suite-level errors, 40 ignored (29 assumptions)
>
> Total time: 47 minutes 8 seconds
> Build step 'Invoke Ant' marked build as failure
> Archiving artifacts
> Sending artifact delta relative to Lucene-Solr-NightlyTests-trunk #624
> Archived 5 artifacts
> Archive block size is 32768
> Received 0 blocks and 3639755 bytes
> Compression is 0.0%
> Took 1 sec
> Recording test results
> Email was triggered for: Failure
> Sending email for trigger: Failure
>
>
>
>
> ---------------------------------------------------------------------
> To unsubscribe, e-mail: dev-unsubscribe@lucene.apache.org
> For additional commands, e-mail: dev-help@lucene.apache.org

---------------------------------------------------------------------
To unsubscribe, e-mail: dev-unsubscribe@lucene.apache.org
For additional commands, e-mail: dev-help@lucene.apache.org


Mime
View raw message