lucene-dev mailing list archives

Site index · List index
Message view « Date » · « Thread »
Top « Date » · « Thread »
From Policeman Jenkins Server <jenk...@thetaphi.de>
Subject [JENKINS] Lucene-Solr-trunk-MacOSX (64bit/jdk1.8.0) - Build # 1965 - Still Failing!
Date Sun, 30 Nov 2014 02:22:00 GMT
Build: http://jenkins.thetaphi.de/job/Lucene-Solr-trunk-MacOSX/1965/
Java: 64bit/jdk1.8.0 -XX:-UseCompressedOops -XX:+UseG1GC (asserts: true)

9 tests failed.
FAILED:  org.apache.solr.highlight.HighlighterTest.testVariableFragsize

Error Message:
Exception during query

Stack Trace:
java.lang.RuntimeException: Exception during query
	at __randomizedtesting.SeedInfo.seed([5BFA450E44681472:5CB6457FA6D6B8E0]:0)
	at org.apache.solr.SolrTestCaseJ4.assertQ(SolrTestCaseJ4.java:729)
	at org.apache.solr.highlight.HighlighterTest.testVariableFragsize(HighlighterTest.java:592)
	at sun.reflect.NativeMethodAccessorImpl.invoke0(Native Method)
	at sun.reflect.NativeMethodAccessorImpl.invoke(NativeMethodAccessorImpl.java:62)
	at sun.reflect.DelegatingMethodAccessorImpl.invoke(DelegatingMethodAccessorImpl.java:43)
	at java.lang.reflect.Method.invoke(Method.java:483)
	at com.carrotsearch.randomizedtesting.RandomizedRunner.invoke(RandomizedRunner.java:1618)
	at com.carrotsearch.randomizedtesting.RandomizedRunner$6.evaluate(RandomizedRunner.java:827)
	at com.carrotsearch.randomizedtesting.RandomizedRunner$7.evaluate(RandomizedRunner.java:863)
	at com.carrotsearch.randomizedtesting.RandomizedRunner$8.evaluate(RandomizedRunner.java:877)
	at com.carrotsearch.randomizedtesting.rules.SystemPropertiesRestoreRule$1.evaluate(SystemPropertiesRestoreRule.java:53)
	at org.apache.lucene.util.TestRuleSetupTeardownChained$1.evaluate(TestRuleSetupTeardownChained.java:50)
	at org.apache.lucene.util.AbstractBeforeAfterRule$1.evaluate(AbstractBeforeAfterRule.java:46)
	at com.carrotsearch.randomizedtesting.rules.SystemPropertiesInvariantRule$1.evaluate(SystemPropertiesInvariantRule.java:55)
	at org.apache.lucene.util.TestRuleThreadAndTestName$1.evaluate(TestRuleThreadAndTestName.java:49)
	at org.apache.lucene.util.TestRuleIgnoreAfterMaxFailures$1.evaluate(TestRuleIgnoreAfterMaxFailures.java:65)
	at org.apache.lucene.util.TestRuleMarkFailure$1.evaluate(TestRuleMarkFailure.java:48)
	at com.carrotsearch.randomizedtesting.rules.StatementAdapter.evaluate(StatementAdapter.java:36)
	at com.carrotsearch.randomizedtesting.ThreadLeakControl$StatementRunner.run(ThreadLeakControl.java:365)
	at com.carrotsearch.randomizedtesting.ThreadLeakControl.forkTimeoutingTask(ThreadLeakControl.java:798)
	at com.carrotsearch.randomizedtesting.ThreadLeakControl$3.evaluate(ThreadLeakControl.java:458)
	at com.carrotsearch.randomizedtesting.RandomizedRunner.runSingleTest(RandomizedRunner.java:836)
	at com.carrotsearch.randomizedtesting.RandomizedRunner$3.evaluate(RandomizedRunner.java:738)
	at com.carrotsearch.randomizedtesting.RandomizedRunner$4.evaluate(RandomizedRunner.java:772)
	at com.carrotsearch.randomizedtesting.RandomizedRunner$5.evaluate(RandomizedRunner.java:783)
	at com.carrotsearch.randomizedtesting.rules.StatementAdapter.evaluate(StatementAdapter.java:36)
	at com.carrotsearch.randomizedtesting.rules.SystemPropertiesRestoreRule$1.evaluate(SystemPropertiesRestoreRule.java:53)
	at org.apache.lucene.util.AbstractBeforeAfterRule$1.evaluate(AbstractBeforeAfterRule.java:46)
	at org.apache.lucene.util.TestRuleStoreClassName$1.evaluate(TestRuleStoreClassName.java:42)
	at com.carrotsearch.randomizedtesting.rules.SystemPropertiesInvariantRule$1.evaluate(SystemPropertiesInvariantRule.java:55)
	at com.carrotsearch.randomizedtesting.rules.NoShadowingOrOverridesOnMethodsRule$1.evaluate(NoShadowingOrOverridesOnMethodsRule.java:39)
	at com.carrotsearch.randomizedtesting.rules.NoShadowingOrOverridesOnMethodsRule$1.evaluate(NoShadowingOrOverridesOnMethodsRule.java:39)
	at com.carrotsearch.randomizedtesting.rules.StatementAdapter.evaluate(StatementAdapter.java:36)
	at com.carrotsearch.randomizedtesting.rules.StatementAdapter.evaluate(StatementAdapter.java:36)
	at com.carrotsearch.randomizedtesting.rules.StatementAdapter.evaluate(StatementAdapter.java:36)
	at org.apache.lucene.util.TestRuleAssertionsRequired$1.evaluate(TestRuleAssertionsRequired.java:54)
	at org.apache.lucene.util.TestRuleMarkFailure$1.evaluate(TestRuleMarkFailure.java:48)
	at org.apache.lucene.util.TestRuleIgnoreAfterMaxFailures$1.evaluate(TestRuleIgnoreAfterMaxFailures.java:65)
	at org.apache.lucene.util.TestRuleIgnoreTestSuites$1.evaluate(TestRuleIgnoreTestSuites.java:55)
	at com.carrotsearch.randomizedtesting.rules.StatementAdapter.evaluate(StatementAdapter.java:36)
	at com.carrotsearch.randomizedtesting.ThreadLeakControl$StatementRunner.run(ThreadLeakControl.java:365)
	at java.lang.Thread.run(Thread.java:745)
Caused by: java.lang.RuntimeException: REQUEST FAILED: xpath=//lst[@name='1']/arr[@name='tv_text']/str[.='a <em>long</em> days night this should be a piece of text which']
	xml response was: <?xml version="1.0" encoding="UTF-8"?>
<response>
<lst name="responseHeader"><int name="status">0</int><int name="QTime">16</int></lst><result name="response" numFound="1" start="0"><doc><arr name="tv_text"><str>a long days night this should be a piece of text which is is is is is is is is is is is is is is is is is is is is is is is is isis is is is is is is is is is is is is is is is is is is is is is is is is is is is is is is is is is is is is is is is is is is is is is is is is is is is is is is is is is is is is is is is is is is is is is is is is is is sufficiently lengthly to produce multiple fragments which are not concatenated at all</str></arr><int name="id">1</int><arr name="range_facet_l"><long>1</long></arr><long name="_version_">1486155379580600320</long><arr name="multiDefault"><str>muLti-Default</str></arr><int name="intDefault">42</int><date name="timestamp">2014-11-30T00:43:35.695Z</date></doc></result><lst name="highlighting"><lst name="1"/></lst>
</response>

	request was:q=tv_text:long&qt=standard&hl=true&start=0&hl.fl=tv_text&rows=200
	at org.apache.solr.SolrTestCaseJ4.assertQ(SolrTestCaseJ4.java:722)
	... 41 more


FAILED:  org.apache.solr.highlight.HighlighterTest.testSubwordWildcardHighlightWithTermOffsets

Error Message:
Exception during query

Stack Trace:
java.lang.RuntimeException: Exception during query
	at __randomizedtesting.SeedInfo.seed([5BFA450E44681472:645CA1CDB1CD760F]:0)
	at org.apache.solr.SolrTestCaseJ4.assertQ(SolrTestCaseJ4.java:729)
	at org.apache.solr.highlight.HighlighterTest.testSubwordWildcardHighlightWithTermOffsets(HighlighterTest.java:834)
	at sun.reflect.NativeMethodAccessorImpl.invoke0(Native Method)
	at sun.reflect.NativeMethodAccessorImpl.invoke(NativeMethodAccessorImpl.java:62)
	at sun.reflect.DelegatingMethodAccessorImpl.invoke(DelegatingMethodAccessorImpl.java:43)
	at java.lang.reflect.Method.invoke(Method.java:483)
	at com.carrotsearch.randomizedtesting.RandomizedRunner.invoke(RandomizedRunner.java:1618)
	at com.carrotsearch.randomizedtesting.RandomizedRunner$6.evaluate(RandomizedRunner.java:827)
	at com.carrotsearch.randomizedtesting.RandomizedRunner$7.evaluate(RandomizedRunner.java:863)
	at com.carrotsearch.randomizedtesting.RandomizedRunner$8.evaluate(RandomizedRunner.java:877)
	at com.carrotsearch.randomizedtesting.rules.SystemPropertiesRestoreRule$1.evaluate(SystemPropertiesRestoreRule.java:53)
	at org.apache.lucene.util.TestRuleSetupTeardownChained$1.evaluate(TestRuleSetupTeardownChained.java:50)
	at org.apache.lucene.util.AbstractBeforeAfterRule$1.evaluate(AbstractBeforeAfterRule.java:46)
	at com.carrotsearch.randomizedtesting.rules.SystemPropertiesInvariantRule$1.evaluate(SystemPropertiesInvariantRule.java:55)
	at org.apache.lucene.util.TestRuleThreadAndTestName$1.evaluate(TestRuleThreadAndTestName.java:49)
	at org.apache.lucene.util.TestRuleIgnoreAfterMaxFailures$1.evaluate(TestRuleIgnoreAfterMaxFailures.java:65)
	at org.apache.lucene.util.TestRuleMarkFailure$1.evaluate(TestRuleMarkFailure.java:48)
	at com.carrotsearch.randomizedtesting.rules.StatementAdapter.evaluate(StatementAdapter.java:36)
	at com.carrotsearch.randomizedtesting.ThreadLeakControl$StatementRunner.run(ThreadLeakControl.java:365)
	at com.carrotsearch.randomizedtesting.ThreadLeakControl.forkTimeoutingTask(ThreadLeakControl.java:798)
	at com.carrotsearch.randomizedtesting.ThreadLeakControl$3.evaluate(ThreadLeakControl.java:458)
	at com.carrotsearch.randomizedtesting.RandomizedRunner.runSingleTest(RandomizedRunner.java:836)
	at com.carrotsearch.randomizedtesting.RandomizedRunner$3.evaluate(RandomizedRunner.java:738)
	at com.carrotsearch.randomizedtesting.RandomizedRunner$4.evaluate(RandomizedRunner.java:772)
	at com.carrotsearch.randomizedtesting.RandomizedRunner$5.evaluate(RandomizedRunner.java:783)
	at com.carrotsearch.randomizedtesting.rules.StatementAdapter.evaluate(StatementAdapter.java:36)
	at com.carrotsearch.randomizedtesting.rules.SystemPropertiesRestoreRule$1.evaluate(SystemPropertiesRestoreRule.java:53)
	at org.apache.lucene.util.AbstractBeforeAfterRule$1.evaluate(AbstractBeforeAfterRule.java:46)
	at org.apache.lucene.util.TestRuleStoreClassName$1.evaluate(TestRuleStoreClassName.java:42)
	at com.carrotsearch.randomizedtesting.rules.SystemPropertiesInvariantRule$1.evaluate(SystemPropertiesInvariantRule.java:55)
	at com.carrotsearch.randomizedtesting.rules.NoShadowingOrOverridesOnMethodsRule$1.evaluate(NoShadowingOrOverridesOnMethodsRule.java:39)
	at com.carrotsearch.randomizedtesting.rules.NoShadowingOrOverridesOnMethodsRule$1.evaluate(NoShadowingOrOverridesOnMethodsRule.java:39)
	at com.carrotsearch.randomizedtesting.rules.StatementAdapter.evaluate(StatementAdapter.java:36)
	at com.carrotsearch.randomizedtesting.rules.StatementAdapter.evaluate(StatementAdapter.java:36)
	at com.carrotsearch.randomizedtesting.rules.StatementAdapter.evaluate(StatementAdapter.java:36)
	at org.apache.lucene.util.TestRuleAssertionsRequired$1.evaluate(TestRuleAssertionsRequired.java:54)
	at org.apache.lucene.util.TestRuleMarkFailure$1.evaluate(TestRuleMarkFailure.java:48)
	at org.apache.lucene.util.TestRuleIgnoreAfterMaxFailures$1.evaluate(TestRuleIgnoreAfterMaxFailures.java:65)
	at org.apache.lucene.util.TestRuleIgnoreTestSuites$1.evaluate(TestRuleIgnoreTestSuites.java:55)
	at com.carrotsearch.randomizedtesting.rules.StatementAdapter.evaluate(StatementAdapter.java:36)
	at com.carrotsearch.randomizedtesting.ThreadLeakControl$StatementRunner.run(ThreadLeakControl.java:365)
	at java.lang.Thread.run(Thread.java:745)
Caused by: java.lang.RuntimeException: REQUEST FAILED: xpath=//lst[@name='highlighting']/lst[@name='1']/arr[@name='subword_offsets']/str='lorem <em>PowerShot.com</em> ipsum'
	xml response was: <?xml version="1.0" encoding="UTF-8"?>
<response>
<lst name="responseHeader"><int name="status">0</int><int name="QTime">1</int></lst><result name="response" numFound="1" start="0"><doc><arr name="subword_offsets"><str>lorem PowerShot.com ipsum</str></arr><int name="id">1</int><arr name="range_facet_l"><long>1</long></arr><long name="_version_">1486155380006322176</long><arr name="multiDefault"><str>muLti-Default</str></arr><int name="intDefault">42</int><date name="timestamp">2014-11-30T00:43:36.101Z</date></doc></result><lst name="highlighting"><lst name="1"/></lst>
</response>

	request was:q=subword_offsets:pow*&hl=true&hl.fl=subword_offsets&wt=xml
	at org.apache.solr.SolrTestCaseJ4.assertQ(SolrTestCaseJ4.java:722)
	... 41 more


FAILED:  org.apache.solr.highlight.HighlighterTest.testTwoFieldHighlight

Error Message:
Exception during query

Stack Trace:
java.lang.RuntimeException: Exception during query
	at __randomizedtesting.SeedInfo.seed([5BFA450E44681472:2288800CA31E42C8]:0)
	at org.apache.solr.SolrTestCaseJ4.assertQ(SolrTestCaseJ4.java:729)
	at org.apache.solr.highlight.HighlighterTest.testTwoFieldHighlight(HighlighterTest.java:391)
	at sun.reflect.NativeMethodAccessorImpl.invoke0(Native Method)
	at sun.reflect.NativeMethodAccessorImpl.invoke(NativeMethodAccessorImpl.java:62)
	at sun.reflect.DelegatingMethodAccessorImpl.invoke(DelegatingMethodAccessorImpl.java:43)
	at java.lang.reflect.Method.invoke(Method.java:483)
	at com.carrotsearch.randomizedtesting.RandomizedRunner.invoke(RandomizedRunner.java:1618)
	at com.carrotsearch.randomizedtesting.RandomizedRunner$6.evaluate(RandomizedRunner.java:827)
	at com.carrotsearch.randomizedtesting.RandomizedRunner$7.evaluate(RandomizedRunner.java:863)
	at com.carrotsearch.randomizedtesting.RandomizedRunner$8.evaluate(RandomizedRunner.java:877)
	at com.carrotsearch.randomizedtesting.rules.SystemPropertiesRestoreRule$1.evaluate(SystemPropertiesRestoreRule.java:53)
	at org.apache.lucene.util.TestRuleSetupTeardownChained$1.evaluate(TestRuleSetupTeardownChained.java:50)
	at org.apache.lucene.util.AbstractBeforeAfterRule$1.evaluate(AbstractBeforeAfterRule.java:46)
	at com.carrotsearch.randomizedtesting.rules.SystemPropertiesInvariantRule$1.evaluate(SystemPropertiesInvariantRule.java:55)
	at org.apache.lucene.util.TestRuleThreadAndTestName$1.evaluate(TestRuleThreadAndTestName.java:49)
	at org.apache.lucene.util.TestRuleIgnoreAfterMaxFailures$1.evaluate(TestRuleIgnoreAfterMaxFailures.java:65)
	at org.apache.lucene.util.TestRuleMarkFailure$1.evaluate(TestRuleMarkFailure.java:48)
	at com.carrotsearch.randomizedtesting.rules.StatementAdapter.evaluate(StatementAdapter.java:36)
	at com.carrotsearch.randomizedtesting.ThreadLeakControl$StatementRunner.run(ThreadLeakControl.java:365)
	at com.carrotsearch.randomizedtesting.ThreadLeakControl.forkTimeoutingTask(ThreadLeakControl.java:798)
	at com.carrotsearch.randomizedtesting.ThreadLeakControl$3.evaluate(ThreadLeakControl.java:458)
	at com.carrotsearch.randomizedtesting.RandomizedRunner.runSingleTest(RandomizedRunner.java:836)
	at com.carrotsearch.randomizedtesting.RandomizedRunner$3.evaluate(RandomizedRunner.java:738)
	at com.carrotsearch.randomizedtesting.RandomizedRunner$4.evaluate(RandomizedRunner.java:772)
	at com.carrotsearch.randomizedtesting.RandomizedRunner$5.evaluate(RandomizedRunner.java:783)
	at com.carrotsearch.randomizedtesting.rules.StatementAdapter.evaluate(StatementAdapter.java:36)
	at com.carrotsearch.randomizedtesting.rules.SystemPropertiesRestoreRule$1.evaluate(SystemPropertiesRestoreRule.java:53)
	at org.apache.lucene.util.AbstractBeforeAfterRule$1.evaluate(AbstractBeforeAfterRule.java:46)
	at org.apache.lucene.util.TestRuleStoreClassName$1.evaluate(TestRuleStoreClassName.java:42)
	at com.carrotsearch.randomizedtesting.rules.SystemPropertiesInvariantRule$1.evaluate(SystemPropertiesInvariantRule.java:55)
	at com.carrotsearch.randomizedtesting.rules.NoShadowingOrOverridesOnMethodsRule$1.evaluate(NoShadowingOrOverridesOnMethodsRule.java:39)
	at com.carrotsearch.randomizedtesting.rules.NoShadowingOrOverridesOnMethodsRule$1.evaluate(NoShadowingOrOverridesOnMethodsRule.java:39)
	at com.carrotsearch.randomizedtesting.rules.StatementAdapter.evaluate(StatementAdapter.java:36)
	at com.carrotsearch.randomizedtesting.rules.StatementAdapter.evaluate(StatementAdapter.java:36)
	at com.carrotsearch.randomizedtesting.rules.StatementAdapter.evaluate(StatementAdapter.java:36)
	at org.apache.lucene.util.TestRuleAssertionsRequired$1.evaluate(TestRuleAssertionsRequired.java:54)
	at org.apache.lucene.util.TestRuleMarkFailure$1.evaluate(TestRuleMarkFailure.java:48)
	at org.apache.lucene.util.TestRuleIgnoreAfterMaxFailures$1.evaluate(TestRuleIgnoreAfterMaxFailures.java:65)
	at org.apache.lucene.util.TestRuleIgnoreTestSuites$1.evaluate(TestRuleIgnoreTestSuites.java:55)
	at com.carrotsearch.randomizedtesting.rules.StatementAdapter.evaluate(StatementAdapter.java:36)
	at com.carrotsearch.randomizedtesting.ThreadLeakControl$StatementRunner.run(ThreadLeakControl.java:365)
	at java.lang.Thread.run(Thread.java:745)
Caused by: java.lang.RuntimeException: REQUEST FAILED: xpath=//lst[@name='1']/arr[@name='tv_text']/str
	xml response was: <?xml version="1.0" encoding="UTF-8"?>
<response>
<lst name="responseHeader"><int name="status">0</int><int name="QTime">1</int></lst><result name="response" numFound="1" start="0"><doc><arr name="t_text"><str>a long day's night</str></arr><int name="id">1</int><arr name="range_facet_l"><long>1</long></arr><arr name="tv_text"><str>a long night's day</str></arr><long name="_version_">1486155380337672192</long><arr name="multiDefault"><str>muLti-Default</str></arr><int name="intDefault">42</int><date name="timestamp">2014-11-30T00:43:36.417Z</date></doc></result><lst name="highlighting"><lst name="1"><arr name="t_text"><str>a &lt;em&gt;long&lt;/em&gt; day's night</str></arr></lst></lst>
</response>

	request was:q=t_text:long&qt=standard&hl=true&start=0&hl.fl=t_text+tv_text&rows=200
	at org.apache.solr.SolrTestCaseJ4.assertQ(SolrTestCaseJ4.java:722)
	... 41 more


FAILED:  org.apache.solr.highlight.HighlighterTest.testTermVecMultiValuedHighlight

Error Message:
Exception during query

Stack Trace:
java.lang.RuntimeException: Exception during query
	at __randomizedtesting.SeedInfo.seed([5BFA450E44681472:F1A44162F182006A]:0)
	at org.apache.solr.SolrTestCaseJ4.assertQ(SolrTestCaseJ4.java:729)
	at org.apache.solr.highlight.HighlighterTest.testTermVecMultiValuedHighlight(HighlighterTest.java:211)
	at sun.reflect.NativeMethodAccessorImpl.invoke0(Native Method)
	at sun.reflect.NativeMethodAccessorImpl.invoke(NativeMethodAccessorImpl.java:62)
	at sun.reflect.DelegatingMethodAccessorImpl.invoke(DelegatingMethodAccessorImpl.java:43)
	at java.lang.reflect.Method.invoke(Method.java:483)
	at com.carrotsearch.randomizedtesting.RandomizedRunner.invoke(RandomizedRunner.java:1618)
	at com.carrotsearch.randomizedtesting.RandomizedRunner$6.evaluate(RandomizedRunner.java:827)
	at com.carrotsearch.randomizedtesting.RandomizedRunner$7.evaluate(RandomizedRunner.java:863)
	at com.carrotsearch.randomizedtesting.RandomizedRunner$8.evaluate(RandomizedRunner.java:877)
	at com.carrotsearch.randomizedtesting.rules.SystemPropertiesRestoreRule$1.evaluate(SystemPropertiesRestoreRule.java:53)
	at org.apache.lucene.util.TestRuleSetupTeardownChained$1.evaluate(TestRuleSetupTeardownChained.java:50)
	at org.apache.lucene.util.AbstractBeforeAfterRule$1.evaluate(AbstractBeforeAfterRule.java:46)
	at com.carrotsearch.randomizedtesting.rules.SystemPropertiesInvariantRule$1.evaluate(SystemPropertiesInvariantRule.java:55)
	at org.apache.lucene.util.TestRuleThreadAndTestName$1.evaluate(TestRuleThreadAndTestName.java:49)
	at org.apache.lucene.util.TestRuleIgnoreAfterMaxFailures$1.evaluate(TestRuleIgnoreAfterMaxFailures.java:65)
	at org.apache.lucene.util.TestRuleMarkFailure$1.evaluate(TestRuleMarkFailure.java:48)
	at com.carrotsearch.randomizedtesting.rules.StatementAdapter.evaluate(StatementAdapter.java:36)
	at com.carrotsearch.randomizedtesting.ThreadLeakControl$StatementRunner.run(ThreadLeakControl.java:365)
	at com.carrotsearch.randomizedtesting.ThreadLeakControl.forkTimeoutingTask(ThreadLeakControl.java:798)
	at com.carrotsearch.randomizedtesting.ThreadLeakControl$3.evaluate(ThreadLeakControl.java:458)
	at com.carrotsearch.randomizedtesting.RandomizedRunner.runSingleTest(RandomizedRunner.java:836)
	at com.carrotsearch.randomizedtesting.RandomizedRunner$3.evaluate(RandomizedRunner.java:738)
	at com.carrotsearch.randomizedtesting.RandomizedRunner$4.evaluate(RandomizedRunner.java:772)
	at com.carrotsearch.randomizedtesting.RandomizedRunner$5.evaluate(RandomizedRunner.java:783)
	at com.carrotsearch.randomizedtesting.rules.StatementAdapter.evaluate(StatementAdapter.java:36)
	at com.carrotsearch.randomizedtesting.rules.SystemPropertiesRestoreRule$1.evaluate(SystemPropertiesRestoreRule.java:53)
	at org.apache.lucene.util.AbstractBeforeAfterRule$1.evaluate(AbstractBeforeAfterRule.java:46)
	at org.apache.lucene.util.TestRuleStoreClassName$1.evaluate(TestRuleStoreClassName.java:42)
	at com.carrotsearch.randomizedtesting.rules.SystemPropertiesInvariantRule$1.evaluate(SystemPropertiesInvariantRule.java:55)
	at com.carrotsearch.randomizedtesting.rules.NoShadowingOrOverridesOnMethodsRule$1.evaluate(NoShadowingOrOverridesOnMethodsRule.java:39)
	at com.carrotsearch.randomizedtesting.rules.NoShadowingOrOverridesOnMethodsRule$1.evaluate(NoShadowingOrOverridesOnMethodsRule.java:39)
	at com.carrotsearch.randomizedtesting.rules.StatementAdapter.evaluate(StatementAdapter.java:36)
	at com.carrotsearch.randomizedtesting.rules.StatementAdapter.evaluate(StatementAdapter.java:36)
	at com.carrotsearch.randomizedtesting.rules.StatementAdapter.evaluate(StatementAdapter.java:36)
	at org.apache.lucene.util.TestRuleAssertionsRequired$1.evaluate(TestRuleAssertionsRequired.java:54)
	at org.apache.lucene.util.TestRuleMarkFailure$1.evaluate(TestRuleMarkFailure.java:48)
	at org.apache.lucene.util.TestRuleIgnoreAfterMaxFailures$1.evaluate(TestRuleIgnoreAfterMaxFailures.java:65)
	at org.apache.lucene.util.TestRuleIgnoreTestSuites$1.evaluate(TestRuleIgnoreTestSuites.java:55)
	at com.carrotsearch.randomizedtesting.rules.StatementAdapter.evaluate(StatementAdapter.java:36)
	at com.carrotsearch.randomizedtesting.ThreadLeakControl$StatementRunner.run(ThreadLeakControl.java:365)
	at java.lang.Thread.run(Thread.java:745)
Caused by: java.lang.RuntimeException: REQUEST FAILED: xpath=//lst[@name='1']/arr[@name='tv_mv_text']/str[.='a <em>long</em> days night this should be a piece of text which']
	xml response was: <?xml version="1.0" encoding="UTF-8"?>
<response>
<lst name="responseHeader"><int name="status">0</int><int name="QTime">1</int></lst><result name="response" numFound="1" start="0"><doc><arr name="tv_mv_text"><str>a long days night this should be a piece of text which is is is is is is is is is is is is is is is is is is is is is is is is isis is is is is is is is is is is is is is is is is is is is is is is is is is is is is is is is is is is is is is is is is is is is is is is is is is is is is is is is is is is is is is is is is is is is is is is is is is is sufficiently lengthly to produce multiple fragments which are not concatenated at all--we want two disjoint long fragments.</str><str>a long days night this should be a piece of text which is is is is is is is is is is is is is is is is is is is is is is is is isis is is is is is is is is is is is is is is is is is is is is is is is is is is is is is is is is is is is is is is is is is is is is is is is is is is is is is is is is is is is is is is is is is is is is is is is is is is sufficiently lengthly to produce multiple fragments which are not concatenated at all--we want two disjoint long fragments.</str></arr><int name="id">1</int><arr name="range_facet_l"><long>1</long></arr><long name="_version_">1486155380380663808</long><arr name="multiDefault"><str>muLti-Default</str></arr><int name="intDefault">42</int><date name="timestamp">2014-11-30T00:43:36.458Z</date></doc></result><lst name="highlighting"><lst name="1"/></lst>
</response>

	request was:hl.snippets=2&q=tv_mv_text:long&qt=standard&hl=true&start=0&hl.fl=tv_mv_text&rows=200
	at org.apache.solr.SolrTestCaseJ4.assertQ(SolrTestCaseJ4.java:722)
	... 41 more


FAILED:  org.apache.solr.highlight.HighlighterTest.testDisMaxHighlight

Error Message:
Exception during query

Stack Trace:
java.lang.RuntimeException: Exception during query
	at __randomizedtesting.SeedInfo.seed([5BFA450E44681472:41526A8A05B6E5E3]:0)
	at org.apache.solr.SolrTestCaseJ4.assertQ(SolrTestCaseJ4.java:729)
	at org.apache.solr.highlight.HighlighterTest.testDisMaxHighlight(HighlighterTest.java:262)
	at sun.reflect.NativeMethodAccessorImpl.invoke0(Native Method)
	at sun.reflect.NativeMethodAccessorImpl.invoke(NativeMethodAccessorImpl.java:62)
	at sun.reflect.DelegatingMethodAccessorImpl.invoke(DelegatingMethodAccessorImpl.java:43)
	at java.lang.reflect.Method.invoke(Method.java:483)
	at com.carrotsearch.randomizedtesting.RandomizedRunner.invoke(RandomizedRunner.java:1618)
	at com.carrotsearch.randomizedtesting.RandomizedRunner$6.evaluate(RandomizedRunner.java:827)
	at com.carrotsearch.randomizedtesting.RandomizedRunner$7.evaluate(RandomizedRunner.java:863)
	at com.carrotsearch.randomizedtesting.RandomizedRunner$8.evaluate(RandomizedRunner.java:877)
	at com.carrotsearch.randomizedtesting.rules.SystemPropertiesRestoreRule$1.evaluate(SystemPropertiesRestoreRule.java:53)
	at org.apache.lucene.util.TestRuleSetupTeardownChained$1.evaluate(TestRuleSetupTeardownChained.java:50)
	at org.apache.lucene.util.AbstractBeforeAfterRule$1.evaluate(AbstractBeforeAfterRule.java:46)
	at com.carrotsearch.randomizedtesting.rules.SystemPropertiesInvariantRule$1.evaluate(SystemPropertiesInvariantRule.java:55)
	at org.apache.lucene.util.TestRuleThreadAndTestName$1.evaluate(TestRuleThreadAndTestName.java:49)
	at org.apache.lucene.util.TestRuleIgnoreAfterMaxFailures$1.evaluate(TestRuleIgnoreAfterMaxFailures.java:65)
	at org.apache.lucene.util.TestRuleMarkFailure$1.evaluate(TestRuleMarkFailure.java:48)
	at com.carrotsearch.randomizedtesting.rules.StatementAdapter.evaluate(StatementAdapter.java:36)
	at com.carrotsearch.randomizedtesting.ThreadLeakControl$StatementRunner.run(ThreadLeakControl.java:365)
	at com.carrotsearch.randomizedtesting.ThreadLeakControl.forkTimeoutingTask(ThreadLeakControl.java:798)
	at com.carrotsearch.randomizedtesting.ThreadLeakControl$3.evaluate(ThreadLeakControl.java:458)
	at com.carrotsearch.randomizedtesting.RandomizedRunner.runSingleTest(RandomizedRunner.java:836)
	at com.carrotsearch.randomizedtesting.RandomizedRunner$3.evaluate(RandomizedRunner.java:738)
	at com.carrotsearch.randomizedtesting.RandomizedRunner$4.evaluate(RandomizedRunner.java:772)
	at com.carrotsearch.randomizedtesting.RandomizedRunner$5.evaluate(RandomizedRunner.java:783)
	at com.carrotsearch.randomizedtesting.rules.StatementAdapter.evaluate(StatementAdapter.java:36)
	at com.carrotsearch.randomizedtesting.rules.SystemPropertiesRestoreRule$1.evaluate(SystemPropertiesRestoreRule.java:53)
	at org.apache.lucene.util.AbstractBeforeAfterRule$1.evaluate(AbstractBeforeAfterRule.java:46)
	at org.apache.lucene.util.TestRuleStoreClassName$1.evaluate(TestRuleStoreClassName.java:42)
	at com.carrotsearch.randomizedtesting.rules.SystemPropertiesInvariantRule$1.evaluate(SystemPropertiesInvariantRule.java:55)
	at com.carrotsearch.randomizedtesting.rules.NoShadowingOrOverridesOnMethodsRule$1.evaluate(NoShadowingOrOverridesOnMethodsRule.java:39)
	at com.carrotsearch.randomizedtesting.rules.NoShadowingOrOverridesOnMethodsRule$1.evaluate(NoShadowingOrOverridesOnMethodsRule.java:39)
	at com.carrotsearch.randomizedtesting.rules.StatementAdapter.evaluate(StatementAdapter.java:36)
	at com.carrotsearch.randomizedtesting.rules.StatementAdapter.evaluate(StatementAdapter.java:36)
	at com.carrotsearch.randomizedtesting.rules.StatementAdapter.evaluate(StatementAdapter.java:36)
	at org.apache.lucene.util.TestRuleAssertionsRequired$1.evaluate(TestRuleAssertionsRequired.java:54)
	at org.apache.lucene.util.TestRuleMarkFailure$1.evaluate(TestRuleMarkFailure.java:48)
	at org.apache.lucene.util.TestRuleIgnoreAfterMaxFailures$1.evaluate(TestRuleIgnoreAfterMaxFailures.java:65)
	at org.apache.lucene.util.TestRuleIgnoreTestSuites$1.evaluate(TestRuleIgnoreTestSuites.java:55)
	at com.carrotsearch.randomizedtesting.rules.StatementAdapter.evaluate(StatementAdapter.java:36)
	at com.carrotsearch.randomizedtesting.ThreadLeakControl$StatementRunner.run(ThreadLeakControl.java:365)
	at java.lang.Thread.run(Thread.java:745)
Caused by: java.lang.RuntimeException: REQUEST FAILED: xpath=//lst[@name='1']/arr[@name='tv_text']/str
	xml response was: <?xml version="1.0" encoding="UTF-8"?>
<response>
<lst name="responseHeader"><int name="status">0</int><int name="QTime">20</int></lst><result name="response" numFound="1" start="0"><doc><arr name="tv_text"><str>a long day's night</str></arr><int name="id">1</int><arr name="range_facet_l"><long>1</long></arr><long name="_version_">1486155380854620160</long><arr name="multiDefault"><str>muLti-Default</str></arr><int name="intDefault">42</int><date name="timestamp">2014-11-30T00:43:36.909Z</date></doc></result><lst name="highlighting"><lst name="1"/></lst>
</response>

	request was:q=long&q.alt=*:*&qt=dismax&hl=true&qf=tv_text&start=0&hl.fl=tv_text&rows=200
	at org.apache.solr.SolrTestCaseJ4.assertQ(SolrTestCaseJ4.java:722)
	... 41 more


FAILED:  org.apache.solr.highlight.HighlighterTest.testTermVecMultiValuedHighlight2

Error Message:
Exception during query

Stack Trace:
java.lang.RuntimeException: Exception during query
	at __randomizedtesting.SeedInfo.seed([5BFA450E44681472:437378D2DABB8140]:0)
	at org.apache.solr.SolrTestCaseJ4.assertQ(SolrTestCaseJ4.java:729)
	at org.apache.solr.highlight.HighlighterTest.testTermVecMultiValuedHighlight2(HighlighterTest.java:239)
	at sun.reflect.NativeMethodAccessorImpl.invoke0(Native Method)
	at sun.reflect.NativeMethodAccessorImpl.invoke(NativeMethodAccessorImpl.java:62)
	at sun.reflect.DelegatingMethodAccessorImpl.invoke(DelegatingMethodAccessorImpl.java:43)
	at java.lang.reflect.Method.invoke(Method.java:483)
	at com.carrotsearch.randomizedtesting.RandomizedRunner.invoke(RandomizedRunner.java:1618)
	at com.carrotsearch.randomizedtesting.RandomizedRunner$6.evaluate(RandomizedRunner.java:827)
	at com.carrotsearch.randomizedtesting.RandomizedRunner$7.evaluate(RandomizedRunner.java:863)
	at com.carrotsearch.randomizedtesting.RandomizedRunner$8.evaluate(RandomizedRunner.java:877)
	at com.carrotsearch.randomizedtesting.rules.SystemPropertiesRestoreRule$1.evaluate(SystemPropertiesRestoreRule.java:53)
	at org.apache.lucene.util.TestRuleSetupTeardownChained$1.evaluate(TestRuleSetupTeardownChained.java:50)
	at org.apache.lucene.util.AbstractBeforeAfterRule$1.evaluate(AbstractBeforeAfterRule.java:46)
	at com.carrotsearch.randomizedtesting.rules.SystemPropertiesInvariantRule$1.evaluate(SystemPropertiesInvariantRule.java:55)
	at org.apache.lucene.util.TestRuleThreadAndTestName$1.evaluate(TestRuleThreadAndTestName.java:49)
	at org.apache.lucene.util.TestRuleIgnoreAfterMaxFailures$1.evaluate(TestRuleIgnoreAfterMaxFailures.java:65)
	at org.apache.lucene.util.TestRuleMarkFailure$1.evaluate(TestRuleMarkFailure.java:48)
	at com.carrotsearch.randomizedtesting.rules.StatementAdapter.evaluate(StatementAdapter.java:36)
	at com.carrotsearch.randomizedtesting.ThreadLeakControl$StatementRunner.run(ThreadLeakControl.java:365)
	at com.carrotsearch.randomizedtesting.ThreadLeakControl.forkTimeoutingTask(ThreadLeakControl.java:798)
	at com.carrotsearch.randomizedtesting.ThreadLeakControl$3.evaluate(ThreadLeakControl.java:458)
	at com.carrotsearch.randomizedtesting.RandomizedRunner.runSingleTest(RandomizedRunner.java:836)
	at com.carrotsearch.randomizedtesting.RandomizedRunner$3.evaluate(RandomizedRunner.java:738)
	at com.carrotsearch.randomizedtesting.RandomizedRunner$4.evaluate(RandomizedRunner.java:772)
	at com.carrotsearch.randomizedtesting.RandomizedRunner$5.evaluate(RandomizedRunner.java:783)
	at com.carrotsearch.randomizedtesting.rules.StatementAdapter.evaluate(StatementAdapter.java:36)
	at com.carrotsearch.randomizedtesting.rules.SystemPropertiesRestoreRule$1.evaluate(SystemPropertiesRestoreRule.java:53)
	at org.apache.lucene.util.AbstractBeforeAfterRule$1.evaluate(AbstractBeforeAfterRule.java:46)
	at org.apache.lucene.util.TestRuleStoreClassName$1.evaluate(TestRuleStoreClassName.java:42)
	at com.carrotsearch.randomizedtesting.rules.SystemPropertiesInvariantRule$1.evaluate(SystemPropertiesInvariantRule.java:55)
	at com.carrotsearch.randomizedtesting.rules.NoShadowingOrOverridesOnMethodsRule$1.evaluate(NoShadowingOrOverridesOnMethodsRule.java:39)
	at com.carrotsearch.randomizedtesting.rules.NoShadowingOrOverridesOnMethodsRule$1.evaluate(NoShadowingOrOverridesOnMethodsRule.java:39)
	at com.carrotsearch.randomizedtesting.rules.StatementAdapter.evaluate(StatementAdapter.java:36)
	at com.carrotsearch.randomizedtesting.rules.StatementAdapter.evaluate(StatementAdapter.java:36)
	at com.carrotsearch.randomizedtesting.rules.StatementAdapter.evaluate(StatementAdapter.java:36)
	at org.apache.lucene.util.TestRuleAssertionsRequired$1.evaluate(TestRuleAssertionsRequired.java:54)
	at org.apache.lucene.util.TestRuleMarkFailure$1.evaluate(TestRuleMarkFailure.java:48)
	at org.apache.lucene.util.TestRuleIgnoreAfterMaxFailures$1.evaluate(TestRuleIgnoreAfterMaxFailures.java:65)
	at org.apache.lucene.util.TestRuleIgnoreTestSuites$1.evaluate(TestRuleIgnoreTestSuites.java:55)
	at com.carrotsearch.randomizedtesting.rules.StatementAdapter.evaluate(StatementAdapter.java:36)
	at com.carrotsearch.randomizedtesting.ThreadLeakControl$StatementRunner.run(ThreadLeakControl.java:365)
	at java.lang.Thread.run(Thread.java:745)
Caused by: java.lang.RuntimeException: REQUEST FAILED: xpath=//lst[@name='1']/arr[@name='tv_mv_text']/str[.='a <em>long</em> days night this should be a piece of text which']
	xml response was: <?xml version="1.0" encoding="UTF-8"?>
<response>
<lst name="responseHeader"><int name="status">0</int><int name="QTime">2</int></lst><result name="response" numFound="1" start="0"><doc><arr name="tv_mv_text"><str>short</str><str>a long days night this should be a piece of text which is is is is is is is is is is is is is is is is is is is is is is is is isis is is is is is is is is is is is is is is is is is is is is is is is is is is is is is is is is is is is is is is is is is is is is is is is is is is is is is is is is is is is is is is is is is is is is is is is is is is sufficiently lengthly to produce multiple fragments which are not concatenated at all--we want two disjoint long fragments.</str></arr><int name="id">1</int><arr name="range_facet_l"><long>1</long></arr><long name="_version_">1486155381249933312</long><arr name="multiDefault"><str>muLti-Default</str></arr><int name="intDefault">42</int><date name="timestamp">2014-11-30T00:43:37.287Z</date></doc></result><lst name="highlighting"><lst name="1"/></lst>
</response>

	request was:hl.snippets=2&q=tv_mv_text:long&qt=standard&hl=true&start=0&hl.fl=tv_mv_text&rows=200
	at org.apache.solr.SolrTestCaseJ4.assertQ(SolrTestCaseJ4.java:722)
	... 41 more


FAILED:  org.apache.solr.highlight.HighlighterTest.testTermVecHighlight

Error Message:
Exception during query

Stack Trace:
java.lang.RuntimeException: Exception during query
	at __randomizedtesting.SeedInfo.seed([5BFA450E44681472:7ADA3DDF4D3BC061]:0)
	at org.apache.solr.SolrTestCaseJ4.assertQ(SolrTestCaseJ4.java:729)
	at org.apache.solr.highlight.HighlighterTest.testTermVecHighlight(HighlighterTest.java:145)
	at sun.reflect.NativeMethodAccessorImpl.invoke0(Native Method)
	at sun.reflect.NativeMethodAccessorImpl.invoke(NativeMethodAccessorImpl.java:62)
	at sun.reflect.DelegatingMethodAccessorImpl.invoke(DelegatingMethodAccessorImpl.java:43)
	at java.lang.reflect.Method.invoke(Method.java:483)
	at com.carrotsearch.randomizedtesting.RandomizedRunner.invoke(RandomizedRunner.java:1618)
	at com.carrotsearch.randomizedtesting.RandomizedRunner$6.evaluate(RandomizedRunner.java:827)
	at com.carrotsearch.randomizedtesting.RandomizedRunner$7.evaluate(RandomizedRunner.java:863)
	at com.carrotsearch.randomizedtesting.RandomizedRunner$8.evaluate(RandomizedRunner.java:877)
	at com.carrotsearch.randomizedtesting.rules.SystemPropertiesRestoreRule$1.evaluate(SystemPropertiesRestoreRule.java:53)
	at org.apache.lucene.util.TestRuleSetupTeardownChained$1.evaluate(TestRuleSetupTeardownChained.java:50)
	at org.apache.lucene.util.AbstractBeforeAfterRule$1.evaluate(AbstractBeforeAfterRule.java:46)
	at com.carrotsearch.randomizedtesting.rules.SystemPropertiesInvariantRule$1.evaluate(SystemPropertiesInvariantRule.java:55)
	at org.apache.lucene.util.TestRuleThreadAndTestName$1.evaluate(TestRuleThreadAndTestName.java:49)
	at org.apache.lucene.util.TestRuleIgnoreAfterMaxFailures$1.evaluate(TestRuleIgnoreAfterMaxFailures.java:65)
	at org.apache.lucene.util.TestRuleMarkFailure$1.evaluate(TestRuleMarkFailure.java:48)
	at com.carrotsearch.randomizedtesting.rules.StatementAdapter.evaluate(StatementAdapter.java:36)
	at com.carrotsearch.randomizedtesting.ThreadLeakControl$StatementRunner.run(ThreadLeakControl.java:365)
	at com.carrotsearch.randomizedtesting.ThreadLeakControl.forkTimeoutingTask(ThreadLeakControl.java:798)
	at com.carrotsearch.randomizedtesting.ThreadLeakControl$3.evaluate(ThreadLeakControl.java:458)
	at com.carrotsearch.randomizedtesting.RandomizedRunner.runSingleTest(RandomizedRunner.java:836)
	at com.carrotsearch.randomizedtesting.RandomizedRunner$3.evaluate(RandomizedRunner.java:738)
	at com.carrotsearch.randomizedtesting.RandomizedRunner$4.evaluate(RandomizedRunner.java:772)
	at com.carrotsearch.randomizedtesting.RandomizedRunner$5.evaluate(RandomizedRunner.java:783)
	at com.carrotsearch.randomizedtesting.rules.StatementAdapter.evaluate(StatementAdapter.java:36)
	at com.carrotsearch.randomizedtesting.rules.SystemPropertiesRestoreRule$1.evaluate(SystemPropertiesRestoreRule.java:53)
	at org.apache.lucene.util.AbstractBeforeAfterRule$1.evaluate(AbstractBeforeAfterRule.java:46)
	at org.apache.lucene.util.TestRuleStoreClassName$1.evaluate(TestRuleStoreClassName.java:42)
	at com.carrotsearch.randomizedtesting.rules.SystemPropertiesInvariantRule$1.evaluate(SystemPropertiesInvariantRule.java:55)
	at com.carrotsearch.randomizedtesting.rules.NoShadowingOrOverridesOnMethodsRule$1.evaluate(NoShadowingOrOverridesOnMethodsRule.java:39)
	at com.carrotsearch.randomizedtesting.rules.NoShadowingOrOverridesOnMethodsRule$1.evaluate(NoShadowingOrOverridesOnMethodsRule.java:39)
	at com.carrotsearch.randomizedtesting.rules.StatementAdapter.evaluate(StatementAdapter.java:36)
	at com.carrotsearch.randomizedtesting.rules.StatementAdapter.evaluate(StatementAdapter.java:36)
	at com.carrotsearch.randomizedtesting.rules.StatementAdapter.evaluate(StatementAdapter.java:36)
	at org.apache.lucene.util.TestRuleAssertionsRequired$1.evaluate(TestRuleAssertionsRequired.java:54)
	at org.apache.lucene.util.TestRuleMarkFailure$1.evaluate(TestRuleMarkFailure.java:48)
	at org.apache.lucene.util.TestRuleIgnoreAfterMaxFailures$1.evaluate(TestRuleIgnoreAfterMaxFailures.java:65)
	at org.apache.lucene.util.TestRuleIgnoreTestSuites$1.evaluate(TestRuleIgnoreTestSuites.java:55)
	at com.carrotsearch.randomizedtesting.rules.StatementAdapter.evaluate(StatementAdapter.java:36)
	at com.carrotsearch.randomizedtesting.ThreadLeakControl$StatementRunner.run(ThreadLeakControl.java:365)
	at java.lang.Thread.run(Thread.java:745)
Caused by: java.lang.RuntimeException: REQUEST FAILED: xpath=//lst[@name='1']/arr[@name='tv_text']/str[.='a <em>long</em> days night this should be a piece of text which']
	xml response was: <?xml version="1.0" encoding="UTF-8"?>
<response>
<lst name="responseHeader"><int name="status">0</int><int name="QTime">30</int></lst><result name="response" numFound="1" start="0"><doc><arr name="tv_text"><str>a long days night this should be a piece of text which is is is is is is is is is is is is is is is is is is is is is is is is isis is is is is is is is is is is is is is is is is is is is is is is is is is is is is is is is is is is is is is is is is is is is is is is is is is is is is is is is is is is is is is is is is is is is is is is is is is is sufficiently lengthly to produce multiple fragments which are not concatenated at all--we want two disjoint long fragments.</str></arr><int name="id">1</int><arr name="range_facet_l"><long>1</long></arr><long name="_version_">1486155381645246464</long><arr name="multiDefault"><str>muLti-Default</str></arr><int name="intDefault">42</int><date name="timestamp">2014-11-30T00:43:37.664Z</date></doc></result><lst name="highlighting"><lst name="1"/></lst>
</response>

	request was:hl.snippets=2&q=tv_text:long&qt=standard&hl=true&start=0&hl.fl=tv_text&rows=200
	at org.apache.solr.SolrTestCaseJ4.assertQ(SolrTestCaseJ4.java:722)
	... 41 more


FAILED:  org.apache.solr.highlight.HighlighterTest.testLongFragment

Error Message:
Exception during query

Stack Trace:
java.lang.RuntimeException: Exception during query
	at __randomizedtesting.SeedInfo.seed([5BFA450E44681472:C33D39A94B441FBA]:0)
	at org.apache.solr.SolrTestCaseJ4.assertQ(SolrTestCaseJ4.java:729)
	at org.apache.solr.highlight.HighlighterTest.testLongFragment(HighlighterTest.java:496)
	at sun.reflect.NativeMethodAccessorImpl.invoke0(Native Method)
	at sun.reflect.NativeMethodAccessorImpl.invoke(NativeMethodAccessorImpl.java:62)
	at sun.reflect.DelegatingMethodAccessorImpl.invoke(DelegatingMethodAccessorImpl.java:43)
	at java.lang.reflect.Method.invoke(Method.java:483)
	at com.carrotsearch.randomizedtesting.RandomizedRunner.invoke(RandomizedRunner.java:1618)
	at com.carrotsearch.randomizedtesting.RandomizedRunner$6.evaluate(RandomizedRunner.java:827)
	at com.carrotsearch.randomizedtesting.RandomizedRunner$7.evaluate(RandomizedRunner.java:863)
	at com.carrotsearch.randomizedtesting.RandomizedRunner$8.evaluate(RandomizedRunner.java:877)
	at com.carrotsearch.randomizedtesting.rules.SystemPropertiesRestoreRule$1.evaluate(SystemPropertiesRestoreRule.java:53)
	at org.apache.lucene.util.TestRuleSetupTeardownChained$1.evaluate(TestRuleSetupTeardownChained.java:50)
	at org.apache.lucene.util.AbstractBeforeAfterRule$1.evaluate(AbstractBeforeAfterRule.java:46)
	at com.carrotsearch.randomizedtesting.rules.SystemPropertiesInvariantRule$1.evaluate(SystemPropertiesInvariantRule.java:55)
	at org.apache.lucene.util.TestRuleThreadAndTestName$1.evaluate(TestRuleThreadAndTestName.java:49)
	at org.apache.lucene.util.TestRuleIgnoreAfterMaxFailures$1.evaluate(TestRuleIgnoreAfterMaxFailures.java:65)
	at org.apache.lucene.util.TestRuleMarkFailure$1.evaluate(TestRuleMarkFailure.java:48)
	at com.carrotsearch.randomizedtesting.rules.StatementAdapter.evaluate(StatementAdapter.java:36)
	at com.carrotsearch.randomizedtesting.ThreadLeakControl$StatementRunner.run(ThreadLeakControl.java:365)
	at com.carrotsearch.randomizedtesting.ThreadLeakControl.forkTimeoutingTask(ThreadLeakControl.java:798)
	at com.carrotsearch.randomizedtesting.ThreadLeakControl$3.evaluate(ThreadLeakControl.java:458)
	at com.carrotsearch.randomizedtesting.RandomizedRunner.runSingleTest(RandomizedRunner.java:836)
	at com.carrotsearch.randomizedtesting.RandomizedRunner$3.evaluate(RandomizedRunner.java:738)
	at com.carrotsearch.randomizedtesting.RandomizedRunner$4.evaluate(RandomizedRunner.java:772)
	at com.carrotsearch.randomizedtesting.RandomizedRunner$5.evaluate(RandomizedRunner.java:783)
	at com.carrotsearch.randomizedtesting.rules.StatementAdapter.evaluate(StatementAdapter.java:36)
	at com.carrotsearch.randomizedtesting.rules.SystemPropertiesRestoreRule$1.evaluate(SystemPropertiesRestoreRule.java:53)
	at org.apache.lucene.util.AbstractBeforeAfterRule$1.evaluate(AbstractBeforeAfterRule.java:46)
	at org.apache.lucene.util.TestRuleStoreClassName$1.evaluate(TestRuleStoreClassName.java:42)
	at com.carrotsearch.randomizedtesting.rules.SystemPropertiesInvariantRule$1.evaluate(SystemPropertiesInvariantRule.java:55)
	at com.carrotsearch.randomizedtesting.rules.NoShadowingOrOverridesOnMethodsRule$1.evaluate(NoShadowingOrOverridesOnMethodsRule.java:39)
	at com.carrotsearch.randomizedtesting.rules.NoShadowingOrOverridesOnMethodsRule$1.evaluate(NoShadowingOrOverridesOnMethodsRule.java:39)
	at com.carrotsearch.randomizedtesting.rules.StatementAdapter.evaluate(StatementAdapter.java:36)
	at com.carrotsearch.randomizedtesting.rules.StatementAdapter.evaluate(StatementAdapter.java:36)
	at com.carrotsearch.randomizedtesting.rules.StatementAdapter.evaluate(StatementAdapter.java:36)
	at org.apache.lucene.util.TestRuleAssertionsRequired$1.evaluate(TestRuleAssertionsRequired.java:54)
	at org.apache.lucene.util.TestRuleMarkFailure$1.evaluate(TestRuleMarkFailure.java:48)
	at org.apache.lucene.util.TestRuleIgnoreAfterMaxFailures$1.evaluate(TestRuleIgnoreAfterMaxFailures.java:65)
	at org.apache.lucene.util.TestRuleIgnoreTestSuites$1.evaluate(TestRuleIgnoreTestSuites.java:55)
	at com.carrotsearch.randomizedtesting.rules.StatementAdapter.evaluate(StatementAdapter.java:36)
	at com.carrotsearch.randomizedtesting.ThreadLeakControl$StatementRunner.run(ThreadLeakControl.java:365)
	at java.lang.Thread.run(Thread.java:745)
Caused by: java.lang.RuntimeException: REQUEST FAILED: xpath=//lst[@name='1']/arr[@name='tv_text']/str
	xml response was: <?xml version="1.0" encoding="UTF-8"?>
<response>
<lst name="responseHeader"><int name="status">0</int><int name="QTime">2</int></lst><result name="response" numFound="1" start="0"><doc><arr name="tv_text"><str>junit: [mkdir] Created dir: /home/klaas/worio/backend/trunk/build-src/solr-nightly/build/test-results [junit] Running org.apache.solr.BasicFunctionalityTest [junit] Tests run: 7, Failures: 0, Errors: 0, Time elapsed: 5.36 sec [junit] Running org.apache.solr.ConvertedLegacyTest [junit] Tests run: 1, Failures: 0, Errors: 0, Time elapsed: 8.268 sec [junit] Running org.apache.solr.DisMaxRequestHandlerTest [junit] Tests run: 1, Failures: 0, Errors: 0, Time elapsed: 1.56 sec [junit] Running org.apache.solr.HighlighterTest [junit] Tests run: 7, Failures: 0, Errors: 0, Time elapsed: 4.979 sec [junit] Running org.apache.solr.OutputWriterTest [junit] Tests run: 2, Failures: 0, Errors: 0, Time elapsed: 0.797 sec [junit] Running org.apache.solr.SampleTest [junit] Tests run: 2, Failures: 0, Errors: 0, Time elapsed: 1.021 sec [junit] Running org.apache.solr.analysis.TestBufferedTokenStream [junit] Tests run: 2, Failures: 0, Errors: 0, Time elapsed: 0.05 sec [junit] Running org.apache.solr.analysis.TestRemoveDuplicatesTokenFilter [junit] Tests run: 3, Failures: 0, Errors: 0, Time elapsed: 0.054 sec [junit] Running org.apache.solr.analysis.TestSynonymFilter [junit] Tests run: 6, Failures: 0, Errors: 0, Time elapsed: 0.081 sec [junit] Running org.apache.solr.analysis.TestWordDelimiterFilter [junit] Tests run: 1, Failures: 0, Errors: 0, Time elapsed: 1.714 sec [junit] Running org.apache.solr.search.TestDocSet [junit] Tests run: 1, Failures: 0, Errors: 0, Time elapsed: 0.788 sec [junit] Running org.apache.solr.util.SolrPluginUtilsTest [junit] Tests run: 5, Failures: 0, Errors: 0, Time elapsed: 3.519 sec [junit] Running org.apache.solr.util.TestOpenBitSet [junit] Tests run: 2, Failures: 0, Errors: 0, Time elapsed: 0.533 sec</str></arr><int name="id">1</int><arr name="range_facet_l"><long>1</long></arr><long name="_version_">1486155381895856128</long><arr name="multiDefault"><str>muLti-Default</str></arr><int name="intDefault">42</int><date name="timestamp">2014-11-30T00:43:37.903Z</date></doc></result><lst name="highlighting"><lst name="1"/></lst>
</response>

	request was:q=tv_text:dir&qt=standard&hl=true&start=0&hl.fl=tv_text&rows=200
	at org.apache.solr.SolrTestCaseJ4.assertQ(SolrTestCaseJ4.java:722)
	... 41 more


FAILED:  org.apache.solr.highlight.HighlighterTest.testSubwordWildcardHighlightWithTermOffsets2

Error Message:
Exception during query

Stack Trace:
java.lang.RuntimeException: Exception during query
	at __randomizedtesting.SeedInfo.seed([5BFA450E44681472:69591E8784C4EE1C]:0)
	at org.apache.solr.SolrTestCaseJ4.assertQ(SolrTestCaseJ4.java:729)
	at org.apache.solr.highlight.HighlighterTest.testSubwordWildcardHighlightWithTermOffsets2(HighlighterTest.java:843)
	at sun.reflect.NativeMethodAccessorImpl.invoke0(Native Method)
	at sun.reflect.NativeMethodAccessorImpl.invoke(NativeMethodAccessorImpl.java:62)
	at sun.reflect.DelegatingMethodAccessorImpl.invoke(DelegatingMethodAccessorImpl.java:43)
	at java.lang.reflect.Method.invoke(Method.java:483)
	at com.carrotsearch.randomizedtesting.RandomizedRunner.invoke(RandomizedRunner.java:1618)
	at com.carrotsearch.randomizedtesting.RandomizedRunner$6.evaluate(RandomizedRunner.java:827)
	at com.carrotsearch.randomizedtesting.RandomizedRunner$7.evaluate(RandomizedRunner.java:863)
	at com.carrotsearch.randomizedtesting.RandomizedRunner$8.evaluate(RandomizedRunner.java:877)
	at com.carrotsearch.randomizedtesting.rules.SystemPropertiesRestoreRule$1.evaluate(SystemPropertiesRestoreRule.java:53)
	at org.apache.lucene.util.TestRuleSetupTeardownChained$1.evaluate(TestRuleSetupTeardownChained.java:50)
	at org.apache.lucene.util.AbstractBeforeAfterRule$1.evaluate(AbstractBeforeAfterRule.java:46)
	at com.carrotsearch.randomizedtesting.rules.SystemPropertiesInvariantRule$1.evaluate(SystemPropertiesInvariantRule.java:55)
	at org.apache.lucene.util.TestRuleThreadAndTestName$1.evaluate(TestRuleThreadAndTestName.java:49)
	at org.apache.lucene.util.TestRuleIgnoreAfterMaxFailures$1.evaluate(TestRuleIgnoreAfterMaxFailures.java:65)
	at org.apache.lucene.util.TestRuleMarkFailure$1.evaluate(TestRuleMarkFailure.java:48)
	at com.carrotsearch.randomizedtesting.rules.StatementAdapter.evaluate(StatementAdapter.java:36)
	at com.carrotsearch.randomizedtesting.ThreadLeakControl$StatementRunner.run(ThreadLeakControl.java:365)
	at com.carrotsearch.randomizedtesting.ThreadLeakControl.forkTimeoutingTask(ThreadLeakControl.java:798)
	at com.carrotsearch.randomizedtesting.ThreadLeakControl$3.evaluate(ThreadLeakControl.java:458)
	at com.carrotsearch.randomizedtesting.RandomizedRunner.runSingleTest(RandomizedRunner.java:836)
	at com.carrotsearch.randomizedtesting.RandomizedRunner$3.evaluate(RandomizedRunner.java:738)
	at com.carrotsearch.randomizedtesting.RandomizedRunner$4.evaluate(RandomizedRunner.java:772)
	at com.carrotsearch.randomizedtesting.RandomizedRunner$5.evaluate(RandomizedRunner.java:783)
	at com.carrotsearch.randomizedtesting.rules.StatementAdapter.evaluate(StatementAdapter.java:36)
	at com.carrotsearch.randomizedtesting.rules.SystemPropertiesRestoreRule$1.evaluate(SystemPropertiesRestoreRule.java:53)
	at org.apache.lucene.util.AbstractBeforeAfterRule$1.evaluate(AbstractBeforeAfterRule.java:46)
	at org.apache.lucene.util.TestRuleStoreClassName$1.evaluate(TestRuleStoreClassName.java:42)
	at com.carrotsearch.randomizedtesting.rules.SystemPropertiesInvariantRule$1.evaluate(SystemPropertiesInvariantRule.java:55)
	at com.carrotsearch.randomizedtesting.rules.NoShadowingOrOverridesOnMethodsRule$1.evaluate(NoShadowingOrOverridesOnMethodsRule.java:39)
	at com.carrotsearch.randomizedtesting.rules.NoShadowingOrOverridesOnMethodsRule$1.evaluate(NoShadowingOrOverridesOnMethodsRule.java:39)
	at com.carrotsearch.randomizedtesting.rules.StatementAdapter.evaluate(StatementAdapter.java:36)
	at com.carrotsearch.randomizedtesting.rules.StatementAdapter.evaluate(StatementAdapter.java:36)
	at com.carrotsearch.randomizedtesting.rules.StatementAdapter.evaluate(StatementAdapter.java:36)
	at org.apache.lucene.util.TestRuleAssertionsRequired$1.evaluate(TestRuleAssertionsRequired.java:54)
	at org.apache.lucene.util.TestRuleMarkFailure$1.evaluate(TestRuleMarkFailure.java:48)
	at org.apache.lucene.util.TestRuleIgnoreAfterMaxFailures$1.evaluate(TestRuleIgnoreAfterMaxFailures.java:65)
	at org.apache.lucene.util.TestRuleIgnoreTestSuites$1.evaluate(TestRuleIgnoreTestSuites.java:55)
	at com.carrotsearch.randomizedtesting.rules.StatementAdapter.evaluate(StatementAdapter.java:36)
	at com.carrotsearch.randomizedtesting.ThreadLeakControl$StatementRunner.run(ThreadLeakControl.java:365)
	at java.lang.Thread.run(Thread.java:745)
Caused by: java.lang.RuntimeException: REQUEST FAILED: xpath=//lst[@name='highlighting']/lst[@name='1']/arr[@name='subword_offsets']/str='lorem <em>PowerShot</em> ipsum'
	xml response was: <?xml version="1.0" encoding="UTF-8"?>
<response>
<lst name="responseHeader"><int name="status">0</int><int name="QTime">2</int></lst><result name="response" numFound="1" start="0"><doc><arr name="subword_offsets"><str>lorem PowerShot ipsum</str></arr><int name="id">1</int><arr name="range_facet_l"><long>1</long></arr><long name="_version_">1486155381987082240</long><arr name="multiDefault"><str>muLti-Default</str></arr><int name="intDefault">42</int><date name="timestamp">2014-11-30T00:43:37.99Z</date></doc></result><lst name="highlighting"><lst name="1"/></lst>
</response>

	request was:q=subword_offsets:pow*&hl=true&hl.fl=subword_offsets&wt=xml
	at org.apache.solr.SolrTestCaseJ4.assertQ(SolrTestCaseJ4.java:722)
	... 41 more




Build Log:
[...truncated 8882 lines...]
   [junit4] Suite: org.apache.solr.highlight.HighlighterTest
   [junit4]   2> Creating dataDir: /Users/jenkins/workspace/Lucene-Solr-trunk-MacOSX/solr/build/solr-core/test/J0/temp/solr.highlight.HighlighterTest-5BFA450E44681472-001/init-core-data-001
   [junit4]   2> 1941115 T5894 oas.SolrTestCaseJ4.buildSSLConfig Randomized ssl (false) and clientAuth (false)
   [junit4]   2> 1941117 T5894 oas.SolrTestCaseJ4.initCore ####initCore
   [junit4]   2> 1941117 T5894 oasc.SolrResourceLoader.<init> new SolrResourceLoader for directory: '/Users/jenkins/workspace/Lucene-Solr-trunk-MacOSX/solr/core/src/test-files/solr/collection1/'
   [junit4]   2> 1941118 T5894 oasc.SolrResourceLoader.replaceClassLoader Adding 'file:/Users/jenkins/workspace/Lucene-Solr-trunk-MacOSX/solr/core/src/test-files/solr/collection1/lib/.svn/' to classloader
   [junit4]   2> 1941118 T5894 oasc.SolrResourceLoader.replaceClassLoader Adding 'file:/Users/jenkins/workspace/Lucene-Solr-trunk-MacOSX/solr/core/src/test-files/solr/collection1/lib/classes/' to classloader
   [junit4]   2> 1941119 T5894 oasc.SolrResourceLoader.replaceClassLoader Adding 'file:/Users/jenkins/workspace/Lucene-Solr-trunk-MacOSX/solr/core/src/test-files/solr/collection1/lib/README' to classloader
   [junit4]   2> 1941193 T5894 oasc.SolrConfig.<init> Using Lucene MatchVersion: 6.0.0
   [junit4]   2> 1941221 T5894 oasc.SolrConfig.<init> Loaded SolrConfig: solrconfig.xml
   [junit4]   2> 1941222 T5894 oass.IndexSchema.readSchema Reading Solr Schema from /Users/jenkins/workspace/Lucene-Solr-trunk-MacOSX/solr/core/src/test-files/solr/collection1/conf/schema.xml
   [junit4]   2> 1941227 T5894 oass.IndexSchema.readSchema [null] Schema name=test
   [junit4]   2> 1941356 T5894 oass.OpenExchangeRatesOrgProvider.init Initialized with rates=open-exchange-rates.json, refreshInterval=1440.
   [junit4]   2> 1941364 T5894 oass.IndexSchema.readSchema default search field in schema is text
   [junit4]   2> 1941365 T5894 oass.IndexSchema.readSchema unique key field: id
   [junit4]   2> 1941375 T5894 oass.FileExchangeRateProvider.reload Reloading exchange rates from file currency.xml
   [junit4]   2> 1941377 T5894 oass.FileExchangeRateProvider.reload Reloading exchange rates from file currency.xml
   [junit4]   2> 1941379 T5894 oass.OpenExchangeRatesOrgProvider.reload Reloading exchange rates from open-exchange-rates.json
   [junit4]   2> 1941380 T5894 oass.OpenExchangeRatesOrgProvider$OpenExchangeRates.<init> WARN Unknown key IMPORTANT NOTE
   [junit4]   2> 1941380 T5894 oass.OpenExchangeRatesOrgProvider$OpenExchangeRates.<init> WARN Expected key, got STRING
   [junit4]   2> 1941381 T5894 oass.OpenExchangeRatesOrgProvider.reload Reloading exchange rates from open-exchange-rates.json
   [junit4]   2> 1941381 T5894 oass.OpenExchangeRatesOrgProvider$OpenExchangeRates.<init> WARN Unknown key IMPORTANT NOTE
   [junit4]   2> 1941382 T5894 oass.OpenExchangeRatesOrgProvider$OpenExchangeRates.<init> WARN Expected key, got STRING
   [junit4]   2> 1941382 T5894 oasc.SolrResourceLoader.locateSolrHome JNDI not configured for solr (NoInitialContextEx)
   [junit4]   2> 1941383 T5894 oasc.SolrResourceLoader.locateSolrHome using system property solr.solr.home: /Users/jenkins/workspace/Lucene-Solr-trunk-MacOSX/solr/core/src/test-files/solr
   [junit4]   2> 1941383 T5894 oasc.SolrResourceLoader.<init> new SolrResourceLoader for directory: '/Users/jenkins/workspace/Lucene-Solr-trunk-MacOSX/solr/core/src/test-files/solr/'
   [junit4]   2> 1941410 T5894 oasc.CoreContainer.<init> New CoreContainer 651431269
   [junit4]   2> 1941410 T5894 oasc.CoreContainer.load Loading cores into CoreContainer [instanceDir=/Users/jenkins/workspace/Lucene-Solr-trunk-MacOSX/solr/core/src/test-files/solr/]
   [junit4]   2> 1941412 T5894 oashc.HttpShardHandlerFactory.getParameter Setting socketTimeout to: 0
   [junit4]   2> 1941412 T5894 oashc.HttpShardHandlerFactory.getParameter Setting urlScheme to: null
   [junit4]   2> 1941412 T5894 oashc.HttpShardHandlerFactory.getParameter Setting connTimeout to: 0
   [junit4]   2> 1941412 T5894 oashc.HttpShardHandlerFactory.getParameter Setting maxConnectionsPerHost to: 20
   [junit4]   2> 1941412 T5894 oashc.HttpShardHandlerFactory.getParameter Setting maxConnections to: 10000
   [junit4]   2> 1941413 T5894 oashc.HttpShardHandlerFactory.getParameter Setting corePoolSize to: 0
   [junit4]   2> 1941413 T5894 oashc.HttpShardHandlerFactory.getParameter Setting maximumPoolSize to: 2147483647
   [junit4]   2> 1941413 T5894 oashc.HttpShardHandlerFactory.getParameter Setting maxThreadIdleTime to: 5
   [junit4]   2> 1941413 T5894 oashc.HttpShardHandlerFactory.getParameter Setting sizeOfQueue to: -1
   [junit4]   2> 1941413 T5894 oashc.HttpShardHandlerFactory.getParameter Setting fairnessPolicy to: false
   [junit4]   2> 1941414 T5894 oasu.UpdateShardHandler.<init> Creating UpdateShardHandler HTTP client with params: socketTimeout=30000&connTimeout=30000&retry=false
   [junit4]   2> 1941415 T5894 oasl.LogWatcher.createWatcher SLF4J impl is org.slf4j.impl.Log4jLoggerFactory
   [junit4]   2> 1941415 T5894 oasl.LogWatcher.newRegisteredLogWatcher Registering Log Listener [Log4j (org.slf4j.impl.Log4jLoggerFactory)]
   [junit4]   2> 1941415 T5894 oasc.CoreContainer.load Host Name: 
   [junit4]   2> 1941422 T5895 oasc.SolrResourceLoader.<init> new SolrResourceLoader for directory: '/Users/jenkins/workspace/Lucene-Solr-trunk-MacOSX/solr/core/src/test-files/solr/collection1/'
   [junit4]   2> 1941423 T5895 oasc.SolrResourceLoader.replaceClassLoader Adding 'file:/Users/jenkins/workspace/Lucene-Solr-trunk-MacOSX/solr/core/src/test-files/solr/collection1/lib/.svn/' to classloader
   [junit4]   2> 1941423 T5895 oasc.SolrResourceLoader.replaceClassLoader Adding 'file:/Users/jenkins/workspace/Lucene-Solr-trunk-MacOSX/solr/core/src/test-files/solr/collection1/lib/classes/' to classloader
   [junit4]   2> 1941424 T5895 oasc.SolrResourceLoader.replaceClassLoader Adding 'file:/Users/jenkins/workspace/Lucene-Solr-trunk-MacOSX/solr/core/src/test-files/solr/collection1/lib/README' to classloader
   [junit4]   2> 1941464 T5895 oasc.SolrConfig.<init> Using Lucene MatchVersion: 6.0.0
   [junit4]   2> 1941492 T5895 oasc.SolrConfig.<init> Loaded SolrConfig: solrconfig.xml
   [junit4]   2> 1941494 T5895 oass.IndexSchema.readSchema Reading Solr Schema from /Users/jenkins/workspace/Lucene-Solr-trunk-MacOSX/solr/core/src/test-files/solr/collection1/conf/schema.xml
   [junit4]   2> 1941504 T5895 oass.IndexSchema.readSchema [collection1] Schema name=test
   [junit4]   2> 1941630 T5895 oass.OpenExchangeRatesOrgProvider.init Initialized with rates=open-exchange-rates.json, refreshInterval=1440.
   [junit4]   2> 1941634 T5895 oass.IndexSchema.readSchema default search field in schema is text
   [junit4]   2> 1941635 T5895 oass.IndexSchema.readSchema unique key field: id
   [junit4]   2> 1941642 T5895 oass.FileExchangeRateProvider.reload Reloading exchange rates from file currency.xml
   [junit4]   2> 1941644 T5895 oass.FileExchangeRateProvider.reload Reloading exchange rates from file currency.xml
   [junit4]   2> 1941646 T5895 oass.OpenExchangeRatesOrgProvider.reload Reloading exchange rates from open-exchange-rates.json
   [junit4]   2> 1941647 T5895 oass.OpenExchangeRatesOrgProvider$OpenExchangeRates.<init> WARN Unknown key IMPORTANT NOTE
   [junit4]   2> 1941647 T5895 oass.OpenExchangeRatesOrgProvider$OpenExchangeRates.<init> WARN Expected key, got STRING
   [junit4]   2> 1941647 T5895 oass.OpenExchangeRatesOrgProvider.reload Reloading exchange rates from open-exchange-rates.json
   [junit4]   2> 1941648 T5895 oass.OpenExchangeRatesOrgProvider$OpenExchangeRates.<init> WARN Unknown key IMPORTANT NOTE
   [junit4]   2> 1941648 T5895 oass.OpenExchangeRatesOrgProvider$OpenExchangeRates.<init> WARN Expected key, got STRING
   [junit4]   2> 1941648 T5895 oasc.CoreContainer.create Creating SolrCore 'collection1' using configuration from instancedir /Users/jenkins/workspace/Lucene-Solr-trunk-MacOSX/solr/core/src/test-files/solr/collection1/
   [junit4]   2> 1941649 T5895 oasc.SolrCore.initDirectoryFactory org.apache.solr.core.MockDirectoryFactory
   [junit4]   2> 1941649 T5895 oasc.SolrCore.<init> [collection1] Opening new SolrCore at /Users/jenkins/workspace/Lucene-Solr-trunk-MacOSX/solr/core/src/test-files/solr/collection1/, dataDir=/Users/jenkins/workspace/Lucene-Solr-trunk-MacOSX/solr/build/solr-core/test/J0/temp/solr.highlight.HighlighterTest-5BFA450E44681472-001/init-core-data-001/
   [junit4]   2> 1941650 T5895 oasc.JmxMonitoredMap.<init> JMX monitoring is enabled. Adding Solr mbeans to JMX Server: com.sun.jmx.mbeanserver.JmxMBeanServer@2d4af448
   [junit4]   2> 1941651 T5895 oasc.CachingDirectoryFactory.get return new directory for /Users/jenkins/workspace/Lucene-Solr-trunk-MacOSX/solr/build/solr-core/test/J0/temp/solr.highlight.HighlighterTest-5BFA450E44681472-001/init-core-data-001
   [junit4]   2> 1941651 T5895 oasc.SolrCore.getNewIndexDir New index directory detected: old=null new=/Users/jenkins/workspace/Lucene-Solr-trunk-MacOSX/solr/build/solr-core/test/J0/temp/solr.highlight.HighlighterTest-5BFA450E44681472-001/init-core-data-001/index/
   [junit4]   2> 1941651 T5895 oasc.SolrCore.initIndex WARN [collection1] Solr index directory '/Users/jenkins/workspace/Lucene-Solr-trunk-MacOSX/solr/build/solr-core/test/J0/temp/solr.highlight.HighlighterTest-5BFA450E44681472-001/init-core-data-001/index' doesn't exist. Creating new index...
   [junit4]   2> 1941651 T5895 oasc.CachingDirectoryFactory.get return new directory for /Users/jenkins/workspace/Lucene-Solr-trunk-MacOSX/solr/build/solr-core/test/J0/temp/solr.highlight.HighlighterTest-5BFA450E44681472-001/init-core-data-001/index
   [junit4]   2> 1941652 T5895 oasu.RandomMergePolicy.<init> RandomMergePolicy wrapping class org.apache.lucene.index.AlcoholicMergePolicy: [AlcoholicMergePolicy: minMergeSize=0, mergeFactor=10, maxMergeSize=608600012, maxMergeSizeForForcedMerge=9223372036854775807, calibrateSizeByDeletes=true, maxMergeDocs=2147483647, maxCFSSegmentSizeMB=8.796093022207999E12, noCFSRatio=0.1]
   [junit4]   2> 1941652 T5895 oasc.SolrDeletionPolicy.onCommit SolrDeletionPolicy.onCommit: commits: num=1
   [junit4]   2> 		commit{dir=RateLimitedDirectoryWrapper(MockDirectoryWrapper(RAMDirectory@3f15a271 lockFactory=org.apache.lucene.store.SingleInstanceLockFactory@21276b91)),segFN=segments_1,generation=1}
   [junit4]   2> 1941653 T5895 oasc.SolrDeletionPolicy.updateCommits newest commit generation = 1
   [junit4]   2> 1941653 T5895 oasc.SolrCore.initWriters created xml: solr.XMLResponseWriter
   [junit4]   2> 1941655 T5895 oasup.UpdateRequestProcessorChain.init creating updateRequestProcessorChain "dedupe"
   [junit4]   2> 1941656 T5895 oasup.UpdateRequestProcessorChain.init inserting DistributedUpdateProcessorFactory into updateRequestProcessorChain "dedupe"
   [junit4]   2> 1941656 T5895 oasup.UpdateRequestProcessorChain.init creating updateRequestProcessorChain "dedupe-allfields"
   [junit4]   2> 1941656 T5895 oasup.UpdateRequestProcessorChain.init inserting DistributedUpdateProcessorFactory into updateRequestProcessorChain "dedupe-allfields"
   [junit4]   2> 1941657 T5895 oasup.UpdateRequestProcessorChain.init creating updateRequestProcessorChain "stored_sig"
   [junit4]   2> 1941657 T5895 oasup.UpdateRequestProcessorChain.init inserting DistributedUpdateProcessorFactory into updateRequestProcessorChain "stored_sig"
   [junit4]   2> 1941657 T5895 oasup.UpdateRequestProcessorChain.init creating updateRequestProcessorChain "uniq-fields"
   [junit4]   2> 1941657 T5895 oasup.UpdateRequestProcessorChain.init inserting DistributedUpdateProcessorFactory into updateRequestProcessorChain "uniq-fields"
   [junit4]   2> 1941658 T5895 oasup.UpdateRequestProcessorChain.init creating updateRequestProcessorChain "distrib-dup-test-chain-explicit"
   [junit4]   2> 1941658 T5895 oasup.UpdateRequestProcessorChain.init creating updateRequestProcessorChain "distrib-dup-test-chain-implicit"
   [junit4]   2> 1941659 T5895 oasup.UpdateRequestProcessorChain.init inserting DistributedUpdateProcessorFactory into updateRequestProcessorChain "distrib-dup-test-chain-implicit"
   [junit4]   2> 1941659 T5895 oasc.SolrCore.loadUpdateProcessorChains no updateRequestProcessorChain defined as default, creating implicit default
   [junit4]   2> 1941660 T5895 oasc.RequestHandlers.initHandlersFromConfig created /update: org.apache.solr.handler.UpdateRequestHandler
   [junit4]   2> 1941660 T5895 oasc.RequestHandlers.initHandlersFromConfig created /update/json: org.apache.solr.handler.UpdateRequestHandler
   [junit4]   2> 1941661 T5895 oasc.RequestHandlers.initHandlersFromConfig created /update/csv: org.apache.solr.handler.UpdateRequestHandler
   [junit4]   2> 1941661 T5895 oasc.RequestHandlers.initHandlersFromConfig created /update/json/docs: org.apache.solr.handler.UpdateRequestHandler
   [junit4]   2> 1941661 T5895 oasc.RequestHandlers.initHandlersFromConfig created /config: org.apache.solr.handler.SolrConfigHandler
   [junit4]   2> 1941662 T5895 oasc.RequestHandlers.initHandlersFromConfig created /replication: org.apache.solr.handler.ReplicationHandler
   [junit4]   2> 1941662 T5895 oasc.RequestHandlers.initHandlersFromConfig created /get: org.apache.solr.handler.RealTimeGetHandler
   [junit4]   2> 1941663 T5895 oasc.RequestHandlers.initHandlersFromConfig created /admin/luke: org.apache.solr.handler.admin.LukeRequestHandler
   [junit4]   2> 1941663 T5895 oasc.RequestHandlers.initHandlersFromConfig created /admin/system: org.apache.solr.handler.admin.SystemInfoHandler
   [junit4]   2> 1941664 T5895 oasc.RequestHandlers.initHandlersFromConfig created /admin/mbeans: org.apache.solr.handler.admin.SolrInfoMBeanHandler
   [junit4]   2> 1941664 T5895 oasc.RequestHandlers.initHandlersFromConfig created /admin/plugins: org.apache.solr.handler.admin.PluginInfoHandler
   [junit4]   2> 1941665 T5895 oasc.RequestHandlers.initHandlersFromConfig created /admin/threads: org.apache.solr.handler.admin.ThreadDumpHandler
   [junit4]   2> 1941665 T5895 oasc.RequestHandlers.initHandlersFromConfig created /admin/properties: org.apache.solr.handler.admin.PropertiesRequestHandler
   [junit4]   2> 1941665 T5895 oasc.RequestHandlers.initHandlersFromConfig created /admin/logging: org.apache.solr.handler.admin.LoggingHandler
   [junit4]   2> 1941666 T5895 oasc.RequestHandlers.initHandlersFromConfig created /admin/ping: org.apache.solr.handler.PingRequestHandler
   [junit4]   2> 1941666 T5895 oasc.RequestHandlers.initHandlersFromConfig created standard: solr.StandardRequestHandler
   [junit4]   2> 1941666 T5895 oasc.RequestHandlers.initHandlersFromConfig created dismax: solr.SearchHandler
   [junit4]   2> 1941667 T5895 oasc.RequestHandlers.initHandlersFromConfig created mock: org.apache.solr.core.MockQuerySenderListenerReqHandler
   [junit4]   2> 1941667 T5895 oasc.RequestHandlers.initHandlersFromConfig created /admin/file: solr.admin.ShowFileRequestHandler
   [junit4]   2> 1941667 T5895 oasc.RequestHandlers.initHandlersFromConfig created /admin/fileedit: solr.admin.EditFileRequestHandler
   [junit4]   2> 1941668 T5895 oasc.RequestHandlers.initHandlersFromConfig created defaults: solr.StandardRequestHandler
   [junit4]   2> 1941668 T5895 oasc.RequestHandlers.initHandlersFromConfig adding lazy requestHandler: solr.StandardRequestHandler
   [junit4]   2> 1941668 T5895 oasc.RequestHandlers.initHandlersFromConfig created lazy: solr.StandardRequestHandler
   [junit4]   2> 1941669 T5895 oasc.RequestHandlers.initHandlersFromConfig created /terms: org.apache.solr.handler.component.SearchHandler
   [junit4]   2> 1941669 T5895 oasc.RequestHandlers.initHandlersFromConfig created spellCheckCompRH: org.apache.solr.handler.component.SearchHandler
   [junit4]   2> 1941669 T5895 oasc.RequestHandlers.initHandlersFromConfig created spellCheckCompRH_Direct: org.apache.solr.handler.component.SearchHandler
   [junit4]   2> 1941670 T5895 oasc.RequestHandlers.initHandlersFromConfig created spellCheckWithWordbreak: org.apache.solr.handler.component.SearchHandler
   [junit4]   2> 1941670 T5895 oasc.RequestHandlers.initHandlersFromConfig created spellCheckWithWordbreak_Direct: org.apache.solr.handler.component.SearchHandler
   [junit4]   2> 1941670 T5895 oasc.RequestHandlers.initHandlersFromConfig created spellCheckCompRH1: org.apache.solr.handler.component.SearchHandler
   [junit4]   2> 1941671 T5895 oasc.RequestHandlers.initHandlersFromConfig created mltrh: org.apache.solr.handler.component.SearchHandler
   [junit4]   2> 1941671 T5895 oasc.RequestHandlers.initHandlersFromConfig created tvrh: org.apache.solr.handler.component.SearchHandler
   [junit4]   2> 1941672 T5895 oasc.RequestHandlers.initHandlersFromConfig created /mlt: solr.MoreLikeThisHandler
   [junit4]   2> 1941673 T5895 oasc.RequestHandlers.initHandlersFromConfig created /debug/dump: solr.DumpRequestHandler
   [junit4]   2> 1941679 T5895 oashl.XMLLoader.init xsltCacheLifetimeSeconds=60
   [junit4]   2> 1941680 T5895 oashl.XMLLoader.init xsltCacheLifetimeSeconds=60
   [junit4]   2> 1941682 T5895 oashl.XMLLoader.init xsltCacheLifetimeSeconds=60
   [junit4]   2> 1941683 T5895 oashl.XMLLoader.init xsltCacheLifetimeSeconds=60
   [junit4]   2> 1941684 T5895 oasc.SolrCore.initDeprecatedSupport WARN solrconfig.xml uses deprecated <admin/gettableFiles>, Please update your config to use the ShowFileRequestHandler.
   [junit4]   2> 1941686 T5895 oasu.CommitTracker.<init> Hard AutoCommit: disabled
   [junit4]   2> 1941686 T5895 oasu.CommitTracker.<init> Soft AutoCommit: disabled
   [junit4]   2> 1941687 T5895 oasu.RandomMergePolicy.<init> RandomMergePolicy wrapping class org.apache.lucene.index.AlcoholicMergePolicy: [AlcoholicMergePolicy: minMergeSize=0, mergeFactor=10, maxMergeSize=1371582611, maxMergeSizeForForcedMerge=9223372036854775807, calibrateSizeByDeletes=true, maxMergeDocs=2147483647, maxCFSSegmentSizeMB=8.796093022207999E12, noCFSRatio=0.1]
   [junit4]   2> 1941687 T5895 oasc.SolrDeletionPolicy.onInit SolrDeletionPolicy.onInit: commits: num=1
   [junit4]   2> 		commit{dir=RateLimitedDirectoryWrapper(MockDirectoryWrapper(RAMDirectory@3f15a271 lockFactory=org.apache.lucene.store.SingleInstanceLockFactory@21276b91)),segFN=segments_1,generation=1}
   [junit4]   2> 1941687 T5895 oasc.SolrDeletionPolicy.updateCommits newest commit generation = 1
   [junit4]   2> 1941688 T5895 oass.SolrIndexSearcher.<init> Opening Searcher@236241f2[collection1] main
   [junit4]   2> 1941688 T5895 oasr.RestManager.init Initializing RestManager with initArgs: {storageIO=org.apache.solr.rest.ManagedResourceStorage$InMemoryStorageIO}
   [junit4]   2> 1941688 T5895 oasr.ManagedResourceStorage.load Reading _rest_managed.json using InMemoryStorage
   [junit4]   2> 1941688 T5895 oasr.ManagedResource.reloadFromStorage WARN No stored data found for /rest/managed
   [junit4]   2> 1941689 T5895 oasr.ManagedResourceStorage$JsonStorage.store Saved JSON object to path _rest_managed.json using InMemoryStorage
   [junit4]   2> 1941689 T5895 oasr.RestManager.init Initializing 0 registered ManagedResources
   [junit4]   2> 1941689 T5895 oashc.SpellCheckComponent.inform Initializing spell checkers
   [junit4]   2> 1941707 T5895 oass.DirectSolrSpellChecker.init init: {name=direct,classname=DirectSolrSpellChecker,field=lowerfilt,minQueryLength=3}
   [junit4]   2> 1941753 T5895 oash.ReplicationHandler.inform Commits will be reserved for  10000
   [junit4]   2> 1941754 T5895 oasc.CoreContainer.registerCore registering core: collection1
   [junit4]   2> 1941754 T5896 oasc.SolrCore.registerSearcher [collection1] Registered new searcher Searcher@236241f2[collection1] main{ExitableDirectoryReader(UninvertingDirectoryReader())}
   [junit4]   2> 1941757 T5894 oas.SolrTestCaseJ4.initCore ####initCore end
   [junit4]   2> 1941764 T5894 oas.SolrTestCaseJ4.setUp ###Starting testVariableFragsize
   [junit4]   2> ASYNC  NEW_CORE C2819 name=collection1 org.apache.solr.core.SolrCore@28147382
   [junit4]   2> 1941768 T5894 C2819 oasup.LogUpdateProcessor.finish [collection1] webapp=null path=null params={} {add=[1 (1486155379580600320)]} 0 4
   [junit4]   2> 1941772 T5894 C2819 oasu.DirectUpdateHandler2.commit start commit{,optimize=false,openSearcher=true,waitSearcher=true,expungeDeletes=false,softCommit=false,prepareCommit=false}
   [junit4]   2> 1941778 T5894 C2819 oasc.SolrDeletionPolicy.onCommit SolrDeletionPolicy.onCommit: commits: num=2
   [junit4]   2> 		commit{dir=RateLimitedDirectoryWrapper(MockDirectoryWrapper(RAMDirectory@3f15a271 lockFactory=org.apache.lucene.store.SingleInstanceLockFactory@21276b91)),segFN=segments_1,generation=1}
   [junit4]   2> 		commit{dir=RateLimitedDirectoryWrapper(MockDirectoryWrapper(RAMDirectory@3f15a271 lockFactory=org.apache.lucene.store.SingleInstanceLockFactory@21276b91)),segFN=segments_2,generation=2}
   [junit4]   2> 1941779 T5894 C2819 oasc.SolrDeletionPolicy.updateCommits newest commit generation = 2
   [junit4]   2> 1941783 T5894 C2819 oass.SolrIndexSearcher.<init> Opening Searcher@19c8fccc[collection1] main
   [junit4]   2> 1941783 T5894 C2819 oasu.DirectUpdateHandler2.commit end_commit_flush
   [junit4]   2> 1941785 T5896 oasc.SolrCore.registerSearcher [collection1] Registered new searcher Searcher@19c8fccc[collection1] main{ExitableDirectoryReader(UninvertingDirectoryReader(Uninverting(_0(6.0.0):c1)))}
   [junit4]   2> 1941785 T5894 C2819 oasup.LogUpdateProcessor.finish [collection1] webapp=null path=null params={} {commit=} 0 13
   [junit4]   2> 1941787 T5894 C2819 oasu.DirectUpdateHandler2.commit start commit{,optimize=true,openSearcher=true,waitSearcher=true,expungeDeletes=false,softCommit=false,prepareCommit=false}
   [junit4]   2> 1941798 T5894 C2819 oasc.SolrDeletionPolicy.onCommit SolrDeletionPolicy.onCommit: commits: num=2
   [junit4]   2> 		commit{dir=RateLimitedDirectoryWrapper(MockDirectoryWrapper(RAMDirectory@3f15a271 lockFactory=org.apache.lucene.store.SingleInstanceLockFactory@21276b91)),segFN=segments_2,generation=2}
   [junit4]   2> 		commit{dir=RateLimitedDirectoryWrapper(MockDirectoryWrapper(RAMDirectory@3f15a271 lockFactory=org.apache.lucene.store.SingleInstanceLockFactory@21276b91)),segFN=segments_3,generation=3}
   [junit4]   2> 1941798 T5894 C2819 oasc.SolrDeletionPolicy.updateCommits newest commit generation = 3
   [junit4]   2> 1941801 T5894 C2819 oass.SolrIndexSearcher.<init> Opening Searcher@109ef7a[collection1] main
   [junit4]   2> 1941801 T5894 C2819 oasu.DirectUpdateHandler2.commit end_commit_flush
   [junit4]   2> 1941804 T5896 oasc.SolrCore.registerSearcher [collection1] Registered new searcher Searcher@109ef7a[collection1] main{ExitableDirectoryReader(UninvertingDirectoryReader(Uninverting(_1(6.0.0):C1)))}
   [junit4]   2> 1941828 T5894 C2819 oasup.LogUpdateProcessor.finish [collection1] webapp=null path=null params={} {optimize=} 0 43
   [junit4]   2> 1941845 T5894 C2819 oasc.SolrCore.execute [collection1] webapp=null path=null params={q=tv_text:long&qt=standard&hl=true&start=0&hl.fl=tv_text&rows=200} hits=1 status=0 QTime=16 
   [junit4]   2> 1941847 T5894 oas.SolrTestCaseJ4.assertQ ERROR REQUEST FAILED: xpath=//lst[@name='1']/arr[@name='tv_text']/str[.='a <em>long</em> days night this should be a piece of text which']
   [junit4]   2> 		xml response was: <?xml version="1.0" encoding="UTF-8"?>
   [junit4]   2> 	<response>
   [junit4]   2> 	<lst name="responseHeader"><int name="status">0</int><int name="QTime">16</int></lst><result name="response" numFound="1" start="0"><doc><arr name="tv_text"><str>a long days night this should be a piece of text which is is is is is is is is is is is is is is is is is is is is is is is is isis is is is is is is is is is is is is is is is is is is is is is is is is is is is is is is is is is is is is is is is is is is is is is is is is is is is is is is is is is is is is is is is is is is is is is is is is is is sufficiently lengthly to produce multiple fragments which are not concatenated at all</str></arr><int name="id">1</int><arr name="range_facet_l"><long>1</long></arr><long name="_version_">1486155379580600320</long><arr name="multiDefault"><str>muLti-Default</str></arr><int name="intDefault">42</int><date name="timestamp">2014-11-30T00:43:35.695Z</date></doc></result><lst name="highlighting"><lst name="1"/></lst>
   [junit4]   2> 	</response>
   [junit4]   2> 	
   [junit4]   2> 		request was:q=tv_text:long&qt=standard&hl=true&start=0&hl.fl=tv_text&rows=200
   [junit4]   2> 1941852 T5894 oasc.SolrException.log ERROR REQUEST FAILED: q=tv_text:long&qt=standard&hl=true&start=0&hl.fl=tv_text&rows=200:java.lang.RuntimeException: REQUEST FAILED: xpath=//lst[@name='1']/arr[@name='tv_text']/str[.='a <em>long</em> days night this should be a piece of text which']
   [junit4]   2> 		xml response was: <?xml version="1.0" encoding="UTF-8"?>
   [junit4]   2> 	<response>
   [junit4]   2> 	<lst name="responseHeader"><int name="status">0</int><int name="QTime">16</int></lst><result name="response" numFound="1" start="0"><doc><arr name="tv_text"><str>a long days night this should be a piece of text which is is is is is is is is is is is is is is is is is is is is is is is is isis is is is is is is is is is is is is is is is is is is is is is is is is is is is is is is is is is is is is is is is is is is is is is is is is is is is is is is is is is is is is is is is is is is is is is is is is is is sufficiently lengthly to produce multiple fragments which are not concatenated at all</str></arr><int name="id">1</int><arr name="range_facet_l"><long>1</long></arr><long name="_version_">1486155379580600320</long><arr name="multiDefault"><str>muLti-Default</str></arr><int name="intDefault">42</int><date name="timestamp">2014-11-30T00:43:35.695Z</date></doc></result><lst name="highlighting"><lst name="1"/></lst>
   [junit4]   2> 	</response>
   [junit4]   2> 	
   [junit4]   2> 		request was:q=tv_text:long&qt=standard&hl=true&start=0&hl.fl=tv_text&rows=200
   [junit4]   2> 		at org.apache.solr.SolrTestCaseJ4.assertQ(SolrTestCaseJ4.java:722)
   [junit4]   2> 		at org.apache.solr.highlight.HighlighterTest.testVariableFragsize(HighlighterTest.java:592)
   [junit4]   2> 		at sun.reflect.NativeMethodAccessorImpl.invoke0(Native Method)
   [junit4]   2> 		at sun.reflect.NativeMethodAccessorImpl.invoke(NativeMethodAccessorImpl.java:62)
   [junit4]   2> 		at sun.reflect.DelegatingMethodAccessorImpl.invoke(DelegatingMethodAccessorImpl.java:43)
   [junit4]   2> 		at java.lang.reflect.Method.invoke(Method.java:483)
   [junit4]   2> 		at com.carrotsearch.randomizedtesting.RandomizedRunner.invoke(RandomizedRunner.java:1618)
   [junit4]   2> 		at com.carrotsearch.randomizedtesting.RandomizedRunner$6.evaluate(RandomizedRunner.java:827)
   [junit4]   2> 		at com.carrotsearch.randomizedtesting.RandomizedRunner$7.evaluate(RandomizedRunner.java:863)
   [junit4]   2> 		at com.carrotsearch.randomizedtesting.RandomizedRunner$8.evaluate(RandomizedRunner.java:877)
   [junit4]   2> 		at com.carrotsearch.randomizedtesting.rules.SystemPropertiesRestoreRule$1.evaluate(SystemPropertiesRestoreRule.java:53)
   [junit4]   2> 		at org.apache.lucene.util.TestRuleSetupTeardownChained$1.evaluate(TestRuleSetupTeardownChained.java:50)
   [junit4]   2> 		at org.apache.lucene.util.AbstractBeforeAfterRule$1.evaluate(AbstractBeforeAfterRule.java:46)
   [junit4]   2> 		at com.carrotsearch.randomizedtesting.rules.SystemPropertiesInvariantRule$1.evaluate(SystemPropertiesInvariantRule.java:55)
   [junit4]   2> 		at org.apache.lucene.util.TestRuleThreadAndTestName$1.evaluate(TestRuleThreadAndTestName.java:49)
   [junit4]   2> 		at org.apache.lucene.util.TestRuleIgnoreAfterMaxFailures$1.evaluate(TestRuleIgnoreAfterMaxFailures.java:65)
   [junit4]   2> 		at org.apache.lucene.util.TestRuleMarkFailure$1.evaluate(TestRuleMarkFailure.java:48)
   [junit4]   2> 		at com.carrotsearch.randomizedtesting.rules.StatementAdapter.evaluate(StatementAdapter.java:36)
   [junit4]   2> 		at com.carrotsearch.randomizedtesting.ThreadLeakControl$StatementRunner.run(ThreadLeakControl.java:365)
   [junit4]   2> 		at com.carrotsearch.randomizedtesting.ThreadLeakControl.forkTimeoutingTask(ThreadLeakControl.java:798)
   [junit4]   2> 		at com.carrotsearch.randomizedtesting.ThreadLeakControl$3.evaluate(ThreadLeakControl.java:458)
   [junit4]   2> 		at com.carrotsearch.randomizedtesting.RandomizedRunner.runSingleTest(RandomizedRunner.java:836)
   [junit4]   2> 		at com.carrotsearch.randomizedtesting.RandomizedRunner$3.evaluate(RandomizedRunner.java:738)
   [junit4]   2> 		at com.carrotsearch.randomizedtesting.RandomizedRunner$4.evaluate(RandomizedRunner.java:772)
   [junit4]   2> 		at com.carrotsearch.randomizedtesting.RandomizedRunner$5.evaluate(RandomizedRunner.java:783)
   [junit4]   2> 		at com.carrotsearch.randomizedtesting.rules.StatementAdapter.evaluate(StatementAdapter.java:36)
   [junit4]   2> 		at com.carrotsearch.randomizedtesting.rules.SystemPropertiesRestoreRule$1.evaluate(SystemPropertiesRestoreRule.java:53)
   [junit4]   2> 		at org.apache.lucene.util.AbstractBeforeAfterRule$1.evaluate(AbstractBeforeAfterRule.java:46)
   [junit4]   2> 		at org.apache.lucene.util.TestRuleStoreClassName$1.evaluate(TestRuleStoreClassName.java:42)
   [junit4]   2> 		at com.carrotsearch.randomizedtesting.rules.SystemPropertiesInvariantRule$1.evaluate(SystemPropertiesInvariantRule.java:55)
   [junit4]   2> 		at com.carrotsearch.randomizedtesting.rules.NoShadowingOrOverridesOnMethodsRule$1.evaluate(NoShadowingOrOverridesOnMethodsRule.java:39)
   [junit4]   2> 		at com.carrotsearch.randomizedtesting.rules.NoShadowingOrOverridesOnMethodsRule$1.evaluate(NoShadowingOrOverridesOnMethodsRule.java:39)
   [junit4]   2> 		at com.carrotsearch.randomizedtesting.rules.StatementAdapter.evaluate(StatementAdapter.java:36)
   [junit4]   2> 		at com.carrotsearch.randomizedtesting.rules.StatementAdapter.evaluate(StatementAdapter.java:36)
   [junit4]   2> 		at com.carrotsearch.randomizedtesting.rules.StatementAdapter.evaluate(StatementAdapter.java:36)
   [junit4]   2> 		at org.apache.lucene.util.TestRuleAssertionsRequired$1.evaluate(TestRuleAssertionsRequired.java:54)
   [junit4]   2> 		at org.apache.lucene.util.TestRuleMarkFailure$1.evaluate(TestRuleMarkFailure.java:48)
   [junit4]   2> 		at org.apache.lucene.util.TestRuleIgnoreAfterMaxFailures$1.evaluate(TestRuleIgnoreAfterMaxFailures.java:65)
   [junit4]   2> 		at org.apache.lucene.util.TestRuleIgnoreTestSuites$1.evaluate(TestRuleIgnoreTestSuites.java:55)
   [junit4]   2> 		at com.carrotsearch.randomizedtesting.rules.StatementAdapter.evaluate(StatementAdapter.java:36)
   [junit4]   2> 		at com.carrotsearch.randomizedtesting.ThreadLeakControl$StatementRunner.run(ThreadLeakControl.java:365)
   [junit4]   2> 		at java.lang.Thread.run(Thread.java:745)
   [junit4]   2> 	
   [junit4]   2> 1941856 T5894 C2819 oass.SolrIndexSearcher.<init> Opening Searcher@17a8bec2[collection1] realtime
   [junit4]   2> 1941856 T5894 C2819 oasup.LogUpdateProcessor.finish [collection1] webapp=null path=null params={} {deleteByQuery=*:* (-1486155379674972160)} 0 3
   [junit4]   2> 1941857 T5894 oas.SolrTestCaseJ4.tearDown ###Ending testVariableFragsize
   [junit4]   2> NOTE: reproduce with: ant test  -Dtestcase=HighlighterTest -Dtests.method=testVariableFragsize -Dtests.seed=5BFA450E44681472 -Dtests.slow=true -Dtests.locale=sr_BA -Dtests.timezone=Asia/Dacca -Dtests.asserts=true -Dtests.file.encoding=ISO-8859-1
   [junit4] ERROR   0.12s | HighlighterTest.testVariableFragsize <<<
   [junit4]    > Throwable #1: java.lang.RuntimeException: Exception during query
   [junit4]    > 	at __randomizedtesting.SeedInfo.seed([5BFA450E44681472:5CB6457FA6D6B8E0]:0)
   [junit4]    > 	at org.apache.solr.SolrTestCaseJ4.assertQ(SolrTestCaseJ4.java:729)
   [junit4]    > 	at org.apache.solr.highlight.HighlighterTest.testVariableFragsize(HighlighterTest.java:592)
   [junit4]    > 	at java.lang.Thread.run(Thread.java:745)
   [junit4]    > Caused by: java.lang.RuntimeException: REQUEST FAILED: xpath=//lst[@name='1']/arr[@name='tv_text']/str[.='a <em>long</em> days night this should be a piece of text which']
   [junit4]    > 	xml response was: <?xml version="1.0" encoding="UTF-8"?>
   [junit4]    > <response>
   [junit4]    > <lst name="responseHeader"><int name="status">0</int><int name="QTime">16</int></lst><result name="response" numFound="1" start="0"><doc><arr name="tv_text"><str>a long days night this should be a piece of text which is is is is is is is is is is is is is is is is is is is is is is is is isis is is is is is is is is is is is is is is is is is is is is is is is is is is is is is is is is is is is is is is is is is is is is is is is is is is is is is is is is is is is is is is is is is is is is is is is is is is sufficiently lengthly to produce multiple fragments which are not concatenated at all</str></arr><int name="id">1</int><arr name="range_facet_l"><long>1</long></arr><long name="_version_">1486155379580600320</long><arr name="multiDefault"><str>muLti-Default</str></arr><int name="intDefault">42</int><date name="timestamp">2014-11-30T00:43:35.695Z</date></doc></result><lst name="highlighting"><lst name="1"/></lst>
   [junit4]    > </response>
   [junit4]    > 	request was:q=tv_text:long&qt=standard&hl=true&start=0&hl.fl=tv_text&rows=200
   [junit4]    > 	at org.apache.solr.SolrTestCaseJ4.assertQ(SolrTestCaseJ4.java:722)
   [junit4]    > 	... 41 more
   [junit4]   2> 1941878 T5894 oas.SolrTestCaseJ4.setUp ###Starting testDefaultFieldNonPrefixWildcardHighlight
   [junit4]   2> 1941878 T5894 C2819 oasup.LogUpdateProcessor.finish [collection1] webapp=null path=null params={} {add=[1 (1486155379700137984)]} 0 0
   [junit4]   2> 1941880 T5894 C2819 oasu.DirectUpdateHandler2.commit start commit{,optimize=false,openSearcher=true,waitSearcher=true,expungeDeletes=false,softCommit=false,prepareCommit=false}
   [junit4]   2> 1941883 T5894 C2819 oasc.SolrDeletionPolicy.onCommit SolrDeletionPolicy.onCommit: commits: num=2
   [junit4]   2> 		commit{dir=RateLimitedDirectoryWrapper(MockDirectoryWrapper(RAMDirectory@3f15a271 lockFactory=org.apache.lucene.store.SingleInstanceLockFactory@21276b91)),segFN=segments_3,generation=3}
   [junit4]   2> 		commit{dir=RateLimitedDirectoryWrapper(MockDirectoryWrapper(RAMDirectory@3f15a271 lockFactory=org.apache.lucene.store.SingleInstanceLockFactory@21276b91)),segFN=segments_4,generation=4}
   [junit4]   2> 1941883 T5894 C2819 oasc.SolrDeletionPolicy.updateCommits newest commit generation = 4
   [junit4]   2> 1941886 T5894 C2819 oass.SolrIndexSearcher.<init> Opening Searcher@c7a09a1[collection1] main
   [junit4]   2> 1941886 T5894 C2819 oasu.DirectUpdateHandler2.commit end_commit_flush
   [junit4]   2> 1941889 T5896 oasc.SolrCore.registerSearcher [collection1] Registered new searcher Searcher@c7a09a1[collection1] main{ExitableDirectoryReader(UninvertingDirectoryReader(Uninverting(_2(6.0.0):c1)))}
   [junit4]   2> 1941889 T5894 C2819 oasup.LogUpdateProcessor.finish [collection1] webapp=null path=null params={} {commit=} 0 9
   [junit4]   2> 1941890 T5894 C2819 oasu.DirectUpdateHandler2.commit start commit{,optimize=true,openSearcher=true,waitSearcher=true,expungeDeletes=false,softCommit=false,prepareCommit=false}
   [junit4]   2> 1941895 T5894 C2819 oasc.SolrDeletionPolicy.onCommit SolrDeletionPolicy.onCommit: commits: num=2
   [junit4]   2> 		commit{dir=RateLimitedDirectoryWrapper(MockDirectoryWrapper(RAMDirectory@3f15a271 lockFactory=org.apache.lucene.store.SingleInstanceLockFactory@21276b91)),segFN=segments_4,generation=4}
   [junit4]   2> 		commit{dir=RateLimitedDirectoryWrapper(MockDirectoryWrapper(RAMDirectory@3f15a271 lockFactory=org.apache.lucene.store.SingleInstanceLockFactory@21276b91)),segFN=segments_5,generation=5}
   [junit4]   2> 1941895 T5894 C2819 oasc.SolrDeletionPolicy.updateCommits newest commit generation = 5
   [junit4]   2> 1941897 T5894 C2819 oass.SolrIndexSearcher.<init> Opening Searcher@1a31082f[collection1] main
   [junit4]   2> 1941897 T5894 C2819 oasu.DirectUpdateHandler2.commit end_commit_flush
   [junit4]   2> 1941899 T5896 oasc.SolrCore.registerSearcher [collection1] Registered new searcher Searcher@1a31082f[collection1] main{ExitableDirectoryReader(UninvertingDirectoryReader(Uninverting(_3(6.0.0):C1)))}
   [junit4]   2> 1941900 T5894 C2819 oasup.LogUpdateProcessor.finish [collection1] webapp=null path=null params={} {optimize=} 0 10
   [junit4]   2> 1941925 T5894 C2819 oasc.SolrCore.execute [collection1] webapp=null path=null params={q=l*g&df=t_text&qt=standard&hl=true&hl.usePhraseHighlighter=true&start=0&hl.fl=&rows=200&hl.highlightMultiTerm=true} hits=1 status=0 QTime=25 
   [junit4]   2> 1941929 T5894 C2819 oass.SolrIndexSearcher.<init> Opening Searcher@159f0cf2[collection1] realtime
   [junit4]   2> 1941929 T5894 C2819 oasup.LogUpdateProcessor.finish [collection1] webapp=null path=null params={} {deleteByQuery=*:* (-1486155379751518208)} 0 3
   [junit4]   2> 1941930 T5894 oas.SolrTestCaseJ4.tearDown ###Ending testDefaultFieldNonPrefixWildcardHighlight
   [junit4]   2> 1941937 T5894 oas.SolrTestCaseJ4.setUp ###Starting testMultiValueBestFragmentHighlight
   [junit4]   2> 1941938 T5894 C2819 oasup.LogUpdateProcessor.finish [collection1] webapp=null path=null params={} {add=[1 (1486155379762003968)]} 0 1
   [junit4]   2> 1941939 T5894 C2819 oasu.DirectUpdateHandler2.commit start commit{,optimize=false,openSearcher=true,waitSearcher=true,expungeDeletes=false,softCommit=false,prepareCommit=false}
   [junit4]   2> 1941941 T5894 C2819 oasc.SolrDeletionPolicy.onCommit SolrDeletionPolicy.onCommit: commits: num=2
   [junit4]   2> 		commit{dir=RateLimitedDirectoryWrapper(MockDirectoryWrapper(RAMDirectory@3f15a271 lockFactory=org.apache.lucene.store.SingleInstanceLockFactory@21276b91)),segFN=segments_5,generation=5}
   [junit4]   2> 		commit{dir=RateLimitedDirectoryWrapper(MockDirectoryWrapper(RAMDirectory@3f15a271 lockFactory=org.apache.lucene.store.SingleInstanceLockFactory@21276b91)),segFN=segments_6,generation=6}
   [junit4]   2> 1941942 T5894 C2819 oasc.SolrDeletionPolicy.updateCommits newest commit generation = 6
   [junit4]   2> 1941950 T5894 C2819 oass.SolrIndexSearcher.<init> Opening Searcher@30503509[collection1] main
   [junit4]   2> 1941950 

[...truncated too long message...]

faultMBeanServerInterceptor.java:415)
   [junit4]   2> 	at com.sun.jmx.mbeanserver.JmxMBeanServer.unregisterMBean(JmxMBeanServer.java:546)
   [junit4]   2> 	at org.apache.solr.core.JmxMonitoredMap.clear(JmxMonitoredMap.java:124)
   [junit4]   2> 	at org.apache.solr.core.SolrCore.close(SolrCore.java:1124)
   [junit4]   2> 	at org.apache.solr.core.SolrCores.close(SolrCores.java:117)
   [junit4]   2> 	at org.apache.solr.core.CoreContainer.shutdown(CoreContainer.java:365)
   [junit4]   2> 	at org.apache.solr.util.TestHarness.close(TestHarness.java:337)
   [junit4]   2> 	at org.apache.solr.SolrTestCaseJ4.deleteCore(SolrTestCaseJ4.java:640)
   [junit4]   2> 	at org.apache.solr.SolrTestCaseJ4.afterClass(SolrTestCaseJ4.java:185)
   [junit4]   2> 	at sun.reflect.GeneratedMethodAccessor53.invoke(Unknown Source)
   [junit4]   2> 	at sun.reflect.DelegatingMethodAccessorImpl.invoke(DelegatingMethodAccessorImpl.java:43)
   [junit4]   2> 	at java.lang.reflect.Method.invoke(Method.java:483)
   [junit4]   2> 	at com.carrotsearch.randomizedtesting.RandomizedRunner.invoke(RandomizedRunner.java:1618)
   [junit4]   2> 	at com.carrotsearch.randomizedtesting.RandomizedRunner$5.evaluate(RandomizedRunner.java:790)
   [junit4]   2> 	at com.carrotsearch.randomizedtesting.rules.StatementAdapter.evaluate(StatementAdapter.java:36)
   [junit4]   2> 	at com.carrotsearch.randomizedtesting.rules.SystemPropertiesRestoreRule$1.evaluate(SystemPropertiesRestoreRule.java:53)
   [junit4]   2> 	at org.apache.lucene.util.AbstractBeforeAfterRule$1.evaluate(AbstractBeforeAfterRule.java:46)
   [junit4]   2> 	at org.apache.lucene.util.TestRuleStoreClassName$1.evaluate(TestRuleStoreClassName.java:42)
   [junit4]   2> 	at com.carrotsearch.randomizedtesting.rules.SystemPropertiesInvariantRule$1.evaluate(SystemPropertiesInvariantRule.java:55)
   [junit4]   2> 	at com.carrotsearch.randomizedtesting.rules.NoShadowingOrOverridesOnMethodsRule$1.evaluate(NoShadowingOrOverridesOnMethodsRule.java:39)
   [junit4]   2> 	at com.carrotsearch.randomizedtesting.rules.NoShadowingOrOverridesOnMethodsRule$1.evaluate(NoShadowingOrOverridesOnMethodsRule.java:39)
   [junit4]   2> 	at com.carrotsearch.randomizedtesting.rules.StatementAdapter.evaluate(StatementAdapter.java:36)
   [junit4]   2> 	at com.carrotsearch.randomizedtesting.rules.StatementAdapter.evaluate(StatementAdapter.java:36)
   [junit4]   2> 	at com.carrotsearch.randomizedtesting.rules.StatementAdapter.evaluate(StatementAdapter.java:36)
   [junit4]   2> 	at org.apache.lucene.util.TestRuleAssertionsRequired$1.evaluate(TestRuleAssertionsRequired.java:54)
   [junit4]   2> 	at org.apache.lucene.util.TestRuleMarkFailure$1.evaluate(TestRuleMarkFailure.java:48)
   [junit4]   2> 	at org.apache.lucene.util.TestRuleIgnoreAfterMaxFailures$1.evaluate(TestRuleIgnoreAfterMaxFailures.java:65)
   [junit4]   2> 	at org.apache.lucene.util.TestRuleIgnoreTestSuites$1.evaluate(TestRuleIgnoreTestSuites.java:55)
   [junit4]   2> 	at com.carrotsearch.randomizedtesting.rules.StatementAdapter.evaluate(StatementAdapter.java:36)
   [junit4]   2> 	at com.carrotsearch.randomizedtesting.ThreadLeakControl$StatementRunner.run(ThreadLeakControl.java:365)
   [junit4]   2> 	at java.lang.Thread.run(Thread.java:745)
   [junit4]   2> 
   [junit4]   2> 1944187 T5894 oasc.CachingDirectoryFactory.close Closing MockDirectoryFactory - 2 directories currently being tracked
   [junit4]   2> 1944188 T5894 oasc.CachingDirectoryFactory.closeCacheValue looking to close /Users/jenkins/workspace/Lucene-Solr-trunk-MacOSX/solr/build/solr-core/test/J0/temp/solr.highlight.HighlighterTest-5BFA450E44681472-001/init-core-data-001 [CachedDir<<refCount=0;path=/Users/jenkins/workspace/Lucene-Solr-trunk-MacOSX/solr/build/solr-core/test/J0/temp/solr.highlight.HighlighterTest-5BFA450E44681472-001/init-core-data-001;done=false>>]
   [junit4]   2> 1944189 T5894 oasc.CachingDirectoryFactory.close Closing directory: /Users/jenkins/workspace/Lucene-Solr-trunk-MacOSX/solr/build/solr-core/test/J0/temp/solr.highlight.HighlighterTest-5BFA450E44681472-001/init-core-data-001
   [junit4]   2> 1944189 T5894 oasc.CachingDirectoryFactory.closeCacheValue looking to close /Users/jenkins/workspace/Lucene-Solr-trunk-MacOSX/solr/build/solr-core/test/J0/temp/solr.highlight.HighlighterTest-5BFA450E44681472-001/init-core-data-001/index [CachedDir<<refCount=0;path=/Users/jenkins/workspace/Lucene-Solr-trunk-MacOSX/solr/build/solr-core/test/J0/temp/solr.highlight.HighlighterTest-5BFA450E44681472-001/init-core-data-001/index;done=false>>]
   [junit4]   2> 1944189 T5894 oasc.CachingDirectoryFactory.close Closing directory: /Users/jenkins/workspace/Lucene-Solr-trunk-MacOSX/solr/build/solr-core/test/J0/temp/solr.highlight.HighlighterTest-5BFA450E44681472-001/init-core-data-001/index
   [junit4]   2> NOTE: leaving temporary files on disk at: /Users/jenkins/workspace/Lucene-Solr-trunk-MacOSX/solr/build/solr-core/test/J0/temp/solr.highlight.HighlighterTest-5BFA450E44681472-001
   [junit4]   2> NOTE: test params are: codec=Asserting(Lucene50): {subword_offsets=PostingsFormat(name=LuceneVarGapFixedInterval), multiDefault=PostingsFormat(name=Memory doPackFST= true), intDefault=PostingsFormat(name=Memory doPackFST= false), title=PostingsFormat(name=Memory doPackFST= true), tv_no_off_text=PostingsFormat(name=Memory doPackFST= false), range_facet_l=PostingsFormat(name=Memory doPackFST= false), foo_sI=PostingsFormat(name=LuceneVarGapFixedInterval), tv_text=PostingsFormat(name=Memory doPackFST= false), cat=PostingsFormat(name=Memory doPackFST= false), t_text1=BlockTreeOrds(blocksize=128), id=BlockTreeOrds(blocksize=128), text=PostingsFormat(name=LuceneVarGapFixedInterval), t_text2=PostingsFormat(name=Memory doPackFST= false), timestamp=PostingsFormat(name=Memory doPackFST= false), weight=PostingsFormat(name=Memory doPackFST= true), foo_t=BlockTreeOrds(blocksize=128), foo_s=PostingsFormat(name=Memory doPackFST= false), title_lettertok=BlockTreeOrds(blocksize=128), tv_mv_text=PostingsFormat(name=Memory doPackFST= false), title_stringNoNorms=PostingsFormat(name=Memory doPackFST= false), textgap=BlockTreeOrds(blocksize=128), _version_=PostingsFormat(name=Memory doPackFST= false), title_stemmed=PostingsFormat(name=Memory doPackFST= true), subword=PostingsFormat(name=Memory doPackFST= false), t_text=PostingsFormat(name=Memory doPackFST= true)}, docValues:{timestamp=DocValuesFormat(name=Lucene50)}, sim=DefaultSimilarity, locale=sr_BA, timezone=Asia/Dacca
   [junit4]   2> NOTE: Mac OS X 10.8.5 x86_64/Oracle Corporation 1.8.0_20 (64-bit)/cpus=2,threads=1,free=227073960,total=515899392
   [junit4]   2> NOTE: All tests run in this JVM: [DocExpirationUpdateProcessorFactoryTest, BasicDistributedZkTest, TestStressUserVersions, DistributedTermsComponentTest, ScriptEngineTest, DocumentBuilderTest, TestFunctionQuery, AssignTest, TestIndexingPerformance, SpellCheckCollatorTest, TestDefaultSimilarityFactory, MoreLikeThisHandlerTest, ChangedSchemaMergeTest, TestInitQParser, FullSolrCloudDistribCmdsTest, TestHighFrequencyDictionaryFactory, MergeStrategyTest, DateFieldTest, RollingRestartTest, HardAutoCommitTest, SimpleCollectionCreateDeleteTest, PathHierarchyTokenizerFactoryTest, TestCloudManagedSchemaConcurrent, TestCloudManagedSchema, TestPHPSerializedResponseWriter, SimpleMLTQParserTest, StandardRequestHandlerTest, TestSearchPerf, DateRangeFieldTest, CachingDirectoryFactoryTest, RemoteQueryErrorTest, TestShardHandlerFactory, TriLevelCompositeIdRoutingTest, TestSolrQueryParserDefaultOperatorResource, DistributedQueueTest, TestHashPartitioner, TestUpdate, CoreAdminCreateDiscoverTest, AsyncMigrateRouteKeyTest, DebugComponentTest, TermVectorComponentDistributedTest, TestConfigReload, LoggingHandlerTest, HdfsSyncSliceTest, TestJoin, CollectionsAPIAsyncDistributedZkTest, LeaderFailoverAfterPartitionTest, HdfsLockFactoryTest, FileBasedSpellCheckerTest, AddBlockUpdateTest, TestSort, SharedFSAutoReplicaFailoverUtilsTest, TestCopyFieldCollectionResource, SolrIndexSplitterTest, HighlighterConfigTest, TestStressVersions, TestLMJelinekMercerSimilarityFactory, BadComponentTest, QueryParsingTest, FileUtilsTest, TestGroupingSearch, ExternalCollectionsTest, PreAnalyzedFieldTest, TestComplexPhraseQParserPlugin, TestSystemIdResolver, ParsingFieldUpdateProcessorsTest, TestSchemaSimilarityResource, RAMDirectoryFactoryTest, SimpleFacetsTest, MultiThreadedOCPTest, OpenCloseCoreStressTest, AddSchemaFieldsUpdateProcessorFactoryTest, CollectionsAPIDistributedZkTest, HdfsBasicDistributedZk2Test, HighlighterTest]
   [junit4] Completed in 3.14s, 31 tests, 9 errors <<< FAILURES!

[...truncated 1174 lines...]
BUILD FAILED
/Users/jenkins/workspace/Lucene-Solr-trunk-MacOSX/build.xml:515: The following error occurred while executing this line:
/Users/jenkins/workspace/Lucene-Solr-trunk-MacOSX/build.xml:463: The following error occurred while executing this line:
/Users/jenkins/workspace/Lucene-Solr-trunk-MacOSX/build.xml:61: The following error occurred while executing this line:
/Users/jenkins/workspace/Lucene-Solr-trunk-MacOSX/extra-targets.xml:39: The following error occurred while executing this line:
/Users/jenkins/workspace/Lucene-Solr-trunk-MacOSX/solr/build.xml:186: The following error occurred while executing this line:
/Users/jenkins/workspace/Lucene-Solr-trunk-MacOSX/solr/common-build.xml:510: The following error occurred while executing this line:
/Users/jenkins/workspace/Lucene-Solr-trunk-MacOSX/lucene/common-build.xml:1349: The following error occurred while executing this line:
/Users/jenkins/workspace/Lucene-Solr-trunk-MacOSX/lucene/common-build.xml:956: There were test failures: 451 suites, 1840 tests, 9 errors, 37 ignored (21 assumptions)

Total time: 171 minutes 53 seconds
Build step 'Invoke Ant' marked build as failure
[description-setter] Description set: Java: 64bit/jdk1.8.0 -XX:-UseCompressedOops -XX:+UseG1GC (asserts: true)
Archiving artifacts
Recording test results
Email was triggered for: Failure - Any
Sending email for trigger: Failure - Any



Mime
View raw message