lucene-dev mailing list archives

Site index · List index
Message view « Date » · « Thread »
Top « Date » · « Thread »
From Policeman Jenkins Server <jenk...@thetaphi.de>
Subject [JENKINS] Lucene-Solr-trunk-Windows (32bit/jdk1.8.0_20) - Build # 4457 - Still Failing!
Date Fri, 28 Nov 2014 22:21:38 GMT
Build: http://jenkins.thetaphi.de/job/Lucene-Solr-trunk-Windows/4457/
Java: 32bit/jdk1.8.0_20 -server -XX:+UseParallelGC (asserts: true)

9 tests failed.
FAILED:  org.apache.solr.highlight.HighlighterTest.testSubwordWildcardHighlightWithTermOffsets2

Error Message:
Exception during query

Stack Trace:
java.lang.RuntimeException: Exception during query
	at __randomizedtesting.SeedInfo.seed([4EDD8F1920324033:7C7ED490E09EBA5D]:0)
	at org.apache.solr.SolrTestCaseJ4.assertQ(SolrTestCaseJ4.java:729)
	at org.apache.solr.highlight.HighlighterTest.testSubwordWildcardHighlightWithTermOffsets2(HighlighterTest.java:843)
	at sun.reflect.NativeMethodAccessorImpl.invoke0(Native Method)
	at sun.reflect.NativeMethodAccessorImpl.invoke(NativeMethodAccessorImpl.java:62)
	at sun.reflect.DelegatingMethodAccessorImpl.invoke(DelegatingMethodAccessorImpl.java:43)
	at java.lang.reflect.Method.invoke(Method.java:483)
	at com.carrotsearch.randomizedtesting.RandomizedRunner.invoke(RandomizedRunner.java:1618)
	at com.carrotsearch.randomizedtesting.RandomizedRunner$6.evaluate(RandomizedRunner.java:827)
	at com.carrotsearch.randomizedtesting.RandomizedRunner$7.evaluate(RandomizedRunner.java:863)
	at com.carrotsearch.randomizedtesting.RandomizedRunner$8.evaluate(RandomizedRunner.java:877)
	at com.carrotsearch.randomizedtesting.rules.SystemPropertiesRestoreRule$1.evaluate(SystemPropertiesRestoreRule.java:53)
	at org.apache.lucene.util.TestRuleSetupTeardownChained$1.evaluate(TestRuleSetupTeardownChained.java:50)
	at org.apache.lucene.util.AbstractBeforeAfterRule$1.evaluate(AbstractBeforeAfterRule.java:46)
	at com.carrotsearch.randomizedtesting.rules.SystemPropertiesInvariantRule$1.evaluate(SystemPropertiesInvariantRule.java:55)
	at org.apache.lucene.util.TestRuleThreadAndTestName$1.evaluate(TestRuleThreadAndTestName.java:49)
	at org.apache.lucene.util.TestRuleIgnoreAfterMaxFailures$1.evaluate(TestRuleIgnoreAfterMaxFailures.java:65)
	at org.apache.lucene.util.TestRuleMarkFailure$1.evaluate(TestRuleMarkFailure.java:48)
	at com.carrotsearch.randomizedtesting.rules.StatementAdapter.evaluate(StatementAdapter.java:36)
	at com.carrotsearch.randomizedtesting.ThreadLeakControl$StatementRunner.run(ThreadLeakControl.java:365)
	at com.carrotsearch.randomizedtesting.ThreadLeakControl.forkTimeoutingTask(ThreadLeakControl.java:798)
	at com.carrotsearch.randomizedtesting.ThreadLeakControl$3.evaluate(ThreadLeakControl.java:458)
	at com.carrotsearch.randomizedtesting.RandomizedRunner.runSingleTest(RandomizedRunner.java:836)
	at com.carrotsearch.randomizedtesting.RandomizedRunner$3.evaluate(RandomizedRunner.java:738)
	at com.carrotsearch.randomizedtesting.RandomizedRunner$4.evaluate(RandomizedRunner.java:772)
	at com.carrotsearch.randomizedtesting.RandomizedRunner$5.evaluate(RandomizedRunner.java:783)
	at com.carrotsearch.randomizedtesting.rules.StatementAdapter.evaluate(StatementAdapter.java:36)
	at com.carrotsearch.randomizedtesting.rules.SystemPropertiesRestoreRule$1.evaluate(SystemPropertiesRestoreRule.java:53)
	at org.apache.lucene.util.AbstractBeforeAfterRule$1.evaluate(AbstractBeforeAfterRule.java:46)
	at org.apache.lucene.util.TestRuleStoreClassName$1.evaluate(TestRuleStoreClassName.java:42)
	at com.carrotsearch.randomizedtesting.rules.SystemPropertiesInvariantRule$1.evaluate(SystemPropertiesInvariantRule.java:55)
	at com.carrotsearch.randomizedtesting.rules.NoShadowingOrOverridesOnMethodsRule$1.evaluate(NoShadowingOrOverridesOnMethodsRule.java:39)
	at com.carrotsearch.randomizedtesting.rules.NoShadowingOrOverridesOnMethodsRule$1.evaluate(NoShadowingOrOverridesOnMethodsRule.java:39)
	at com.carrotsearch.randomizedtesting.rules.StatementAdapter.evaluate(StatementAdapter.java:36)
	at com.carrotsearch.randomizedtesting.rules.StatementAdapter.evaluate(StatementAdapter.java:36)
	at com.carrotsearch.randomizedtesting.rules.StatementAdapter.evaluate(StatementAdapter.java:36)
	at org.apache.lucene.util.TestRuleAssertionsRequired$1.evaluate(TestRuleAssertionsRequired.java:54)
	at org.apache.lucene.util.TestRuleMarkFailure$1.evaluate(TestRuleMarkFailure.java:48)
	at org.apache.lucene.util.TestRuleIgnoreAfterMaxFailures$1.evaluate(TestRuleIgnoreAfterMaxFailures.java:65)
	at org.apache.lucene.util.TestRuleIgnoreTestSuites$1.evaluate(TestRuleIgnoreTestSuites.java:55)
	at com.carrotsearch.randomizedtesting.rules.StatementAdapter.evaluate(StatementAdapter.java:36)
	at com.carrotsearch.randomizedtesting.ThreadLeakControl$StatementRunner.run(ThreadLeakControl.java:365)
	at java.lang.Thread.run(Thread.java:745)
Caused by: java.lang.RuntimeException: REQUEST FAILED: xpath=//lst[@name='highlighting']/lst[@name='1']/arr[@name='subword_offsets']/str='lorem <em>PowerShot</em> ipsum'
	xml response was: <?xml version="1.0" encoding="UTF-8"?>
<response>
<lst name="responseHeader"><int name="status">0</int><int name="QTime">1</int></lst><result name="response" numFound="1" start="0"><doc><arr name="subword_offsets"><str>lorem PowerShot ipsum</str></arr><int name="id">1</int><arr name="range_facet_l"><long>1</long></arr><long name="_version_">1486053540694589440</long><arr name="multiDefault"><str>muLti-Default</str></arr><int name="intDefault">42</int><date name="timestamp">2014-11-28T21:44:54.564Z</date></doc></result><lst name="highlighting"><lst name="1"/></lst>
</response>

	request was:q=subword_offsets:pow*&hl=true&hl.fl=subword_offsets&wt=xml
	at org.apache.solr.SolrTestCaseJ4.assertQ(SolrTestCaseJ4.java:722)
	... 41 more


FAILED:  org.apache.solr.highlight.HighlighterTest.testDisMaxHighlight

Error Message:
Exception during query

Stack Trace:
java.lang.RuntimeException: Exception during query
	at __randomizedtesting.SeedInfo.seed([4EDD8F1920324033:5475A09D61ECB1A2]:0)
	at org.apache.solr.SolrTestCaseJ4.assertQ(SolrTestCaseJ4.java:729)
	at org.apache.solr.highlight.HighlighterTest.testDisMaxHighlight(HighlighterTest.java:262)
	at sun.reflect.NativeMethodAccessorImpl.invoke0(Native Method)
	at sun.reflect.NativeMethodAccessorImpl.invoke(NativeMethodAccessorImpl.java:62)
	at sun.reflect.DelegatingMethodAccessorImpl.invoke(DelegatingMethodAccessorImpl.java:43)
	at java.lang.reflect.Method.invoke(Method.java:483)
	at com.carrotsearch.randomizedtesting.RandomizedRunner.invoke(RandomizedRunner.java:1618)
	at com.carrotsearch.randomizedtesting.RandomizedRunner$6.evaluate(RandomizedRunner.java:827)
	at com.carrotsearch.randomizedtesting.RandomizedRunner$7.evaluate(RandomizedRunner.java:863)
	at com.carrotsearch.randomizedtesting.RandomizedRunner$8.evaluate(RandomizedRunner.java:877)
	at com.carrotsearch.randomizedtesting.rules.SystemPropertiesRestoreRule$1.evaluate(SystemPropertiesRestoreRule.java:53)
	at org.apache.lucene.util.TestRuleSetupTeardownChained$1.evaluate(TestRuleSetupTeardownChained.java:50)
	at org.apache.lucene.util.AbstractBeforeAfterRule$1.evaluate(AbstractBeforeAfterRule.java:46)
	at com.carrotsearch.randomizedtesting.rules.SystemPropertiesInvariantRule$1.evaluate(SystemPropertiesInvariantRule.java:55)
	at org.apache.lucene.util.TestRuleThreadAndTestName$1.evaluate(TestRuleThreadAndTestName.java:49)
	at org.apache.lucene.util.TestRuleIgnoreAfterMaxFailures$1.evaluate(TestRuleIgnoreAfterMaxFailures.java:65)
	at org.apache.lucene.util.TestRuleMarkFailure$1.evaluate(TestRuleMarkFailure.java:48)
	at com.carrotsearch.randomizedtesting.rules.StatementAdapter.evaluate(StatementAdapter.java:36)
	at com.carrotsearch.randomizedtesting.ThreadLeakControl$StatementRunner.run(ThreadLeakControl.java:365)
	at com.carrotsearch.randomizedtesting.ThreadLeakControl.forkTimeoutingTask(ThreadLeakControl.java:798)
	at com.carrotsearch.randomizedtesting.ThreadLeakControl$3.evaluate(ThreadLeakControl.java:458)
	at com.carrotsearch.randomizedtesting.RandomizedRunner.runSingleTest(RandomizedRunner.java:836)
	at com.carrotsearch.randomizedtesting.RandomizedRunner$3.evaluate(RandomizedRunner.java:738)
	at com.carrotsearch.randomizedtesting.RandomizedRunner$4.evaluate(RandomizedRunner.java:772)
	at com.carrotsearch.randomizedtesting.RandomizedRunner$5.evaluate(RandomizedRunner.java:783)
	at com.carrotsearch.randomizedtesting.rules.StatementAdapter.evaluate(StatementAdapter.java:36)
	at com.carrotsearch.randomizedtesting.rules.SystemPropertiesRestoreRule$1.evaluate(SystemPropertiesRestoreRule.java:53)
	at org.apache.lucene.util.AbstractBeforeAfterRule$1.evaluate(AbstractBeforeAfterRule.java:46)
	at org.apache.lucene.util.TestRuleStoreClassName$1.evaluate(TestRuleStoreClassName.java:42)
	at com.carrotsearch.randomizedtesting.rules.SystemPropertiesInvariantRule$1.evaluate(SystemPropertiesInvariantRule.java:55)
	at com.carrotsearch.randomizedtesting.rules.NoShadowingOrOverridesOnMethodsRule$1.evaluate(NoShadowingOrOverridesOnMethodsRule.java:39)
	at com.carrotsearch.randomizedtesting.rules.NoShadowingOrOverridesOnMethodsRule$1.evaluate(NoShadowingOrOverridesOnMethodsRule.java:39)
	at com.carrotsearch.randomizedtesting.rules.StatementAdapter.evaluate(StatementAdapter.java:36)
	at com.carrotsearch.randomizedtesting.rules.StatementAdapter.evaluate(StatementAdapter.java:36)
	at com.carrotsearch.randomizedtesting.rules.StatementAdapter.evaluate(StatementAdapter.java:36)
	at org.apache.lucene.util.TestRuleAssertionsRequired$1.evaluate(TestRuleAssertionsRequired.java:54)
	at org.apache.lucene.util.TestRuleMarkFailure$1.evaluate(TestRuleMarkFailure.java:48)
	at org.apache.lucene.util.TestRuleIgnoreAfterMaxFailures$1.evaluate(TestRuleIgnoreAfterMaxFailures.java:65)
	at org.apache.lucene.util.TestRuleIgnoreTestSuites$1.evaluate(TestRuleIgnoreTestSuites.java:55)
	at com.carrotsearch.randomizedtesting.rules.StatementAdapter.evaluate(StatementAdapter.java:36)
	at com.carrotsearch.randomizedtesting.ThreadLeakControl$StatementRunner.run(ThreadLeakControl.java:365)
	at java.lang.Thread.run(Thread.java:745)
Caused by: java.lang.RuntimeException: REQUEST FAILED: xpath=//lst[@name='1']/arr[@name='tv_text']/str
	xml response was: <?xml version="1.0" encoding="UTF-8"?>
<response>
<lst name="responseHeader"><int name="status">0</int><int name="QTime">2</int></lst><result name="response" numFound="1" start="0"><doc><arr name="tv_text"><str>a long day's night</str></arr><int name="id">1</int><arr name="range_facet_l"><long>1</long></arr><long name="_version_">1486053540792107008</long><arr name="multiDefault"><str>muLti-Default</str></arr><int name="intDefault">42</int><date name="timestamp">2014-11-28T21:44:54.657Z</date></doc></result><lst name="highlighting"><lst name="1"/></lst>
</response>

	request was:q=long&q.alt=*:*&qt=dismax&hl=true&qf=tv_text&start=0&hl.fl=tv_text&rows=200
	at org.apache.solr.SolrTestCaseJ4.assertQ(SolrTestCaseJ4.java:722)
	... 41 more


FAILED:  org.apache.solr.highlight.HighlighterTest.testTermVecMultiValuedHighlight

Error Message:
Exception during query

Stack Trace:
java.lang.RuntimeException: Exception during query
	at __randomizedtesting.SeedInfo.seed([4EDD8F1920324033:E4838B7595D8542B]:0)
	at org.apache.solr.SolrTestCaseJ4.assertQ(SolrTestCaseJ4.java:729)
	at org.apache.solr.highlight.HighlighterTest.testTermVecMultiValuedHighlight(HighlighterTest.java:211)
	at sun.reflect.NativeMethodAccessorImpl.invoke0(Native Method)
	at sun.reflect.NativeMethodAccessorImpl.invoke(NativeMethodAccessorImpl.java:62)
	at sun.reflect.DelegatingMethodAccessorImpl.invoke(DelegatingMethodAccessorImpl.java:43)
	at java.lang.reflect.Method.invoke(Method.java:483)
	at com.carrotsearch.randomizedtesting.RandomizedRunner.invoke(RandomizedRunner.java:1618)
	at com.carrotsearch.randomizedtesting.RandomizedRunner$6.evaluate(RandomizedRunner.java:827)
	at com.carrotsearch.randomizedtesting.RandomizedRunner$7.evaluate(RandomizedRunner.java:863)
	at com.carrotsearch.randomizedtesting.RandomizedRunner$8.evaluate(RandomizedRunner.java:877)
	at com.carrotsearch.randomizedtesting.rules.SystemPropertiesRestoreRule$1.evaluate(SystemPropertiesRestoreRule.java:53)
	at org.apache.lucene.util.TestRuleSetupTeardownChained$1.evaluate(TestRuleSetupTeardownChained.java:50)
	at org.apache.lucene.util.AbstractBeforeAfterRule$1.evaluate(AbstractBeforeAfterRule.java:46)
	at com.carrotsearch.randomizedtesting.rules.SystemPropertiesInvariantRule$1.evaluate(SystemPropertiesInvariantRule.java:55)
	at org.apache.lucene.util.TestRuleThreadAndTestName$1.evaluate(TestRuleThreadAndTestName.java:49)
	at org.apache.lucene.util.TestRuleIgnoreAfterMaxFailures$1.evaluate(TestRuleIgnoreAfterMaxFailures.java:65)
	at org.apache.lucene.util.TestRuleMarkFailure$1.evaluate(TestRuleMarkFailure.java:48)
	at com.carrotsearch.randomizedtesting.rules.StatementAdapter.evaluate(StatementAdapter.java:36)
	at com.carrotsearch.randomizedtesting.ThreadLeakControl$StatementRunner.run(ThreadLeakControl.java:365)
	at com.carrotsearch.randomizedtesting.ThreadLeakControl.forkTimeoutingTask(ThreadLeakControl.java:798)
	at com.carrotsearch.randomizedtesting.ThreadLeakControl$3.evaluate(ThreadLeakControl.java:458)
	at com.carrotsearch.randomizedtesting.RandomizedRunner.runSingleTest(RandomizedRunner.java:836)
	at com.carrotsearch.randomizedtesting.RandomizedRunner$3.evaluate(RandomizedRunner.java:738)
	at com.carrotsearch.randomizedtesting.RandomizedRunner$4.evaluate(RandomizedRunner.java:772)
	at com.carrotsearch.randomizedtesting.RandomizedRunner$5.evaluate(RandomizedRunner.java:783)
	at com.carrotsearch.randomizedtesting.rules.StatementAdapter.evaluate(StatementAdapter.java:36)
	at com.carrotsearch.randomizedtesting.rules.SystemPropertiesRestoreRule$1.evaluate(SystemPropertiesRestoreRule.java:53)
	at org.apache.lucene.util.AbstractBeforeAfterRule$1.evaluate(AbstractBeforeAfterRule.java:46)
	at org.apache.lucene.util.TestRuleStoreClassName$1.evaluate(TestRuleStoreClassName.java:42)
	at com.carrotsearch.randomizedtesting.rules.SystemPropertiesInvariantRule$1.evaluate(SystemPropertiesInvariantRule.java:55)
	at com.carrotsearch.randomizedtesting.rules.NoShadowingOrOverridesOnMethodsRule$1.evaluate(NoShadowingOrOverridesOnMethodsRule.java:39)
	at com.carrotsearch.randomizedtesting.rules.NoShadowingOrOverridesOnMethodsRule$1.evaluate(NoShadowingOrOverridesOnMethodsRule.java:39)
	at com.carrotsearch.randomizedtesting.rules.StatementAdapter.evaluate(StatementAdapter.java:36)
	at com.carrotsearch.randomizedtesting.rules.StatementAdapter.evaluate(StatementAdapter.java:36)
	at com.carrotsearch.randomizedtesting.rules.StatementAdapter.evaluate(StatementAdapter.java:36)
	at org.apache.lucene.util.TestRuleAssertionsRequired$1.evaluate(TestRuleAssertionsRequired.java:54)
	at org.apache.lucene.util.TestRuleMarkFailure$1.evaluate(TestRuleMarkFailure.java:48)
	at org.apache.lucene.util.TestRuleIgnoreAfterMaxFailures$1.evaluate(TestRuleIgnoreAfterMaxFailures.java:65)
	at org.apache.lucene.util.TestRuleIgnoreTestSuites$1.evaluate(TestRuleIgnoreTestSuites.java:55)
	at com.carrotsearch.randomizedtesting.rules.StatementAdapter.evaluate(StatementAdapter.java:36)
	at com.carrotsearch.randomizedtesting.ThreadLeakControl$StatementRunner.run(ThreadLeakControl.java:365)
	at java.lang.Thread.run(Thread.java:745)
Caused by: java.lang.RuntimeException: REQUEST FAILED: xpath=//lst[@name='1']/arr[@name='tv_mv_text']/str[.='a <em>long</em> days night this should be a piece of text which']
	xml response was: <?xml version="1.0" encoding="UTF-8"?>
<response>
<lst name="responseHeader"><int name="status">0</int><int name="QTime">2</int></lst><result name="response" numFound="1" start="0"><doc><arr name="tv_mv_text"><str>a long days night this should be a piece of text which is is is is is is is is is is is is is is is is is is is is is is is is isis is is is is is is is is is is is is is is is is is is is is is is is is is is is is is is is is is is is is is is is is is is is is is is is is is is is is is is is is is is is is is is is is is is is is is is is is is is sufficiently lengthly to produce multiple fragments which are not concatenated at all--we want two disjoint long fragments.</str><str>a long days night this should be a piece of text which is is is is is is is is is is is is is is is is is is is is is is is is isis is is is is is is is is is is is is is is is is is is is is is is is is is is is is is is is is is is is is is is is is is is is is is is is is is is is is is is is is is is is is is is is is is is is is is is is is is is sufficiently lengthly to produce multiple fragments which are not concatenated at all--we want two disjoint long fragments.</str></arr><int name="id">1</int><arr name="range_facet_l"><long>1</long></arr><long name="_version_">1486053540808884224</long><arr name="multiDefault"><str>muLti-Default</str></arr><int name="intDefault">42</int><date name="timestamp">2014-11-28T21:44:54.674Z</date></doc></result><lst name="highlighting"><lst name="1"/></lst>
</response>

	request was:hl.snippets=2&q=tv_mv_text:long&qt=standard&hl=true&start=0&hl.fl=tv_mv_text&rows=200
	at org.apache.solr.SolrTestCaseJ4.assertQ(SolrTestCaseJ4.java:722)
	... 41 more


FAILED:  org.apache.solr.highlight.HighlighterTest.testVariableFragsize

Error Message:
Exception during query

Stack Trace:
java.lang.RuntimeException: Exception during query
	at __randomizedtesting.SeedInfo.seed([4EDD8F1920324033:49918F68C28CECA1]:0)
	at org.apache.solr.SolrTestCaseJ4.assertQ(SolrTestCaseJ4.java:729)
	at org.apache.solr.highlight.HighlighterTest.testVariableFragsize(HighlighterTest.java:592)
	at sun.reflect.NativeMethodAccessorImpl.invoke0(Native Method)
	at sun.reflect.NativeMethodAccessorImpl.invoke(NativeMethodAccessorImpl.java:62)
	at sun.reflect.DelegatingMethodAccessorImpl.invoke(DelegatingMethodAccessorImpl.java:43)
	at java.lang.reflect.Method.invoke(Method.java:483)
	at com.carrotsearch.randomizedtesting.RandomizedRunner.invoke(RandomizedRunner.java:1618)
	at com.carrotsearch.randomizedtesting.RandomizedRunner$6.evaluate(RandomizedRunner.java:827)
	at com.carrotsearch.randomizedtesting.RandomizedRunner$7.evaluate(RandomizedRunner.java:863)
	at com.carrotsearch.randomizedtesting.RandomizedRunner$8.evaluate(RandomizedRunner.java:877)
	at com.carrotsearch.randomizedtesting.rules.SystemPropertiesRestoreRule$1.evaluate(SystemPropertiesRestoreRule.java:53)
	at org.apache.lucene.util.TestRuleSetupTeardownChained$1.evaluate(TestRuleSetupTeardownChained.java:50)
	at org.apache.lucene.util.AbstractBeforeAfterRule$1.evaluate(AbstractBeforeAfterRule.java:46)
	at com.carrotsearch.randomizedtesting.rules.SystemPropertiesInvariantRule$1.evaluate(SystemPropertiesInvariantRule.java:55)
	at org.apache.lucene.util.TestRuleThreadAndTestName$1.evaluate(TestRuleThreadAndTestName.java:49)
	at org.apache.lucene.util.TestRuleIgnoreAfterMaxFailures$1.evaluate(TestRuleIgnoreAfterMaxFailures.java:65)
	at org.apache.lucene.util.TestRuleMarkFailure$1.evaluate(TestRuleMarkFailure.java:48)
	at com.carrotsearch.randomizedtesting.rules.StatementAdapter.evaluate(StatementAdapter.java:36)
	at com.carrotsearch.randomizedtesting.ThreadLeakControl$StatementRunner.run(ThreadLeakControl.java:365)
	at com.carrotsearch.randomizedtesting.ThreadLeakControl.forkTimeoutingTask(ThreadLeakControl.java:798)
	at com.carrotsearch.randomizedtesting.ThreadLeakControl$3.evaluate(ThreadLeakControl.java:458)
	at com.carrotsearch.randomizedtesting.RandomizedRunner.runSingleTest(RandomizedRunner.java:836)
	at com.carrotsearch.randomizedtesting.RandomizedRunner$3.evaluate(RandomizedRunner.java:738)
	at com.carrotsearch.randomizedtesting.RandomizedRunner$4.evaluate(RandomizedRunner.java:772)
	at com.carrotsearch.randomizedtesting.RandomizedRunner$5.evaluate(RandomizedRunner.java:783)
	at com.carrotsearch.randomizedtesting.rules.StatementAdapter.evaluate(StatementAdapter.java:36)
	at com.carrotsearch.randomizedtesting.rules.SystemPropertiesRestoreRule$1.evaluate(SystemPropertiesRestoreRule.java:53)
	at org.apache.lucene.util.AbstractBeforeAfterRule$1.evaluate(AbstractBeforeAfterRule.java:46)
	at org.apache.lucene.util.TestRuleStoreClassName$1.evaluate(TestRuleStoreClassName.java:42)
	at com.carrotsearch.randomizedtesting.rules.SystemPropertiesInvariantRule$1.evaluate(SystemPropertiesInvariantRule.java:55)
	at com.carrotsearch.randomizedtesting.rules.NoShadowingOrOverridesOnMethodsRule$1.evaluate(NoShadowingOrOverridesOnMethodsRule.java:39)
	at com.carrotsearch.randomizedtesting.rules.NoShadowingOrOverridesOnMethodsRule$1.evaluate(NoShadowingOrOverridesOnMethodsRule.java:39)
	at com.carrotsearch.randomizedtesting.rules.StatementAdapter.evaluate(StatementAdapter.java:36)
	at com.carrotsearch.randomizedtesting.rules.StatementAdapter.evaluate(StatementAdapter.java:36)
	at com.carrotsearch.randomizedtesting.rules.StatementAdapter.evaluate(StatementAdapter.java:36)
	at org.apache.lucene.util.TestRuleAssertionsRequired$1.evaluate(TestRuleAssertionsRequired.java:54)
	at org.apache.lucene.util.TestRuleMarkFailure$1.evaluate(TestRuleMarkFailure.java:48)
	at org.apache.lucene.util.TestRuleIgnoreAfterMaxFailures$1.evaluate(TestRuleIgnoreAfterMaxFailures.java:65)
	at org.apache.lucene.util.TestRuleIgnoreTestSuites$1.evaluate(TestRuleIgnoreTestSuites.java:55)
	at com.carrotsearch.randomizedtesting.rules.StatementAdapter.evaluate(StatementAdapter.java:36)
	at com.carrotsearch.randomizedtesting.ThreadLeakControl$StatementRunner.run(ThreadLeakControl.java:365)
	at java.lang.Thread.run(Thread.java:745)
Caused by: java.lang.RuntimeException: REQUEST FAILED: xpath=//lst[@name='1']/arr[@name='tv_text']/str[.='a <em>long</em> days night this should be a piece of text which']
	xml response was: <?xml version="1.0" encoding="UTF-8"?>
<response>
<lst name="responseHeader"><int name="status">0</int><int name="QTime">0</int></lst><result name="response" numFound="1" start="0"><doc><arr name="tv_text"><str>a long days night this should be a piece of text which is is is is is is is is is is is is is is is is is is is is is is is is isis is is is is is is is is is is is is is is is is is is is is is is is is is is is is is is is is is is is is is is is is is is is is is is is is is is is is is is is is is is is is is is is is is is is is is is is is is is sufficiently lengthly to produce multiple fragments which are not concatenated at all</str></arr><int name="id">1</int><arr name="range_facet_l"><long>1</long></arr><long name="_version_">1486053540938907648</long><arr name="multiDefault"><str>muLti-Default</str></arr><int name="intDefault">42</int><date name="timestamp">2014-11-28T21:44:54.798Z</date></doc></result><lst name="highlighting"><lst name="1"/></lst>
</response>

	request was:q=tv_text:long&qt=standard&hl=true&start=0&hl.fl=tv_text&rows=200
	at org.apache.solr.SolrTestCaseJ4.assertQ(SolrTestCaseJ4.java:722)
	... 41 more


FAILED:  org.apache.solr.highlight.HighlighterTest.testTermVecMultiValuedHighlight2

Error Message:
Exception during query

Stack Trace:
java.lang.RuntimeException: Exception during query
	at __randomizedtesting.SeedInfo.seed([4EDD8F1920324033:5654B2C5BEE1D501]:0)
	at org.apache.solr.SolrTestCaseJ4.assertQ(SolrTestCaseJ4.java:729)
	at org.apache.solr.highlight.HighlighterTest.testTermVecMultiValuedHighlight2(HighlighterTest.java:239)
	at sun.reflect.NativeMethodAccessorImpl.invoke0(Native Method)
	at sun.reflect.NativeMethodAccessorImpl.invoke(NativeMethodAccessorImpl.java:62)
	at sun.reflect.DelegatingMethodAccessorImpl.invoke(DelegatingMethodAccessorImpl.java:43)
	at java.lang.reflect.Method.invoke(Method.java:483)
	at com.carrotsearch.randomizedtesting.RandomizedRunner.invoke(RandomizedRunner.java:1618)
	at com.carrotsearch.randomizedtesting.RandomizedRunner$6.evaluate(RandomizedRunner.java:827)
	at com.carrotsearch.randomizedtesting.RandomizedRunner$7.evaluate(RandomizedRunner.java:863)
	at com.carrotsearch.randomizedtesting.RandomizedRunner$8.evaluate(RandomizedRunner.java:877)
	at com.carrotsearch.randomizedtesting.rules.SystemPropertiesRestoreRule$1.evaluate(SystemPropertiesRestoreRule.java:53)
	at org.apache.lucene.util.TestRuleSetupTeardownChained$1.evaluate(TestRuleSetupTeardownChained.java:50)
	at org.apache.lucene.util.AbstractBeforeAfterRule$1.evaluate(AbstractBeforeAfterRule.java:46)
	at com.carrotsearch.randomizedtesting.rules.SystemPropertiesInvariantRule$1.evaluate(SystemPropertiesInvariantRule.java:55)
	at org.apache.lucene.util.TestRuleThreadAndTestName$1.evaluate(TestRuleThreadAndTestName.java:49)
	at org.apache.lucene.util.TestRuleIgnoreAfterMaxFailures$1.evaluate(TestRuleIgnoreAfterMaxFailures.java:65)
	at org.apache.lucene.util.TestRuleMarkFailure$1.evaluate(TestRuleMarkFailure.java:48)
	at com.carrotsearch.randomizedtesting.rules.StatementAdapter.evaluate(StatementAdapter.java:36)
	at com.carrotsearch.randomizedtesting.ThreadLeakControl$StatementRunner.run(ThreadLeakControl.java:365)
	at com.carrotsearch.randomizedtesting.ThreadLeakControl.forkTimeoutingTask(ThreadLeakControl.java:798)
	at com.carrotsearch.randomizedtesting.ThreadLeakControl$3.evaluate(ThreadLeakControl.java:458)
	at com.carrotsearch.randomizedtesting.RandomizedRunner.runSingleTest(RandomizedRunner.java:836)
	at com.carrotsearch.randomizedtesting.RandomizedRunner$3.evaluate(RandomizedRunner.java:738)
	at com.carrotsearch.randomizedtesting.RandomizedRunner$4.evaluate(RandomizedRunner.java:772)
	at com.carrotsearch.randomizedtesting.RandomizedRunner$5.evaluate(RandomizedRunner.java:783)
	at com.carrotsearch.randomizedtesting.rules.StatementAdapter.evaluate(StatementAdapter.java:36)
	at com.carrotsearch.randomizedtesting.rules.SystemPropertiesRestoreRule$1.evaluate(SystemPropertiesRestoreRule.java:53)
	at org.apache.lucene.util.AbstractBeforeAfterRule$1.evaluate(AbstractBeforeAfterRule.java:46)
	at org.apache.lucene.util.TestRuleStoreClassName$1.evaluate(TestRuleStoreClassName.java:42)
	at com.carrotsearch.randomizedtesting.rules.SystemPropertiesInvariantRule$1.evaluate(SystemPropertiesInvariantRule.java:55)
	at com.carrotsearch.randomizedtesting.rules.NoShadowingOrOverridesOnMethodsRule$1.evaluate(NoShadowingOrOverridesOnMethodsRule.java:39)
	at com.carrotsearch.randomizedtesting.rules.NoShadowingOrOverridesOnMethodsRule$1.evaluate(NoShadowingOrOverridesOnMethodsRule.java:39)
	at com.carrotsearch.randomizedtesting.rules.StatementAdapter.evaluate(StatementAdapter.java:36)
	at com.carrotsearch.randomizedtesting.rules.StatementAdapter.evaluate(StatementAdapter.java:36)
	at com.carrotsearch.randomizedtesting.rules.StatementAdapter.evaluate(StatementAdapter.java:36)
	at org.apache.lucene.util.TestRuleAssertionsRequired$1.evaluate(TestRuleAssertionsRequired.java:54)
	at org.apache.lucene.util.TestRuleMarkFailure$1.evaluate(TestRuleMarkFailure.java:48)
	at org.apache.lucene.util.TestRuleIgnoreAfterMaxFailures$1.evaluate(TestRuleIgnoreAfterMaxFailures.java:65)
	at org.apache.lucene.util.TestRuleIgnoreTestSuites$1.evaluate(TestRuleIgnoreTestSuites.java:55)
	at com.carrotsearch.randomizedtesting.rules.StatementAdapter.evaluate(StatementAdapter.java:36)
	at com.carrotsearch.randomizedtesting.ThreadLeakControl$StatementRunner.run(ThreadLeakControl.java:365)
	at java.lang.Thread.run(Thread.java:745)
Caused by: java.lang.RuntimeException: REQUEST FAILED: xpath=//lst[@name='1']/arr[@name='tv_mv_text']/str[.='a <em>long</em> days night this should be a piece of text which']
	xml response was: <?xml version="1.0" encoding="UTF-8"?>
<response>
<lst name="responseHeader"><int name="status">0</int><int name="QTime">1</int></lst><result name="response" numFound="1" start="0"><doc><arr name="tv_mv_text"><str>short</str><str>a long days night this should be a piece of text which is is is is is is is is is is is is is is is is is is is is is is is is isis is is is is is is is is is is is is is is is is is is is is is is is is is is is is is is is is is is is is is is is is is is is is is is is is is is is is is is is is is is is is is is is is is is is is is is is is is is sufficiently lengthly to produce multiple fragments which are not concatenated at all--we want two disjoint long fragments.</str></arr><int name="id">1</int><arr name="range_facet_l"><long>1</long></arr><long name="_version_">1486053541140234240</long><arr name="multiDefault"><str>muLti-Default</str></arr><int name="intDefault">42</int><date name="timestamp">2014-11-28T21:44:54.989Z</date></doc></result><lst name="highlighting"><lst name="1"/></lst>
</response>

	request was:hl.snippets=2&q=tv_mv_text:long&qt=standard&hl=true&start=0&hl.fl=tv_mv_text&rows=200
	at org.apache.solr.SolrTestCaseJ4.assertQ(SolrTestCaseJ4.java:722)
	... 41 more


FAILED:  org.apache.solr.highlight.HighlighterTest.testTermVecHighlight

Error Message:
Exception during query

Stack Trace:
java.lang.RuntimeException: Exception during query
	at __randomizedtesting.SeedInfo.seed([4EDD8F1920324033:6FFDF7C829619420]:0)
	at org.apache.solr.SolrTestCaseJ4.assertQ(SolrTestCaseJ4.java:729)
	at org.apache.solr.highlight.HighlighterTest.testTermVecHighlight(HighlighterTest.java:145)
	at sun.reflect.NativeMethodAccessorImpl.invoke0(Native Method)
	at sun.reflect.NativeMethodAccessorImpl.invoke(NativeMethodAccessorImpl.java:62)
	at sun.reflect.DelegatingMethodAccessorImpl.invoke(DelegatingMethodAccessorImpl.java:43)
	at java.lang.reflect.Method.invoke(Method.java:483)
	at com.carrotsearch.randomizedtesting.RandomizedRunner.invoke(RandomizedRunner.java:1618)
	at com.carrotsearch.randomizedtesting.RandomizedRunner$6.evaluate(RandomizedRunner.java:827)
	at com.carrotsearch.randomizedtesting.RandomizedRunner$7.evaluate(RandomizedRunner.java:863)
	at com.carrotsearch.randomizedtesting.RandomizedRunner$8.evaluate(RandomizedRunner.java:877)
	at com.carrotsearch.randomizedtesting.rules.SystemPropertiesRestoreRule$1.evaluate(SystemPropertiesRestoreRule.java:53)
	at org.apache.lucene.util.TestRuleSetupTeardownChained$1.evaluate(TestRuleSetupTeardownChained.java:50)
	at org.apache.lucene.util.AbstractBeforeAfterRule$1.evaluate(AbstractBeforeAfterRule.java:46)
	at com.carrotsearch.randomizedtesting.rules.SystemPropertiesInvariantRule$1.evaluate(SystemPropertiesInvariantRule.java:55)
	at org.apache.lucene.util.TestRuleThreadAndTestName$1.evaluate(TestRuleThreadAndTestName.java:49)
	at org.apache.lucene.util.TestRuleIgnoreAfterMaxFailures$1.evaluate(TestRuleIgnoreAfterMaxFailures.java:65)
	at org.apache.lucene.util.TestRuleMarkFailure$1.evaluate(TestRuleMarkFailure.java:48)
	at com.carrotsearch.randomizedtesting.rules.StatementAdapter.evaluate(StatementAdapter.java:36)
	at com.carrotsearch.randomizedtesting.ThreadLeakControl$StatementRunner.run(ThreadLeakControl.java:365)
	at com.carrotsearch.randomizedtesting.ThreadLeakControl.forkTimeoutingTask(ThreadLeakControl.java:798)
	at com.carrotsearch.randomizedtesting.ThreadLeakControl$3.evaluate(ThreadLeakControl.java:458)
	at com.carrotsearch.randomizedtesting.RandomizedRunner.runSingleTest(RandomizedRunner.java:836)
	at com.carrotsearch.randomizedtesting.RandomizedRunner$3.evaluate(RandomizedRunner.java:738)
	at com.carrotsearch.randomizedtesting.RandomizedRunner$4.evaluate(RandomizedRunner.java:772)
	at com.carrotsearch.randomizedtesting.RandomizedRunner$5.evaluate(RandomizedRunner.java:783)
	at com.carrotsearch.randomizedtesting.rules.StatementAdapter.evaluate(StatementAdapter.java:36)
	at com.carrotsearch.randomizedtesting.rules.SystemPropertiesRestoreRule$1.evaluate(SystemPropertiesRestoreRule.java:53)
	at org.apache.lucene.util.AbstractBeforeAfterRule$1.evaluate(AbstractBeforeAfterRule.java:46)
	at org.apache.lucene.util.TestRuleStoreClassName$1.evaluate(TestRuleStoreClassName.java:42)
	at com.carrotsearch.randomizedtesting.rules.SystemPropertiesInvariantRule$1.evaluate(SystemPropertiesInvariantRule.java:55)
	at com.carrotsearch.randomizedtesting.rules.NoShadowingOrOverridesOnMethodsRule$1.evaluate(NoShadowingOrOverridesOnMethodsRule.java:39)
	at com.carrotsearch.randomizedtesting.rules.NoShadowingOrOverridesOnMethodsRule$1.evaluate(NoShadowingOrOverridesOnMethodsRule.java:39)
	at com.carrotsearch.randomizedtesting.rules.StatementAdapter.evaluate(StatementAdapter.java:36)
	at com.carrotsearch.randomizedtesting.rules.StatementAdapter.evaluate(StatementAdapter.java:36)
	at com.carrotsearch.randomizedtesting.rules.StatementAdapter.evaluate(StatementAdapter.java:36)
	at org.apache.lucene.util.TestRuleAssertionsRequired$1.evaluate(TestRuleAssertionsRequired.java:54)
	at org.apache.lucene.util.TestRuleMarkFailure$1.evaluate(TestRuleMarkFailure.java:48)
	at org.apache.lucene.util.TestRuleIgnoreAfterMaxFailures$1.evaluate(TestRuleIgnoreAfterMaxFailures.java:65)
	at org.apache.lucene.util.TestRuleIgnoreTestSuites$1.evaluate(TestRuleIgnoreTestSuites.java:55)
	at com.carrotsearch.randomizedtesting.rules.StatementAdapter.evaluate(StatementAdapter.java:36)
	at com.carrotsearch.randomizedtesting.ThreadLeakControl$StatementRunner.run(ThreadLeakControl.java:365)
	at java.lang.Thread.run(Thread.java:745)
Caused by: java.lang.RuntimeException: REQUEST FAILED: xpath=//lst[@name='1']/arr[@name='tv_text']/str[.='a <em>long</em> days night this should be a piece of text which']
	xml response was: <?xml version="1.0" encoding="UTF-8"?>
<response>
<lst name="responseHeader"><int name="status">0</int><int name="QTime">0</int></lst><result name="response" numFound="1" start="0"><doc><arr name="tv_text"><str>a long days night this should be a piece of text which is is is is is is is is is is is is is is is is is is is is is is is is isis is is is is is is is is is is is is is is is is is is is is is is is is is is is is is is is is is is is is is is is is is is is is is is is is is is is is is is is is is is is is is is is is is is is is is is is is is is sufficiently lengthly to produce multiple fragments which are not concatenated at all--we want two disjoint long fragments.</str></arr><int name="id">1</int><arr name="range_facet_l"><long>1</long></arr><long name="_version_">1486053541153865728</long><arr name="multiDefault"><str>muLti-Default</str></arr><int name="intDefault">42</int><date name="timestamp">2014-11-28T21:44:55.003Z</date></doc></result><lst name="highlighting"><lst name="1"/></lst>
</response>

	request was:hl.snippets=2&q=tv_text:long&qt=standard&hl=true&start=0&hl.fl=tv_text&rows=200
	at org.apache.solr.SolrTestCaseJ4.assertQ(SolrTestCaseJ4.java:722)
	... 41 more


FAILED:  org.apache.solr.highlight.HighlighterTest.testLongFragment

Error Message:
Exception during query

Stack Trace:
java.lang.RuntimeException: Exception during query
	at __randomizedtesting.SeedInfo.seed([4EDD8F1920324033:D61AF3BE2F1E4BFB]:0)
	at org.apache.solr.SolrTestCaseJ4.assertQ(SolrTestCaseJ4.java:729)
	at org.apache.solr.highlight.HighlighterTest.testLongFragment(HighlighterTest.java:496)
	at sun.reflect.NativeMethodAccessorImpl.invoke0(Native Method)
	at sun.reflect.NativeMethodAccessorImpl.invoke(NativeMethodAccessorImpl.java:62)
	at sun.reflect.DelegatingMethodAccessorImpl.invoke(DelegatingMethodAccessorImpl.java:43)
	at java.lang.reflect.Method.invoke(Method.java:483)
	at com.carrotsearch.randomizedtesting.RandomizedRunner.invoke(RandomizedRunner.java:1618)
	at com.carrotsearch.randomizedtesting.RandomizedRunner$6.evaluate(RandomizedRunner.java:827)
	at com.carrotsearch.randomizedtesting.RandomizedRunner$7.evaluate(RandomizedRunner.java:863)
	at com.carrotsearch.randomizedtesting.RandomizedRunner$8.evaluate(RandomizedRunner.java:877)
	at com.carrotsearch.randomizedtesting.rules.SystemPropertiesRestoreRule$1.evaluate(SystemPropertiesRestoreRule.java:53)
	at org.apache.lucene.util.TestRuleSetupTeardownChained$1.evaluate(TestRuleSetupTeardownChained.java:50)
	at org.apache.lucene.util.AbstractBeforeAfterRule$1.evaluate(AbstractBeforeAfterRule.java:46)
	at com.carrotsearch.randomizedtesting.rules.SystemPropertiesInvariantRule$1.evaluate(SystemPropertiesInvariantRule.java:55)
	at org.apache.lucene.util.TestRuleThreadAndTestName$1.evaluate(TestRuleThreadAndTestName.java:49)
	at org.apache.lucene.util.TestRuleIgnoreAfterMaxFailures$1.evaluate(TestRuleIgnoreAfterMaxFailures.java:65)
	at org.apache.lucene.util.TestRuleMarkFailure$1.evaluate(TestRuleMarkFailure.java:48)
	at com.carrotsearch.randomizedtesting.rules.StatementAdapter.evaluate(StatementAdapter.java:36)
	at com.carrotsearch.randomizedtesting.ThreadLeakControl$StatementRunner.run(ThreadLeakControl.java:365)
	at com.carrotsearch.randomizedtesting.ThreadLeakControl.forkTimeoutingTask(ThreadLeakControl.java:798)
	at com.carrotsearch.randomizedtesting.ThreadLeakControl$3.evaluate(ThreadLeakControl.java:458)
	at com.carrotsearch.randomizedtesting.RandomizedRunner.runSingleTest(RandomizedRunner.java:836)
	at com.carrotsearch.randomizedtesting.RandomizedRunner$3.evaluate(RandomizedRunner.java:738)
	at com.carrotsearch.randomizedtesting.RandomizedRunner$4.evaluate(RandomizedRunner.java:772)
	at com.carrotsearch.randomizedtesting.RandomizedRunner$5.evaluate(RandomizedRunner.java:783)
	at com.carrotsearch.randomizedtesting.rules.StatementAdapter.evaluate(StatementAdapter.java:36)
	at com.carrotsearch.randomizedtesting.rules.SystemPropertiesRestoreRule$1.evaluate(SystemPropertiesRestoreRule.java:53)
	at org.apache.lucene.util.AbstractBeforeAfterRule$1.evaluate(AbstractBeforeAfterRule.java:46)
	at org.apache.lucene.util.TestRuleStoreClassName$1.evaluate(TestRuleStoreClassName.java:42)
	at com.carrotsearch.randomizedtesting.rules.SystemPropertiesInvariantRule$1.evaluate(SystemPropertiesInvariantRule.java:55)
	at com.carrotsearch.randomizedtesting.rules.NoShadowingOrOverridesOnMethodsRule$1.evaluate(NoShadowingOrOverridesOnMethodsRule.java:39)
	at com.carrotsearch.randomizedtesting.rules.NoShadowingOrOverridesOnMethodsRule$1.evaluate(NoShadowingOrOverridesOnMethodsRule.java:39)
	at com.carrotsearch.randomizedtesting.rules.StatementAdapter.evaluate(StatementAdapter.java:36)
	at com.carrotsearch.randomizedtesting.rules.StatementAdapter.evaluate(StatementAdapter.java:36)
	at com.carrotsearch.randomizedtesting.rules.StatementAdapter.evaluate(StatementAdapter.java:36)
	at org.apache.lucene.util.TestRuleAssertionsRequired$1.evaluate(TestRuleAssertionsRequired.java:54)
	at org.apache.lucene.util.TestRuleMarkFailure$1.evaluate(TestRuleMarkFailure.java:48)
	at org.apache.lucene.util.TestRuleIgnoreAfterMaxFailures$1.evaluate(TestRuleIgnoreAfterMaxFailures.java:65)
	at org.apache.lucene.util.TestRuleIgnoreTestSuites$1.evaluate(TestRuleIgnoreTestSuites.java:55)
	at com.carrotsearch.randomizedtesting.rules.StatementAdapter.evaluate(StatementAdapter.java:36)
	at com.carrotsearch.randomizedtesting.ThreadLeakControl$StatementRunner.run(ThreadLeakControl.java:365)
	at java.lang.Thread.run(Thread.java:745)
Caused by: java.lang.RuntimeException: REQUEST FAILED: xpath=//lst[@name='1']/arr[@name='tv_text']/str
	xml response was: <?xml version="1.0" encoding="UTF-8"?>
<response>
<lst name="responseHeader"><int name="status">0</int><int name="QTime">0</int></lst><result name="response" numFound="1" start="0"><doc><arr name="tv_text"><str>junit: [mkdir] Created dir: /home/klaas/worio/backend/trunk/build-src/solr-nightly/build/test-results [junit] Running org.apache.solr.BasicFunctionalityTest [junit] Tests run: 7, Failures: 0, Errors: 0, Time elapsed: 5.36 sec [junit] Running org.apache.solr.ConvertedLegacyTest [junit] Tests run: 1, Failures: 0, Errors: 0, Time elapsed: 8.268 sec [junit] Running org.apache.solr.DisMaxRequestHandlerTest [junit] Tests run: 1, Failures: 0, Errors: 0, Time elapsed: 1.56 sec [junit] Running org.apache.solr.HighlighterTest [junit] Tests run: 7, Failures: 0, Errors: 0, Time elapsed: 4.979 sec [junit] Running org.apache.solr.OutputWriterTest [junit] Tests run: 2, Failures: 0, Errors: 0, Time elapsed: 0.797 sec [junit] Running org.apache.solr.SampleTest [junit] Tests run: 2, Failures: 0, Errors: 0, Time elapsed: 1.021 sec [junit] Running org.apache.solr.analysis.TestBufferedTokenStream [junit] Tests run: 2, Failures: 0, Errors: 0, Time elapsed: 0.05 sec [junit] Running org.apache.solr.analysis.TestRemoveDuplicatesTokenFilter [junit] Tests run: 3, Failures: 0, Errors: 0, Time elapsed: 0.054 sec [junit] Running org.apache.solr.analysis.TestSynonymFilter [junit] Tests run: 6, Failures: 0, Errors: 0, Time elapsed: 0.081 sec [junit] Running org.apache.solr.analysis.TestWordDelimiterFilter [junit] Tests run: 1, Failures: 0, Errors: 0, Time elapsed: 1.714 sec [junit] Running org.apache.solr.search.TestDocSet [junit] Tests run: 1, Failures: 0, Errors: 0, Time elapsed: 0.788 sec [junit] Running org.apache.solr.util.SolrPluginUtilsTest [junit] Tests run: 5, Failures: 0, Errors: 0, Time elapsed: 3.519 sec [junit] Running org.apache.solr.util.TestOpenBitSet [junit] Tests run: 2, Failures: 0, Errors: 0, Time elapsed: 0.533 sec</str></arr><int name="id">1</int><arr name="range_facet_l"><long>1</long></arr><long name="_version_">1486053541175885824</long><arr name="multiDefault"><str>muLti-Default</str></arr><int name="intDefault">42</int><date name="timestamp">2014-11-28T21:44:55.023Z</date></doc></result><lst name="highlighting"><lst name="1"/></lst>
</response>

	request was:q=tv_text:dir&qt=standard&hl=true&start=0&hl.fl=tv_text&rows=200
	at org.apache.solr.SolrTestCaseJ4.assertQ(SolrTestCaseJ4.java:722)
	... 41 more


FAILED:  org.apache.solr.highlight.HighlighterTest.testSubwordWildcardHighlightWithTermOffsets

Error Message:
Exception during query

Stack Trace:
java.lang.RuntimeException: Exception during query
	at __randomizedtesting.SeedInfo.seed([4EDD8F1920324033:717B6BDAD597224E]:0)
	at org.apache.solr.SolrTestCaseJ4.assertQ(SolrTestCaseJ4.java:729)
	at org.apache.solr.highlight.HighlighterTest.testSubwordWildcardHighlightWithTermOffsets(HighlighterTest.java:834)
	at sun.reflect.NativeMethodAccessorImpl.invoke0(Native Method)
	at sun.reflect.NativeMethodAccessorImpl.invoke(NativeMethodAccessorImpl.java:62)
	at sun.reflect.DelegatingMethodAccessorImpl.invoke(DelegatingMethodAccessorImpl.java:43)
	at java.lang.reflect.Method.invoke(Method.java:483)
	at com.carrotsearch.randomizedtesting.RandomizedRunner.invoke(RandomizedRunner.java:1618)
	at com.carrotsearch.randomizedtesting.RandomizedRunner$6.evaluate(RandomizedRunner.java:827)
	at com.carrotsearch.randomizedtesting.RandomizedRunner$7.evaluate(RandomizedRunner.java:863)
	at com.carrotsearch.randomizedtesting.RandomizedRunner$8.evaluate(RandomizedRunner.java:877)
	at com.carrotsearch.randomizedtesting.rules.SystemPropertiesRestoreRule$1.evaluate(SystemPropertiesRestoreRule.java:53)
	at org.apache.lucene.util.TestRuleSetupTeardownChained$1.evaluate(TestRuleSetupTeardownChained.java:50)
	at org.apache.lucene.util.AbstractBeforeAfterRule$1.evaluate(AbstractBeforeAfterRule.java:46)
	at com.carrotsearch.randomizedtesting.rules.SystemPropertiesInvariantRule$1.evaluate(SystemPropertiesInvariantRule.java:55)
	at org.apache.lucene.util.TestRuleThreadAndTestName$1.evaluate(TestRuleThreadAndTestName.java:49)
	at org.apache.lucene.util.TestRuleIgnoreAfterMaxFailures$1.evaluate(TestRuleIgnoreAfterMaxFailures.java:65)
	at org.apache.lucene.util.TestRuleMarkFailure$1.evaluate(TestRuleMarkFailure.java:48)
	at com.carrotsearch.randomizedtesting.rules.StatementAdapter.evaluate(StatementAdapter.java:36)
	at com.carrotsearch.randomizedtesting.ThreadLeakControl$StatementRunner.run(ThreadLeakControl.java:365)
	at com.carrotsearch.randomizedtesting.ThreadLeakControl.forkTimeoutingTask(ThreadLeakControl.java:798)
	at com.carrotsearch.randomizedtesting.ThreadLeakControl$3.evaluate(ThreadLeakControl.java:458)
	at com.carrotsearch.randomizedtesting.RandomizedRunner.runSingleTest(RandomizedRunner.java:836)
	at com.carrotsearch.randomizedtesting.RandomizedRunner$3.evaluate(RandomizedRunner.java:738)
	at com.carrotsearch.randomizedtesting.RandomizedRunner$4.evaluate(RandomizedRunner.java:772)
	at com.carrotsearch.randomizedtesting.RandomizedRunner$5.evaluate(RandomizedRunner.java:783)
	at com.carrotsearch.randomizedtesting.rules.StatementAdapter.evaluate(StatementAdapter.java:36)
	at com.carrotsearch.randomizedtesting.rules.SystemPropertiesRestoreRule$1.evaluate(SystemPropertiesRestoreRule.java:53)
	at org.apache.lucene.util.AbstractBeforeAfterRule$1.evaluate(AbstractBeforeAfterRule.java:46)
	at org.apache.lucene.util.TestRuleStoreClassName$1.evaluate(TestRuleStoreClassName.java:42)
	at com.carrotsearch.randomizedtesting.rules.SystemPropertiesInvariantRule$1.evaluate(SystemPropertiesInvariantRule.java:55)
	at com.carrotsearch.randomizedtesting.rules.NoShadowingOrOverridesOnMethodsRule$1.evaluate(NoShadowingOrOverridesOnMethodsRule.java:39)
	at com.carrotsearch.randomizedtesting.rules.NoShadowingOrOverridesOnMethodsRule$1.evaluate(NoShadowingOrOverridesOnMethodsRule.java:39)
	at com.carrotsearch.randomizedtesting.rules.StatementAdapter.evaluate(StatementAdapter.java:36)
	at com.carrotsearch.randomizedtesting.rules.StatementAdapter.evaluate(StatementAdapter.java:36)
	at com.carrotsearch.randomizedtesting.rules.StatementAdapter.evaluate(StatementAdapter.java:36)
	at org.apache.lucene.util.TestRuleAssertionsRequired$1.evaluate(TestRuleAssertionsRequired.java:54)
	at org.apache.lucene.util.TestRuleMarkFailure$1.evaluate(TestRuleMarkFailure.java:48)
	at org.apache.lucene.util.TestRuleIgnoreAfterMaxFailures$1.evaluate(TestRuleIgnoreAfterMaxFailures.java:65)
	at org.apache.lucene.util.TestRuleIgnoreTestSuites$1.evaluate(TestRuleIgnoreTestSuites.java:55)
	at com.carrotsearch.randomizedtesting.rules.StatementAdapter.evaluate(StatementAdapter.java:36)
	at com.carrotsearch.randomizedtesting.ThreadLeakControl$StatementRunner.run(ThreadLeakControl.java:365)
	at java.lang.Thread.run(Thread.java:745)
Caused by: java.lang.RuntimeException: REQUEST FAILED: xpath=//lst[@name='highlighting']/lst[@name='1']/arr[@name='subword_offsets']/str='lorem <em>PowerShot.com</em> ipsum'
	xml response was: <?xml version="1.0" encoding="UTF-8"?>
<response>
<lst name="responseHeader"><int name="status">0</int><int name="QTime">0</int></lst><result name="response" numFound="1" start="0"><doc><arr name="subword_offsets"><str>lorem PowerShot.com ipsum</str></arr><int name="id">1</int><arr name="range_facet_l"><long>1</long></arr><long name="_version_">1486053541193711616</long><arr name="multiDefault"><str>muLti-Default</str></arr><int name="intDefault">42</int><date name="timestamp">2014-11-28T21:44:55.041Z</date></doc></result><lst name="highlighting"><lst name="1"/></lst>
</response>

	request was:q=subword_offsets:pow*&hl=true&hl.fl=subword_offsets&wt=xml
	at org.apache.solr.SolrTestCaseJ4.assertQ(SolrTestCaseJ4.java:722)
	... 41 more


FAILED:  org.apache.solr.highlight.HighlighterTest.testTwoFieldHighlight

Error Message:
Exception during query

Stack Trace:
java.lang.RuntimeException: Exception during query
	at __randomizedtesting.SeedInfo.seed([4EDD8F1920324033:37AF4A1BC7441689]:0)
	at org.apache.solr.SolrTestCaseJ4.assertQ(SolrTestCaseJ4.java:729)
	at org.apache.solr.highlight.HighlighterTest.testTwoFieldHighlight(HighlighterTest.java:391)
	at sun.reflect.NativeMethodAccessorImpl.invoke0(Native Method)
	at sun.reflect.NativeMethodAccessorImpl.invoke(NativeMethodAccessorImpl.java:62)
	at sun.reflect.DelegatingMethodAccessorImpl.invoke(DelegatingMethodAccessorImpl.java:43)
	at java.lang.reflect.Method.invoke(Method.java:483)
	at com.carrotsearch.randomizedtesting.RandomizedRunner.invoke(RandomizedRunner.java:1618)
	at com.carrotsearch.randomizedtesting.RandomizedRunner$6.evaluate(RandomizedRunner.java:827)
	at com.carrotsearch.randomizedtesting.RandomizedRunner$7.evaluate(RandomizedRunner.java:863)
	at com.carrotsearch.randomizedtesting.RandomizedRunner$8.evaluate(RandomizedRunner.java:877)
	at com.carrotsearch.randomizedtesting.rules.SystemPropertiesRestoreRule$1.evaluate(SystemPropertiesRestoreRule.java:53)
	at org.apache.lucene.util.TestRuleSetupTeardownChained$1.evaluate(TestRuleSetupTeardownChained.java:50)
	at org.apache.lucene.util.AbstractBeforeAfterRule$1.evaluate(AbstractBeforeAfterRule.java:46)
	at com.carrotsearch.randomizedtesting.rules.SystemPropertiesInvariantRule$1.evaluate(SystemPropertiesInvariantRule.java:55)
	at org.apache.lucene.util.TestRuleThreadAndTestName$1.evaluate(TestRuleThreadAndTestName.java:49)
	at org.apache.lucene.util.TestRuleIgnoreAfterMaxFailures$1.evaluate(TestRuleIgnoreAfterMaxFailures.java:65)
	at org.apache.lucene.util.TestRuleMarkFailure$1.evaluate(TestRuleMarkFailure.java:48)
	at com.carrotsearch.randomizedtesting.rules.StatementAdapter.evaluate(StatementAdapter.java:36)
	at com.carrotsearch.randomizedtesting.ThreadLeakControl$StatementRunner.run(ThreadLeakControl.java:365)
	at com.carrotsearch.randomizedtesting.ThreadLeakControl.forkTimeoutingTask(ThreadLeakControl.java:798)
	at com.carrotsearch.randomizedtesting.ThreadLeakControl$3.evaluate(ThreadLeakControl.java:458)
	at com.carrotsearch.randomizedtesting.RandomizedRunner.runSingleTest(RandomizedRunner.java:836)
	at com.carrotsearch.randomizedtesting.RandomizedRunner$3.evaluate(RandomizedRunner.java:738)
	at com.carrotsearch.randomizedtesting.RandomizedRunner$4.evaluate(RandomizedRunner.java:772)
	at com.carrotsearch.randomizedtesting.RandomizedRunner$5.evaluate(RandomizedRunner.java:783)
	at com.carrotsearch.randomizedtesting.rules.StatementAdapter.evaluate(StatementAdapter.java:36)
	at com.carrotsearch.randomizedtesting.rules.SystemPropertiesRestoreRule$1.evaluate(SystemPropertiesRestoreRule.java:53)
	at org.apache.lucene.util.AbstractBeforeAfterRule$1.evaluate(AbstractBeforeAfterRule.java:46)
	at org.apache.lucene.util.TestRuleStoreClassName$1.evaluate(TestRuleStoreClassName.java:42)
	at com.carrotsearch.randomizedtesting.rules.SystemPropertiesInvariantRule$1.evaluate(SystemPropertiesInvariantRule.java:55)
	at com.carrotsearch.randomizedtesting.rules.NoShadowingOrOverridesOnMethodsRule$1.evaluate(NoShadowingOrOverridesOnMethodsRule.java:39)
	at com.carrotsearch.randomizedtesting.rules.NoShadowingOrOverridesOnMethodsRule$1.evaluate(NoShadowingOrOverridesOnMethodsRule.java:39)
	at com.carrotsearch.randomizedtesting.rules.StatementAdapter.evaluate(StatementAdapter.java:36)
	at com.carrotsearch.randomizedtesting.rules.StatementAdapter.evaluate(StatementAdapter.java:36)
	at com.carrotsearch.randomizedtesting.rules.StatementAdapter.evaluate(StatementAdapter.java:36)
	at org.apache.lucene.util.TestRuleAssertionsRequired$1.evaluate(TestRuleAssertionsRequired.java:54)
	at org.apache.lucene.util.TestRuleMarkFailure$1.evaluate(TestRuleMarkFailure.java:48)
	at org.apache.lucene.util.TestRuleIgnoreAfterMaxFailures$1.evaluate(TestRuleIgnoreAfterMaxFailures.java:65)
	at org.apache.lucene.util.TestRuleIgnoreTestSuites$1.evaluate(TestRuleIgnoreTestSuites.java:55)
	at com.carrotsearch.randomizedtesting.rules.StatementAdapter.evaluate(StatementAdapter.java:36)
	at com.carrotsearch.randomizedtesting.ThreadLeakControl$StatementRunner.run(ThreadLeakControl.java:365)
	at java.lang.Thread.run(Thread.java:745)
Caused by: java.lang.RuntimeException: REQUEST FAILED: xpath=//lst[@name='1']/arr[@name='tv_text']/str
	xml response was: <?xml version="1.0" encoding="UTF-8"?>
<response>
<lst name="responseHeader"><int name="status">0</int><int name="QTime">0</int></lst><result name="response" numFound="1" start="0"><doc><arr name="t_text"><str>a long day's night</str></arr><int name="id">1</int><arr name="range_facet_l"><long>1</long></arr><arr name="tv_text"><str>a long night's day</str></arr><long name="_version_">1486053541239848960</long><arr name="multiDefault"><str>muLti-Default</str></arr><int name="intDefault">42</int><date name="timestamp">2014-11-28T21:44:55.084Z</date></doc></result><lst name="highlighting"><lst name="1"><arr name="t_text"><str>a &lt;em&gt;long&lt;/em&gt; day's night</str></arr></lst></lst>
</response>

	request was:q=t_text:long&qt=standard&hl=true&start=0&hl.fl=t_text+tv_text&rows=200
	at org.apache.solr.SolrTestCaseJ4.assertQ(SolrTestCaseJ4.java:722)
	... 41 more




Build Log:
[...truncated 9607 lines...]
   [junit4] Suite: org.apache.solr.highlight.HighlighterTest
   [junit4]   2> Creating dataDir: C:\Users\JenkinsSlave\workspace\Lucene-Solr-trunk-Windows\solr\build\solr-core\test\J0\temp\solr.highlight.HighlighterTest-4EDD8F1920324033-001\init-core-data-001
   [junit4]   2> 4781373 T14306 oas.SolrTestCaseJ4.buildSSLConfig Randomized ssl (true) and clientAuth (true)
   [junit4]   2> 4781374 T14306 oas.SolrTestCaseJ4.initCore ####initCore
   [junit4]   2> 4781374 T14306 oasc.SolrResourceLoader.<init> new SolrResourceLoader for directory: 'C:\Users\JenkinsSlave\workspace\Lucene-Solr-trunk-Windows\solr\core\src\test-files\solr\collection1\'
   [junit4]   2> 4781376 T14306 oasc.SolrResourceLoader.replaceClassLoader Adding 'file:/C:/Users/JenkinsSlave/workspace/Lucene-Solr-trunk-Windows/solr/core/src/test-files/solr/collection1/lib/.svn/' to classloader
   [junit4]   2> 4781376 T14306 oasc.SolrResourceLoader.replaceClassLoader Adding 'file:/C:/Users/JenkinsSlave/workspace/Lucene-Solr-trunk-Windows/solr/core/src/test-files/solr/collection1/lib/classes/' to classloader
   [junit4]   2> 4781376 T14306 oasc.SolrResourceLoader.replaceClassLoader Adding 'file:/C:/Users/JenkinsSlave/workspace/Lucene-Solr-trunk-Windows/solr/core/src/test-files/solr/collection1/lib/README' to classloader
   [junit4]   2> 4781411 T14306 oasc.SolrConfig.<init> Using Lucene MatchVersion: 6.0.0
   [junit4]   2> 4781439 T14306 oasc.SolrConfig.<init> Loaded SolrConfig: solrconfig.xml
   [junit4]   2> 4781440 T14306 oass.IndexSchema.readSchema Reading Solr Schema from C:\Users\JenkinsSlave\workspace\Lucene-Solr-trunk-Windows\solr\core\src\test-files\solr\collection1\conf\schema.xml
   [junit4]   2> 4781442 T14306 oass.IndexSchema.readSchema [null] Schema name=test
   [junit4]   2> 4781494 T14306 oass.OpenExchangeRatesOrgProvider.init Initialized with rates=open-exchange-rates.json, refreshInterval=1440.
   [junit4]   2> 4781498 T14306 oass.IndexSchema.readSchema default search field in schema is text
   [junit4]   2> 4781498 T14306 oass.IndexSchema.readSchema unique key field: id
   [junit4]   2> 4781501 T14306 oass.FileExchangeRateProvider.reload Reloading exchange rates from file currency.xml
   [junit4]   2> 4781502 T14306 oass.FileExchangeRateProvider.reload Reloading exchange rates from file currency.xml
   [junit4]   2> 4781504 T14306 oass.OpenExchangeRatesOrgProvider.reload Reloading exchange rates from open-exchange-rates.json
   [junit4]   2> 4781505 T14306 oass.OpenExchangeRatesOrgProvider$OpenExchangeRates.<init> WARN Unknown key IMPORTANT NOTE
   [junit4]   2> 4781505 T14306 oass.OpenExchangeRatesOrgProvider$OpenExchangeRates.<init> WARN Expected key, got STRING
   [junit4]   2> 4781505 T14306 oass.OpenExchangeRatesOrgProvider.reload Reloading exchange rates from open-exchange-rates.json
   [junit4]   2> 4781506 T14306 oass.OpenExchangeRatesOrgProvider$OpenExchangeRates.<init> WARN Unknown key IMPORTANT NOTE
   [junit4]   2> 4781506 T14306 oass.OpenExchangeRatesOrgProvider$OpenExchangeRates.<init> WARN Expected key, got STRING
   [junit4]   2> 4781506 T14306 oasc.SolrResourceLoader.locateSolrHome JNDI not configured for solr (NoInitialContextEx)
   [junit4]   2> 4781507 T14306 oasc.SolrResourceLoader.locateSolrHome using system property solr.solr.home: C:\Users\JenkinsSlave\workspace\Lucene-Solr-trunk-Windows\solr\core\src\test-files\solr
   [junit4]   2> 4781507 T14306 oasc.SolrResourceLoader.<init> new SolrResourceLoader for directory: 'C:\Users\JenkinsSlave\workspace\Lucene-Solr-trunk-Windows\solr\core\src\test-files\solr\'
   [junit4]   2> 4781538 T14306 oasc.CoreContainer.<init> New CoreContainer 29568799
   [junit4]   2> 4781538 T14306 oasc.CoreContainer.load Loading cores into CoreContainer [instanceDir=C:\Users\JenkinsSlave\workspace\Lucene-Solr-trunk-Windows\solr\core\src\test-files\solr\]
   [junit4]   2> 4781538 T14306 oashc.HttpShardHandlerFactory.getParameter Setting socketTimeout to: 0
   [junit4]   2> 4781539 T14306 oashc.HttpShardHandlerFactory.getParameter Setting urlScheme to: null
   [junit4]   2> 4781540 T14306 oashc.HttpShardHandlerFactory.getParameter Setting connTimeout to: 0
   [junit4]   2> 4781540 T14306 oashc.HttpShardHandlerFactory.getParameter Setting maxConnectionsPerHost to: 20
   [junit4]   2> 4781540 T14306 oashc.HttpShardHandlerFactory.getParameter Setting maxConnections to: 10000
   [junit4]   2> 4781541 T14306 oashc.HttpShardHandlerFactory.getParameter Setting corePoolSize to: 0
   [junit4]   2> 4781541 T14306 oashc.HttpShardHandlerFactory.getParameter Setting maximumPoolSize to: 2147483647
   [junit4]   2> 4781541 T14306 oashc.HttpShardHandlerFactory.getParameter Setting maxThreadIdleTime to: 5
   [junit4]   2> 4781541 T14306 oashc.HttpShardHandlerFactory.getParameter Setting sizeOfQueue to: -1
   [junit4]   2> 4781541 T14306 oashc.HttpShardHandlerFactory.getParameter Setting fairnessPolicy to: false
   [junit4]   2> 4781550 T14306 oasu.UpdateShardHandler.<init> Creating UpdateShardHandler HTTP client with params: socketTimeout=30000&connTimeout=30000&retry=false
   [junit4]   2> 4781553 T14306 oasl.LogWatcher.createWatcher SLF4J impl is org.slf4j.impl.Log4jLoggerFactory
   [junit4]   2> 4781553 T14306 oasl.LogWatcher.newRegisteredLogWatcher Registering Log Listener [Log4j (org.slf4j.impl.Log4jLoggerFactory)]
   [junit4]   2> 4781554 T14306 oasc.CoreContainer.load Host Name: 
   [junit4]   2> 4781556 T14307 oasc.SolrResourceLoader.<init> new SolrResourceLoader for directory: 'C:\Users\JenkinsSlave\workspace\Lucene-Solr-trunk-Windows\solr\core\src\test-files\solr\collection1/'
   [junit4]   2> 4781557 T14307 oasc.SolrResourceLoader.replaceClassLoader Adding 'file:/C:/Users/JenkinsSlave/workspace/Lucene-Solr-trunk-Windows/solr/core/src/test-files/solr/collection1/lib/.svn/' to classloader
   [junit4]   2> 4781557 T14307 oasc.SolrResourceLoader.replaceClassLoader Adding 'file:/C:/Users/JenkinsSlave/workspace/Lucene-Solr-trunk-Windows/solr/core/src/test-files/solr/collection1/lib/classes/' to classloader
   [junit4]   2> 4781557 T14307 oasc.SolrResourceLoader.replaceClassLoader Adding 'file:/C:/Users/JenkinsSlave/workspace/Lucene-Solr-trunk-Windows/solr/core/src/test-files/solr/collection1/lib/README' to classloader
   [junit4]   2> 4781589 T14307 oasc.SolrConfig.<init> Using Lucene MatchVersion: 6.0.0
   [junit4]   2> 4781607 T14307 oasc.SolrConfig.<init> Loaded SolrConfig: solrconfig.xml
   [junit4]   2> 4781608 T14307 oass.IndexSchema.readSchema Reading Solr Schema from C:\Users\JenkinsSlave\workspace\Lucene-Solr-trunk-Windows\solr\core\src\test-files\solr\collection1/conf\schema.xml
   [junit4]   2> 4781612 T14307 oass.IndexSchema.readSchema [collection1] Schema name=test
   [junit4]   2> 4781668 T14307 oass.OpenExchangeRatesOrgProvider.init Initialized with rates=open-exchange-rates.json, refreshInterval=1440.
   [junit4]   2> 4781670 T14307 oass.IndexSchema.readSchema default search field in schema is text
   [junit4]   2> 4781671 T14307 oass.IndexSchema.readSchema unique key field: id
   [junit4]   2> 4781675 T14307 oass.FileExchangeRateProvider.reload Reloading exchange rates from file currency.xml
   [junit4]   2> 4781677 T14307 oass.FileExchangeRateProvider.reload Reloading exchange rates from file currency.xml
   [junit4]   2> 4781679 T14307 oass.OpenExchangeRatesOrgProvider.reload Reloading exchange rates from open-exchange-rates.json
   [junit4]   2> 4781679 T14307 oass.OpenExchangeRatesOrgProvider$OpenExchangeRates.<init> WARN Unknown key IMPORTANT NOTE
   [junit4]   2> 4781679 T14307 oass.OpenExchangeRatesOrgProvider$OpenExchangeRates.<init> WARN Expected key, got STRING
   [junit4]   2> 4781679 T14307 oass.OpenExchangeRatesOrgProvider.reload Reloading exchange rates from open-exchange-rates.json
   [junit4]   2> 4781679 T14307 oass.OpenExchangeRatesOrgProvider$OpenExchangeRates.<init> WARN Unknown key IMPORTANT NOTE
   [junit4]   2> 4781679 T14307 oass.OpenExchangeRatesOrgProvider$OpenExchangeRates.<init> WARN Expected key, got STRING
   [junit4]   2> 4781679 T14307 oasc.CoreContainer.create Creating SolrCore 'collection1' using configuration from instancedir C:\Users\JenkinsSlave\workspace\Lucene-Solr-trunk-Windows\solr\core\src\test-files\solr\collection1/
   [junit4]   2> 4781679 T14307 oasc.SolrCore.initDirectoryFactory org.apache.solr.core.MockDirectoryFactory
   [junit4]   2> 4781680 T14307 oasc.SolrCore.<init> [collection1] Opening new SolrCore at C:\Users\JenkinsSlave\workspace\Lucene-Solr-trunk-Windows\solr\core\src\test-files\solr\collection1/, dataDir=C:\Users\JenkinsSlave\workspace\Lucene-Solr-trunk-Windows\solr\build\solr-core\test\J0\temp\solr.highlight.HighlighterTest-4EDD8F1920324033-001\init-core-data-001\
   [junit4]   2> 4781680 T14307 oasc.JmxMonitoredMap.<init> JMX monitoring is enabled. Adding Solr mbeans to JMX Server: com.sun.jmx.mbeanserver.JmxMBeanServer@16a54f5
   [junit4]   2> 4781681 T14307 oasc.CachingDirectoryFactory.get return new directory for C:\Users\JenkinsSlave\workspace\Lucene-Solr-trunk-Windows\solr\build\solr-core\test\J0\temp\solr.highlight.HighlighterTest-4EDD8F1920324033-001\init-core-data-001\
   [junit4]   2> 4781681 T14307 oasc.SolrCore.getNewIndexDir New index directory detected: old=null new=C:\Users\JenkinsSlave\workspace\Lucene-Solr-trunk-Windows\solr\build\solr-core\test\J0\temp\solr.highlight.HighlighterTest-4EDD8F1920324033-001\init-core-data-001\index/
   [junit4]   2> 4781681 T14307 oasc.SolrCore.initIndex WARN [collection1] Solr index directory 'C:\Users\JenkinsSlave\workspace\Lucene-Solr-trunk-Windows\solr\build\solr-core\test\J0\temp\solr.highlight.HighlighterTest-4EDD8F1920324033-001\init-core-data-001\index' doesn't exist. Creating new index...
   [junit4]   2> 4781682 T14307 oasc.CachingDirectoryFactory.get return new directory for C:\Users\JenkinsSlave\workspace\Lucene-Solr-trunk-Windows\solr\build\solr-core\test\J0\temp\solr.highlight.HighlighterTest-4EDD8F1920324033-001\init-core-data-001\index
   [junit4]   2> 4781682 T14307 oasu.RandomMergePolicy.<init> RandomMergePolicy wrapping class org.apache.lucene.index.TieredMergePolicy: [TieredMergePolicy: maxMergeAtOnce=36, maxMergeAtOnceExplicit=40, maxMergedSegmentMB=97.5029296875, floorSegmentMB=0.529296875, forceMergeDeletesPctAllowed=25.154411483038537, segmentsPerTier=16.0, maxCFSSegmentSizeMB=8.796093022207999E12, noCFSRatio=0.2219039284489968
   [junit4]   2> 4781682 T14307 oasc.SolrDeletionPolicy.onCommit SolrDeletionPolicy.onCommit: commits: num=1
   [junit4]   2> 		commit{dir=RateLimitedDirectoryWrapper(MockDirectoryWrapper(RAMDirectory@d5ce72 lockFactory=org.apache.lucene.store.SingleInstanceLockFactory@a7b999)),segFN=segments_1,generation=1}
   [junit4]   2> 4781682 T14307 oasc.SolrDeletionPolicy.updateCommits newest commit generation = 1
   [junit4]   2> 4781683 T14307 oasc.SolrCore.initWriters created xml: solr.XMLResponseWriter
   [junit4]   2> 4781685 T14307 oasup.UpdateRequestProcessorChain.init creating updateRequestProcessorChain "dedupe"
   [junit4]   2> 4781686 T14307 oasup.UpdateRequestProcessorChain.init inserting DistributedUpdateProcessorFactory into updateRequestProcessorChain "dedupe"
   [junit4]   2> 4781686 T14307 oasup.UpdateRequestProcessorChain.init creating updateRequestProcessorChain "dedupe-allfields"
   [junit4]   2> 4781686 T14307 oasup.UpdateRequestProcessorChain.init inserting DistributedUpdateProcessorFactory into updateRequestProcessorChain "dedupe-allfields"
   [junit4]   2> 4781686 T14307 oasup.UpdateRequestProcessorChain.init creating updateRequestProcessorChain "stored_sig"
   [junit4]   2> 4781686 T14307 oasup.UpdateRequestProcessorChain.init inserting DistributedUpdateProcessorFactory into updateRequestProcessorChain "stored_sig"
   [junit4]   2> 4781686 T14307 oasup.UpdateRequestProcessorChain.init creating updateRequestProcessorChain "uniq-fields"
   [junit4]   2> 4781687 T14307 oasup.UpdateRequestProcessorChain.init inserting DistributedUpdateProcessorFactory into updateRequestProcessorChain "uniq-fields"
   [junit4]   2> 4781687 T14307 oasup.UpdateRequestProcessorChain.init creating updateRequestProcessorChain "distrib-dup-test-chain-explicit"
   [junit4]   2> 4781688 T14307 oasup.UpdateRequestProcessorChain.init creating updateRequestProcessorChain "distrib-dup-test-chain-implicit"
   [junit4]   2> 4781688 T14307 oasup.UpdateRequestProcessorChain.init inserting DistributedUpdateProcessorFactory into updateRequestProcessorChain "distrib-dup-test-chain-implicit"
   [junit4]   2> 4781688 T14307 oasc.SolrCore.loadUpdateProcessorChains no updateRequestProcessorChain defined as default, creating implicit default
   [junit4]   2> 4781689 T14307 oasc.RequestHandlers.initHandlersFromConfig created /update: org.apache.solr.handler.UpdateRequestHandler
   [junit4]   2> 4781689 T14307 oasc.RequestHandlers.initHandlersFromConfig created /update/json: org.apache.solr.handler.UpdateRequestHandler
   [junit4]   2> 4781689 T14307 oasc.RequestHandlers.initHandlersFromConfig created /update/csv: org.apache.solr.handler.UpdateRequestHandler
   [junit4]   2> 4781689 T14307 oasc.RequestHandlers.initHandlersFromConfig created /update/json/docs: org.apache.solr.handler.UpdateRequestHandler
   [junit4]   2> 4781690 T14307 oasc.RequestHandlers.initHandlersFromConfig created /config: org.apache.solr.handler.SolrConfigHandler
   [junit4]   2> 4781690 T14307 oasc.RequestHandlers.initHandlersFromConfig created /replication: org.apache.solr.handler.ReplicationHandler
   [junit4]   2> 4781691 T14307 oasc.RequestHandlers.initHandlersFromConfig created /get: org.apache.solr.handler.RealTimeGetHandler
   [junit4]   2> 4781691 T14307 oasc.RequestHandlers.initHandlersFromConfig created /admin/luke: org.apache.solr.handler.admin.LukeRequestHandler
   [junit4]   2> 4781692 T14307 oasc.RequestHandlers.initHandlersFromConfig created /admin/system: org.apache.solr.handler.admin.SystemInfoHandler
   [junit4]   2> 4781693 T14307 oasc.RequestHandlers.initHandlersFromConfig created /admin/mbeans: org.apache.solr.handler.admin.SolrInfoMBeanHandler
   [junit4]   2> 4781693 T14307 oasc.RequestHandlers.initHandlersFromConfig created /admin/plugins: org.apache.solr.handler.admin.PluginInfoHandler
   [junit4]   2> 4781693 T14307 oasc.RequestHandlers.initHandlersFromConfig created /admin/threads: org.apache.solr.handler.admin.ThreadDumpHandler
   [junit4]   2> 4781693 T14307 oasc.RequestHandlers.initHandlersFromConfig created /admin/properties: org.apache.solr.handler.admin.PropertiesRequestHandler
   [junit4]   2> 4781694 T14307 oasc.RequestHandlers.initHandlersFromConfig created /admin/logging: org.apache.solr.handler.admin.LoggingHandler
   [junit4]   2> 4781694 T14307 oasc.RequestHandlers.initHandlersFromConfig created /admin/ping: org.apache.solr.handler.PingRequestHandler
   [junit4]   2> 4781695 T14307 oasc.RequestHandlers.initHandlersFromConfig created standard: solr.StandardRequestHandler
   [junit4]   2> 4781695 T14307 oasc.RequestHandlers.initHandlersFromConfig created dismax: solr.SearchHandler
   [junit4]   2> 4781696 T14307 oasc.RequestHandlers.initHandlersFromConfig created mock: org.apache.solr.core.MockQuerySenderListenerReqHandler
   [junit4]   2> 4781696 T14307 oasc.RequestHandlers.initHandlersFromConfig created /admin/file: solr.admin.ShowFileRequestHandler
   [junit4]   2> 4781696 T14307 oasc.RequestHandlers.initHandlersFromConfig created /admin/fileedit: solr.admin.EditFileRequestHandler
   [junit4]   2> 4781696 T14307 oasc.RequestHandlers.initHandlersFromConfig created defaults: solr.StandardRequestHandler
   [junit4]   2> 4781696 T14307 oasc.RequestHandlers.initHandlersFromConfig adding lazy requestHandler: solr.StandardRequestHandler
   [junit4]   2> 4781696 T14307 oasc.RequestHandlers.initHandlersFromConfig created lazy: solr.StandardRequestHandler
   [junit4]   2> 4781697 T14307 oasc.RequestHandlers.initHandlersFromConfig created /terms: org.apache.solr.handler.component.SearchHandler
   [junit4]   2> 4781697 T14307 oasc.RequestHandlers.initHandlersFromConfig created spellCheckCompRH: org.apache.solr.handler.component.SearchHandler
   [junit4]   2> 4781698 T14307 oasc.RequestHandlers.initHandlersFromConfig created spellCheckCompRH_Direct: org.apache.solr.handler.component.SearchHandler
   [junit4]   2> 4781698 T14307 oasc.RequestHandlers.initHandlersFromConfig created spellCheckWithWordbreak: org.apache.solr.handler.component.SearchHandler
   [junit4]   2> 4781699 T14307 oasc.RequestHandlers.initHandlersFromConfig created spellCheckWithWordbreak_Direct: org.apache.solr.handler.component.SearchHandler
   [junit4]   2> 4781699 T14307 oasc.RequestHandlers.initHandlersFromConfig created spellCheckCompRH1: org.apache.solr.handler.component.SearchHandler
   [junit4]   2> 4781699 T14307 oasc.RequestHandlers.initHandlersFromConfig created mltrh: org.apache.solr.handler.component.SearchHandler
   [junit4]   2> 4781699 T14307 oasc.RequestHandlers.initHandlersFromConfig created tvrh: org.apache.solr.handler.component.SearchHandler
   [junit4]   2> 4781700 T14307 oasc.RequestHandlers.initHandlersFromConfig created /mlt: solr.MoreLikeThisHandler
   [junit4]   2> 4781700 T14307 oasc.RequestHandlers.initHandlersFromConfig created /debug/dump: solr.DumpRequestHandler
   [junit4]   2> 4781704 T14307 oashl.XMLLoader.init xsltCacheLifetimeSeconds=60
   [junit4]   2> 4781705 T14307 oashl.XMLLoader.init xsltCacheLifetimeSeconds=60
   [junit4]   2> 4781706 T14307 oashl.XMLLoader.init xsltCacheLifetimeSeconds=60
   [junit4]   2> 4781707 T14307 oashl.XMLLoader.init xsltCacheLifetimeSeconds=60
   [junit4]   2> 4781708 T14307 oasc.SolrCore.initDeprecatedSupport WARN solrconfig.xml uses deprecated <admin/gettableFiles>, Please update your config to use the ShowFileRequestHandler.
   [junit4]   2> 4781711 T14307 oasu.CommitTracker.<init> Hard AutoCommit: disabled
   [junit4]   2> 4781711 T14307 oasu.CommitTracker.<init> Soft AutoCommit: disabled
   [junit4]   2> 4781712 T14307 oasu.RandomMergePolicy.<init> RandomMergePolicy wrapping class org.apache.lucene.index.TieredMergePolicy: [TieredMergePolicy: maxMergeAtOnce=17, maxMergeAtOnceExplicit=47, maxMergedSegmentMB=88.35546875, floorSegmentMB=1.337890625, forceMergeDeletesPctAllowed=13.906664428529407, segmentsPerTier=20.0, maxCFSSegmentSizeMB=8.796093022207999E12, noCFSRatio=0.7287409394917699
   [junit4]   2> 4781713 T14307 oasc.SolrDeletionPolicy.onInit SolrDeletionPolicy.onInit: commits: num=1
   [junit4]   2> 		commit{dir=RateLimitedDirectoryWrapper(MockDirectoryWrapper(RAMDirectory@d5ce72 lockFactory=org.apache.lucene.store.SingleInstanceLockFactory@a7b999)),segFN=segments_1,generation=1}
   [junit4]   2> 4781713 T14307 oasc.SolrDeletionPolicy.updateCommits newest commit generation = 1
   [junit4]   2> 4781713 T14307 oass.SolrIndexSearcher.<init> Opening Searcher@e905c6[collection1] main
   [junit4]   2> 4781713 T14307 oasr.RestManager.init Initializing RestManager with initArgs: {storageIO=org.apache.solr.rest.ManagedResourceStorage$InMemoryStorageIO}
   [junit4]   2> 4781714 T14307 oasr.ManagedResourceStorage.load Reading _rest_managed.json using InMemoryStorage
   [junit4]   2> 4781714 T14307 oasr.ManagedResource.reloadFromStorage WARN No stored data found for /rest/managed
   [junit4]   2> 4781715 T14307 oasr.ManagedResourceStorage$JsonStorage.store Saved JSON object to path _rest_managed.json using InMemoryStorage
   [junit4]   2> 4781715 T14307 oasr.RestManager.init Initializing 0 registered ManagedResources
   [junit4]   2> 4781716 T14307 oashc.SpellCheckComponent.inform Initializing spell checkers
   [junit4]   2> 4781728 T14307 oass.DirectSolrSpellChecker.init init: {name=direct,classname=DirectSolrSpellChecker,field=lowerfilt,minQueryLength=3}
   [junit4]   2> 4781781 T14307 oash.ReplicationHandler.inform Commits will be reserved for  10000
   [junit4]   2> 4781782 T14308 oasc.SolrCore.registerSearcher [collection1] Registered new searcher Searcher@e905c6[collection1] main{ExitableDirectoryReader(UninvertingDirectoryReader())}
   [junit4]   2> 4781782 T14307 oasc.CoreContainer.registerCore registering core: collection1
   [junit4]   2> 4781785 T14306 oas.SolrTestCaseJ4.initCore ####initCore end
   [junit4]   2> 4781790 T14306 oas.SolrTestCaseJ4.setUp ###Starting testPreserveMulti
   [junit4]   2> ASYNC  NEW_CORE C4273 name=collection1 org.apache.solr.core.SolrCore@19d3a20
   [junit4]   2> 4781792 T14306 C4273 oasup.LogUpdateProcessor.finish [collection1] webapp=null path=null params={} {add=[1 (1486053540672569344)]} 0 1
   [junit4]   2> 4781794 T14306 C4273 oasu.DirectUpdateHandler2.commit start commit{,optimize=false,openSearcher=true,waitSearcher=true,expungeDeletes=false,softCommit=false,prepareCommit=false}
   [junit4]   2> 4781795 T14306 C4273 oasc.SolrDeletionPolicy.onCommit SolrDeletionPolicy.onCommit: commits: num=2
   [junit4]   2> 		commit{dir=RateLimitedDirectoryWrapper(MockDirectoryWrapper(RAMDirectory@d5ce72 lockFactory=org.apache.lucene.store.SingleInstanceLockFactory@a7b999)),segFN=segments_1,generation=1}
   [junit4]   2> 		commit{dir=RateLimitedDirectoryWrapper(MockDirectoryWrapper(RAMDirectory@d5ce72 lockFactory=org.apache.lucene.store.SingleInstanceLockFactory@a7b999)),segFN=segments_2,generation=2}
   [junit4]   2> 4781797 T14306 C4273 oasc.SolrDeletionPolicy.updateCommits newest commit generation = 2
   [junit4]   2> 4781797 T14306 C4273 oass.SolrIndexSearcher.<init> Opening Searcher@1d92c55[collection1] main
   [junit4]   2> 4781798 T14306 C4273 oasu.DirectUpdateHandler2.commit end_commit_flush
   [junit4]   2> 4781799 T14308 oasc.SolrCore.registerSearcher [collection1] Registered new searcher Searcher@1d92c55[collection1] main{ExitableDirectoryReader(UninvertingDirectoryReader(Uninverting(_0(6.0.0):C1)))}
   [junit4]   2> 4781800 T14306 C4273 oasup.LogUpdateProcessor.finish [collection1] webapp=null path=null params={} {commit=} 0 6
   [junit4]   2> 4781801 T14306 C4273 oasc.SolrCore.execute [collection1] webapp=null path=null params={hl.snippets=2&q=cat:monitor&f.cat.hl.preserveMulti=true&hl=true&hl.fl=cat&wt=xml} hits=1 status=0 QTime=0 
   [junit4]   2> 4781802 T14306 C4273 oasc.SolrCore.execute [collection1] webapp=null path=null params={hl.snippets=2&q=id:1+OR+cat:duuuude&f.cat.hl.preserveMulti=true&hl=true&hl.fl=cat&wt=xml} hits=1 status=0 QTime=1 
   [junit4]   2> 4781803 T14306 C4273 oass.SolrIndexSearcher.<init> Opening Searcher@81cdd[collection1] realtime
   [junit4]   2> 4781803 T14306 C4273 oasup.LogUpdateProcessor.finish [collection1] webapp=null path=null params={} {deleteByQuery=*:* (-1486053540685152256)} 0 1
   [junit4]   2> 4781804 T14306 oas.SolrTestCaseJ4.tearDown ###Ending testPreserveMulti
   [junit4]   2> 4781811 T14306 oas.SolrTestCaseJ4.setUp ###Starting testSubwordWildcardHighlightWithTermOffsets2
   [junit4]   2> 4781812 T14306 C4273 oasup.LogUpdateProcessor.finish [collection1] webapp=null path=null params={} {add=[1 (1486053540694589440)]} 0 1
   [junit4]   2> 4781813 T14306 C4273 oasu.DirectUpdateHandler2.commit start commit{,optimize=false,openSearcher=true,waitSearcher=true,expungeDeletes=false,softCommit=false,prepareCommit=false}
   [junit4]   2> 4781814 T14306 C4273 oasc.SolrDeletionPolicy.onCommit SolrDeletionPolicy.onCommit: commits: num=2
   [junit4]   2> 		commit{dir=RateLimitedDirectoryWrapper(MockDirectoryWrapper(RAMDirectory@d5ce72 lockFactory=org.apache.lucene.store.SingleInstanceLockFactory@a7b999)),segFN=segments_2,generation=2}
   [junit4]   2> 		commit{dir=RateLimitedDirectoryWrapper(MockDirectoryWrapper(RAMDirectory@d5ce72 lockFactory=org.apache.lucene.store.SingleInstanceLockFactory@a7b999)),segFN=segments_3,generation=3}
   [junit4]   2> 4781815 T14306 C4273 oasc.SolrDeletionPolicy.updateCommits newest commit generation = 3
   [junit4]   2> 4781817 T14306 C4273 oass.SolrIndexSearcher.<init> Opening Searcher@a09655[collection1] main
   [junit4]   2> 4781817 T14306 C4273 oasu.DirectUpdateHandler2.commit end_commit_flush
   [junit4]   2> 4781818 T14308 oasc.SolrCore.registerSearcher [collection1] Registered new searcher Searcher@a09655[collection1] main{ExitableDirectoryReader(UninvertingDirectoryReader(Uninverting(_1(6.0.0):C1)))}
   [junit4]   2> 4781819 T14306 C4273 oasup.LogUpdateProcessor.finish [collection1] webapp=null path=null params={} {commit=} 0 6
   [junit4]   2> 4781821 T14306 C4273 oasc.SolrCore.execute [collection1] webapp=null path=null params={q=subword_offsets:pow*&hl=true&hl.fl=subword_offsets&wt=xml} hits=1 status=0 QTime=1 
   [junit4]   2> 4781823 T14306 oas.SolrTestCaseJ4.assertQ ERROR REQUEST FAILED: xpath=//lst[@name='highlighting']/lst[@name='1']/arr[@name='subword_offsets']/str='lorem <em>PowerShot</em> ipsum'
   [junit4]   2> 		xml response was: <?xml version="1.0" encoding="UTF-8"?>
   [junit4]   2> 	<response>
   [junit4]   2> 	<lst name="responseHeader"><int name="status">0</int><int name="QTime">1</int></lst><result name="response" numFound="1" start="0"><doc><arr name="subword_offsets"><str>lorem PowerShot ipsum</str></arr><int name="id">1</int><arr name="range_facet_l"><long>1</long></arr><long name="_version_">1486053540694589440</long><arr name="multiDefault"><str>muLti-Default</str></arr><int name="intDefault">42</int><date name="timestamp">2014-11-28T21:44:54.564Z</date></doc></result><lst name="highlighting"><lst name="1"/></lst>
   [junit4]   2> 	</response>
   [junit4]   2> 	
   [junit4]   2> 		request was:q=subword_offsets:pow*&hl=true&hl.fl=subword_offsets&wt=xml
   [junit4]   2> 4781824 T14306 oasc.SolrException.log ERROR REQUEST FAILED: q=subword_offsets:pow*&hl=true&hl.fl=subword_offsets&wt=xml:java.lang.RuntimeException: REQUEST FAILED: xpath=//lst[@name='highlighting']/lst[@name='1']/arr[@name='subword_offsets']/str='lorem <em>PowerShot</em> ipsum'
   [junit4]   2> 		xml response was: <?xml version="1.0" encoding="UTF-8"?>
   [junit4]   2> 	<response>
   [junit4]   2> 	<lst name="responseHeader"><int name="status">0</int><int name="QTime">1</int></lst><result name="response" numFound="1" start="0"><doc><arr name="subword_offsets"><str>lorem PowerShot ipsum</str></arr><int name="id">1</int><arr name="range_facet_l"><long>1</long></arr><long name="_version_">1486053540694589440</long><arr name="multiDefault"><str>muLti-Default</str></arr><int name="intDefault">42</int><date name="timestamp">2014-11-28T21:44:54.564Z</date></doc></result><lst name="highlighting"><lst name="1"/></lst>
   [junit4]   2> 	</response>
   [junit4]   2> 	
   [junit4]   2> 		request was:q=subword_offsets:pow*&hl=true&hl.fl=subword_offsets&wt=xml
   [junit4]   2> 		at org.apache.solr.SolrTestCaseJ4.assertQ(SolrTestCaseJ4.java:722)
   [junit4]   2> 		at org.apache.solr.highlight.HighlighterTest.testSubwordWildcardHighlightWithTermOffsets2(HighlighterTest.java:843)
   [junit4]   2> 		at sun.reflect.NativeMethodAccessorImpl.invoke0(Native Method)
   [junit4]   2> 		at sun.reflect.NativeMethodAccessorImpl.invoke(NativeMethodAccessorImpl.java:62)
   [junit4]   2> 		at sun.reflect.DelegatingMethodAccessorImpl.invoke(DelegatingMethodAccessorImpl.java:43)
   [junit4]   2> 		at java.lang.reflect.Method.invoke(Method.java:483)
   [junit4]   2> 		at com.carrotsearch.randomizedtesting.RandomizedRunner.invoke(RandomizedRunner.java:1618)
   [junit4]   2> 		at com.carrotsearch.randomizedtesting.RandomizedRunner$6.evaluate(RandomizedRunner.java:827)
   [junit4]   2> 		at com.carrotsearch.randomizedtesting.RandomizedRunner$7.evaluate(RandomizedRunner.java:863)
   [junit4]   2> 		at com.carrotsearch.randomizedtesting.RandomizedRunner$8.evaluate(RandomizedRunner.java:877)
   [junit4]   2> 		at com.carrotsearch.randomizedtesting.rules.SystemPropertiesRestoreRule$1.evaluate(SystemPropertiesRestoreRule.java:53)
   [junit4]   2> 		at org.apache.lucene.util.TestRuleSetupTeardownChained$1.evaluate(TestRuleSetupTeardownChained.java:50)
   [junit4]   2> 		at org.apache.lucene.util.AbstractBeforeAfterRule$1.evaluate(AbstractBeforeAfterRule.java:46)
   [junit4]   2> 		at com.carrotsearch.randomizedtesting.rules.SystemPropertiesInvariantRule$1.evaluate(SystemPropertiesInvariantRule.java:55)
   [junit4]   2> 		at org.apache.lucene.util.TestRuleThreadAndTestName$1.evaluate(TestRuleThreadAndTestName.java:49)
   [junit4]   2> 		at org.apache.lucene.util.TestRuleIgnoreAfterMaxFailures$1.evaluate(TestRuleIgnoreAfterMaxFailures.java:65)
   [junit4]   2> 		at org.apache.lucene.util.TestRuleMarkFailure$1.evaluate(TestRuleMarkFailure.java:48)
   [junit4]   2> 		at com.carrotsearch.randomizedtesting.rules.StatementAdapter.evaluate(StatementAdapter.java:36)
   [junit4]   2> 		at com.carrotsearch.randomizedtesting.ThreadLeakControl$StatementRunner.run(ThreadLeakControl.java:365)
   [junit4]   2> 		at com.carrotsearch.randomizedtesting.ThreadLeakControl.forkTimeoutingTask(ThreadLeakControl.java:798)
   [junit4]   2> 		at com.carrotsearch.randomizedtesting.ThreadLeakControl$3.evaluate(ThreadLeakControl.java:458)
   [junit4]   2> 		at com.carrotsearch.randomizedtesting.RandomizedRunner.runSingleTest(RandomizedRunner.java:836)
   [junit4]   2> 		at com.carrotsearch.randomizedtesting.RandomizedRunner$3.evaluate(RandomizedRunner.java:738)
   [junit4]   2> 		at com.carrotsearch.randomizedtesting.RandomizedRunner$4.evaluate(RandomizedRunner.java:772)
   [junit4]   2> 		at com.carrotsearch.randomizedtesting.RandomizedRunner$5.evaluate(RandomizedRunner.java:783)
   [junit4]   2> 		at com.carrotsearch.randomizedtesting.rules.StatementAdapter.evaluate(StatementAdapter.java:36)
   [junit4]   2> 		at com.carrotsearch.randomizedtesting.rules.SystemPropertiesRestoreRule$1.evaluate(SystemPropertiesRestoreRule.java:53)
   [junit4]   2> 		at org.apache.lucene.util.AbstractBeforeAfterRule$1.evaluate(AbstractBeforeAfterRule.java:46)
   [junit4]   2> 		at org.apache.lucene.util.TestRuleStoreClassName$1.evaluate(TestRuleStoreClassName.java:42)
   [junit4]   2> 		at com.carrotsearch.randomizedtesting.rules.SystemPropertiesInvariantRule$1.evaluate(SystemPropertiesInvariantRule.java:55)
   [junit4]   2> 		at com.carrotsearch.randomizedtesting.rules.NoShadowingOrOverridesOnMethodsRule$1.evaluate(NoShadowingOrOverridesOnMethodsRule.java:39)
   [junit4]   2> 		at com.carrotsearch.randomizedtesting.rules.NoShadowingOrOverridesOnMethodsRule$1.evaluate(NoShadowingOrOverridesOnMethodsRule.java:39)
   [junit4]   2> 		at com.carrotsearch.randomizedtesting.rules.StatementAdapter.evaluate(StatementAdapter.java:36)
   [junit4]   2> 		at com.carrotsearch.randomizedtesting.rules.StatementAdapter.evaluate(StatementAdapter.java:36)
   [junit4]   2> 		at com.carrotsearch.randomizedtesting.rules.StatementAdapter.evaluate(StatementAdapter.java:36)
   [junit4]   2> 		at org.apache.lucene.util.TestRuleAssertionsRequired$1.evaluate(TestRuleAssertionsRequired.java:54)
   [junit4]   2> 		at org.apache.lucene.util.TestRuleMarkFailure$1.evaluate(TestRuleMarkFailure.java:48)
   [junit4]   2> 		at org.apache.lucene.util.TestRuleIgnoreAfterMaxFailures$1.evaluate(TestRuleIgnoreAfterMaxFailures.java:65)
   [junit4]   2> 		at org.apache.lucene.util.TestRuleIgnoreTestSuites$1.evaluate(TestRuleIgnoreTestSuites.java:55)
   [junit4]   2> 		at com.carrotsearch.randomizedtesting.rules.StatementAdapter.evaluate(StatementAdapter.java:36)
   [junit4]   2> 		at com.carrotsearch.randomizedtesting.ThreadLeakControl$StatementRunner.run(ThreadLeakControl.java:365)
   [junit4]   2> 		at java.lang.Thread.run(Thread.java:745)
   [junit4]   2> 	
   [junit4]   2> 4781826 T14306 C4273 oass.SolrIndexSearcher.<init> Opening Searcher@18775e8[collection1] realtime
   [junit4]   2> 4781826 T14306 C4273 oasup.LogUpdateProcessor.finish [collection1] webapp=null path=null params={} {deleteByQuery=*:* (-1486053540708220928)} 0 1
   [junit4]   2> 4781827 T14306 oas.SolrTestCaseJ4.tearDown ###Ending testSubwordWildcardHighlightWithTermOffsets2
   [junit4]   2> NOTE: reproduce with: ant test  -Dtestcase=HighlighterTest -Dtests.method=testSubwordWildcardHighlightWithTermOffsets2 -Dtests.seed=4EDD8F1920324033 -Dtests.slow=true -Dtests.locale=ja_JP -Dtests.timezone=Asia/Qatar -Dtests.asserts=true -Dtests.file.encoding=US-ASCII
   [junit4] ERROR   0.03s | HighlighterTest.testSubwordWildcardHighlightWithTermOffsets2 <<<
   [junit4]    > Throwable #1: java.lang.RuntimeException: Exception during query
   [junit4]    > 	at __randomizedtesting.SeedInfo.seed([4EDD8F1920324033:7C7ED490E09EBA5D]:0)
   [junit4]    > 	at org.apache.solr.SolrTestCaseJ4.assertQ(SolrTestCaseJ4.java:729)
   [junit4]    > 	at org.apache.solr.highlight.HighlighterTest.testSubwordWildcardHighlightWithTermOffsets2(HighlighterTest.java:843)
   [junit4]    > 	at java.lang.Thread.run(Thread.java:745)
   [junit4]    > Caused by: java.lang.RuntimeException: REQUEST FAILED: xpath=//lst[@name='highlighting']/lst[@name='1']/arr[@name='subword_offsets']/str='lorem <em>PowerShot</em> ipsum'
   [junit4]    > 	xml response was: <?xml version="1.0" encoding="UTF-8"?>
   [junit4]    > <response>
   [junit4]    > <lst name="responseHeader"><int name="status">0</int><int name="QTime">1</int></lst><result name="response" numFound="1" start="0"><doc><arr name="subword_offsets"><str>lorem PowerShot ipsum</str></arr><int name="id">1</int><arr name="range_facet_l"><long>1</long></arr><long name="_version_">1486053540694589440</long><arr name="multiDefault"><str>muLti-Default</str></arr><int name="intDefault">42</int><date name="timestamp">2014-11-28T21:44:54.564Z</date></doc></result><lst name="highlighting"><lst name="1"/></lst>
   [junit4]    > </response>
   [junit4]    > 	request was:q=subword_offsets:pow*&hl=true&hl.fl=subword_offsets&wt=xml
   [junit4]    > 	at org.apache.solr.SolrTestCaseJ4.assertQ(SolrTestCaseJ4.java:722)
   [junit4]    > 	... 41 more
   [junit4]   2> 4781838 T14306 oas.SolrTestCaseJ4.setUp ###Starting testGetHighlightFields
   [junit4]   2> 4781839 T14306 C4273 oasup.LogUpdateProcessor.finish [collection1] webapp=null path=null params={} {add=[0 (1486053540722900992)]} 0 0
   [junit4]   2> 4781840 T14306 C4273 oasu.DirectUpdateHandler2.commit start commit{,optimize=false,openSearcher=true,waitSearcher=true,expungeDeletes=false,softCommit=false,prepareCommit=false}
   [junit4]   2> 4781841 T14306 C4273 oasc.SolrDeletionPolicy.onCommit SolrDeletionPolicy.onCommit: commits: num=2
   [junit4]   2> 		commit{dir=RateLimitedDirectoryWrapper(MockDirectoryWrapper(RAMDirectory@d5ce72 lockFactory=org.apache.lucene.store.SingleInstanceLockFactory@a7b999)),segFN=segments_3,generation=3}
   [junit4]   2> 		commit{dir=RateLimitedDirectoryWrapper(MockDirectoryWrapper(RAMDirectory@d5ce72 lockFactory=org.apache.lucene.store.SingleInstanceLockFactory@a7b999)),segFN=segments_4,generation=4}
   [junit4]   2> 4781841 T14306 C4273 oasc.SolrDeletionPolicy.updateCommits newest commit generation = 4
   [junit4]   2> 4781842 T14306 C4273 oass.SolrIndexSearcher.<init> Opening Searcher@1d346ab[collection1] main
   [junit4]   2> 4781844 T14306 C4273 oasu.DirectUpdateHandler2.commit end_commit_flush
   [junit4]   2> 4781844 T14308 oasc.SolrCore.registerSearcher [collection1] Registered new searcher Searcher@1d346ab[collection1] main{ExitableDirectoryReader(UninvertingDirectoryReader(Uninverting(_2(6.0.0):C1)))}
   [junit4]   2> 4781845 T14306 C4273 oasup.LogUpdateProcessor.finish [collection1] webapp=null path=null params={} {commit=} 0 5
   [junit4]   2> 4781846 T14306 C4273 oasu.DirectUpdateHandler2.commit start commit{,optimize=true,openSearcher=true,waitSearcher=true,expungeDeletes=false,softCommit=false,prepareCommit=false}
   [junit4]   2> 4781846 T14306 C4273 oasu.DirectUpdateHandler2.commit No uncommitted changes. Skipping IW.commit.
   [junit4]   2> 4781846 T14306 C4273 oasc.SolrCore.openNewSearcher SolrIndexSearcher has not changed - not re-opening: org.apache.solr.search.SolrIndexSearcher
   [junit4]   2> 4781847 T14306 C4273 oasu.DirectUpdateHandler2.commit end_commit_flush
   [junit4]   2> 4781847 T14306 C4273 oasup.LogUpdateProcessor.finish [collection1] webapp=null path=null params={} {optimize=} 0 1
   [junit4]   2> 4781848 T14306 C4273 oass.SolrIndexSearcher.<init> Opening Searcher@246afe[collection1] realtime
   [junit4]   2> 4781848 T14306 C4273 oasup.LogUpdateProcessor.finish [collection1] webapp=null path=null params={} {deleteByQuery=*:* (-1486053540731289600)} 0 1
   [junit4]   2> 4781849 T14306 oas.SolrTestCaseJ4.tearDown ###Ending testGetHighlightFields
   [junit4]   2> 4781856 T14306 oas.SolrTestCaseJ4.setUp ###Starting testPhraseHighlighter
   [junit4]   2> 4781857 T14306 C4273 oasup.LogUpdateProcessor.finish [collection1] webapp=null path=null params={} {add=[1 (1486053540741775360)]} 0 1
   [junit4]   2> 4781857 T14306 C4273 oasu.DirectUpdateHandler2.commit start commit{,optimize=false,openSearcher=true,waitSearcher=true,expungeDeletes=false,softCommit=false,prepareCommit=false}
   [junit4]   2> 4781858 T14306 C4273 oasc.SolrDeletionPolicy.onCommit SolrDeletionPolicy.onCommit: commits: num=2
   [junit4]   2> 		commit{dir=RateLimitedDirectoryWrapper(MockDirectoryWrapper(RAMDirectory@d5ce72 lockFactory=org.apache.lucene.store.SingleInstanceLockFactory@a7b999)),segFN=segments_4,generation=4}
   [junit4]   2> 		commit{dir=RateLimitedDirectoryWrapper(MockDirectoryWrapper(RAMDirectory@d5ce72 lockFactory=org.apache.lucene.store.SingleInstanceLockFactory@a7b999)),segFN=segments_5,generation=5}
   [junit4]   2> 4781859 T14306 C4273 oasc.SolrDeletionPolicy.updateCommits newest commit generation = 5
   [junit4]   2> 4781861 T14306 C4273 oass.SolrIndexSearcher.<init> Opening Searcher@158d970[collection1] main
   [junit4]   2> 4781861 T14306 C4273 oasu.DirectUpdateHandler2.commit end_commit_flush
   [junit4]   2> 4781862 T14308 oasc.SolrCore.registerSearcher [collection1] Registered new searcher Searcher@158d970[collection1] main{ExitableDirectoryReader(UninvertingDirectoryReader(Uninverting(_3(6.0.0):C1)))}
   [junit4]   2> 4781863 T14306 C4273 oasup.LogUpdateProcessor.finish [collection1] webapp=null path=null params={} {commit=} 0 6
   [junit4]   2> 4781864 T14306 C4273 oasu.Direc

[...truncated too long message...]

evaluate(TestRuleMarkFailure.java:48)
   [junit4]   2> 	at org.apache.lucene.util.TestRuleIgnoreAfterMaxFailures$1.evaluate(TestRuleIgnoreAfterMaxFailures.java:65)
   [junit4]   2> 	at org.apache.lucene.util.TestRuleIgnoreTestSuites$1.evaluate(TestRuleIgnoreTestSuites.java:55)
   [junit4]   2> 	at com.carrotsearch.randomizedtesting.rules.StatementAdapter.evaluate(StatementAdapter.java:36)
   [junit4]   2> 	at com.carrotsearch.randomizedtesting.ThreadLeakControl$StatementRunner.run(ThreadLeakControl.java:365)
   [junit4]   2> 	at java.lang.Thread.run(Thread.java:745)
   [junit4]   2> 
   [junit4]   2> 4782412 T14306 oasc.CachingDirectoryFactory.close Closing MockDirectoryFactory - 2 directories currently being tracked
   [junit4]   2> 4782412 T14306 oasc.CachingDirectoryFactory.closeCacheValue looking to close C:\Users\JenkinsSlave\workspace\Lucene-Solr-trunk-Windows\solr\build\solr-core\test\J0\temp\solr.highlight.HighlighterTest-4EDD8F1920324033-001\init-core-data-001\ [CachedDir<<refCount=0;path=C:\Users\JenkinsSlave\workspace\Lucene-Solr-trunk-Windows\solr\build\solr-core\test\J0\temp\solr.highlight.HighlighterTest-4EDD8F1920324033-001\init-core-data-001\;done=false>>]
   [junit4]   2> 4782412 T14306 oasc.CachingDirectoryFactory.close Closing directory: C:\Users\JenkinsSlave\workspace\Lucene-Solr-trunk-Windows\solr\build\solr-core\test\J0\temp\solr.highlight.HighlighterTest-4EDD8F1920324033-001\init-core-data-001\
   [junit4]   2> 4782412 T14306 oasc.CachingDirectoryFactory.closeCacheValue looking to close C:\Users\JenkinsSlave\workspace\Lucene-Solr-trunk-Windows\solr\build\solr-core\test\J0\temp\solr.highlight.HighlighterTest-4EDD8F1920324033-001\init-core-data-001\index [CachedDir<<refCount=0;path=C:\Users\JenkinsSlave\workspace\Lucene-Solr-trunk-Windows\solr\build\solr-core\test\J0\temp\solr.highlight.HighlighterTest-4EDD8F1920324033-001\init-core-data-001\index;done=false>>]
   [junit4]   2> 4782412 T14306 oasc.CachingDirectoryFactory.close Closing directory: C:\Users\JenkinsSlave\workspace\Lucene-Solr-trunk-Windows\solr\build\solr-core\test\J0\temp\solr.highlight.HighlighterTest-4EDD8F1920324033-001\init-core-data-001\index
   [junit4]   2> NOTE: leaving temporary files on disk at: C:\Users\JenkinsSlave\workspace\Lucene-Solr-trunk-Windows\solr\build\solr-core\test\J0\temp\solr.highlight.HighlighterTest-4EDD8F1920324033-001
   [junit4]   2> NOTE: test params are: codec=Asserting(Lucene50), sim=DefaultSimilarity, locale=ja_JP, timezone=Asia/Qatar
   [junit4]   2> NOTE: Windows 7 6.1 x86/Oracle Corporation 1.8.0_20 (32-bit)/cpus=2,threads=1,free=199616816,total=470548480
   [junit4]   2> NOTE: All tests run in this JVM: [ShardRoutingTest, TestHighlightDedupGrouping, TestOrdValues, ExitableDirectoryReaderTest, OverriddenZkACLAndCredentialsProvidersTest, AddBlockUpdateTest, TestSerializedLuceneMatchVersion, TestPostingsSolrHighlighter, ScriptEngineTest, TestLuceneMatchVersion, OverseerRolesTest, DefaultValueUpdateProcessorTest, RequestHandlersTest, TestAddFieldRealTimeGet, TestPseudoReturnFields, AnalyticsQueryTest, TestWriterPerf, TestRecovery, LeaderFailoverAfterPartitionTest, TestIndexSearcher, InfoHandlerTest, FullSolrCloudDistribCmdsTest, TestReloadAndDeleteDocs, StatelessScriptUpdateProcessorFactoryTest, ParsingFieldUpdateProcessorsTest, TestUniqueKeyFieldResource, TestReplicationHandler, PathHierarchyTokenizerFactoryTest, TestCursorMarkWithoutUniqueKey, TestPivotHelperCode, RequiredFieldsTest, DistribDocExpirationUpdateProcessorTest, TestReplicaProperties, TestNonNRTOpen, SliceStateTest, SolrInfoMBeanTest, BlockDirectoryTest, TestTrie, UniqFieldsUpdateProcessorFactoryTest, BadComponentTest, CircularListTest, MergeStrategyTest, TestLazyCores, ModifyConfFileTest, BasicZkTest, TestCloudPivotFacet, HdfsCollectionsAPIDistributedZkTest, SSLMigrationTest, SuggesterWFSTTest, TestManagedResource, JSONWriterTest, TestSolrIndexConfig, TestCollapseQParserPlugin, PrimitiveFieldTypeTest, RankQueryTest, TestRandomDVFaceting, AtomicUpdatesTest, TestJmxMonitoredMap, MultiTermTest, SearchHandlerTest, TestDistributedMissingSort, LeaderElectionIntegrationTest, TermVectorComponentDistributedTest, FileUtilsTest, ReplicationFactorTest, TestSchemaSimilarityResource, ZkSolrClientTest, ResourceLoaderTest, EnumFieldTest, TestDocumentBuilder, PreAnalyzedFieldTest, TestTolerantSearch, LegacyHTMLStripCharFilterTest, TestSolrQueryParser, TestRawResponseWriter, TestLFUCache, TestInitQParser, ClusterStateTest, ChangedSchemaMergeTest, CollectionsAPIAsyncDistributedZkTest, LeaderInitiatedRecoveryOnCommitTest, HdfsLockFactoryTest, BadCopyFieldTest, AssignTest, TestFaceting, PolyFieldTest, URLClassifyProcessorTest, RollingRestartTest, SolrTestCaseJ4Test, PreAnalyzedUpdateProcessorTest, TestCollectionAPI, AnalysisErrorHandlingTest, TestImplicitCoreProperties, HardAutoCommitTest, TestModifyConfFiles, TestSolrCoreProperties, TestRealTimeGet, TestCloudSchemaless, TestCollationFieldDocValues, BasicDistributedZkTest, LukeRequestHandlerTest, SynonymTokenizerTest, TestManagedSchemaFieldResource, TestUtils, TestCoreContainer, AutoCommitTest, TestSolrXmlPersistor, TestPhraseSuggestions, TestStressLucene, TestSimpleQParserPlugin, JsonLoaderTest, TestSurroundQueryParser, BinaryUpdateRequestHandlerTest, DistributedExpandComponentTest, ConnectionManagerTest, TestStandardQParsers, TestStressUserVersions, TestFuzzyAnalyzedSuggestions, DistanceFunctionTest, TestFastLRUCache, OpenExchangeRatesOrgProviderTest, TestSolr4Spatial2, FileBasedSpellCheckerTest, TestSearchPerf, TermVectorComponentTest, TestRestManager, PluginInfoTest, TestExtendedDismaxParser, TestFieldTypeResource, SimpleCollectionCreateDeleteTest, TestClassNameShortening, TestFoldingMultitermQuery, TestSort, TestCharFilters, LoggingHandlerTest, SpellCheckCollatorTest, TestElisionMultitermQuery, TestBulkSchemaAPI, SimpleFacetsTest, TestRemoteStreaming, DateMathParserTest, TestBadConfig, AnalysisAfterCoreReloadTest, SolrIndexConfigTest, DirectSolrConnectionTest, TestSchemaResource, DirectUpdateHandlerOptimizeTest, TestSearcherReuse, DocExpirationUpdateProcessorFactoryTest, TestSuggestSpellingConverter, CoreAdminRequestStatusTest, DisMaxRequestHandlerTest, TestSolrDeletionPolicy1, TestFiltering, LeaderElectionTest, TestAnalyzeInfixSuggestions, TestWordDelimiterFilterFactory, TestFunctionQuery, TestReRankQParserPlugin, FieldMutatingUpdateProcessorTest, UUIDFieldTest, TestBM25SimilarityFactory, QueryEqualityTest, DistributedFacetPivotWhiteBoxTest, IndexSchemaRuntimeFieldTest, DocValuesTest, OverseerCollectionProcessorTest, TestDFRSimilarityFactory, ExternalFileFieldSortTest, TestBinaryField, TestShortCircuitedRequests, IndexBasedSpellCheckerTest, TestFastWriter, DistributedIntervalFacetingTest, TestPartialUpdateDeduplication, ReturnFieldsTest, RecoveryZkTest, TestArbitraryIndexDir, FacetPivotSmallTest, ChaosMonkeyNothingIsSafeTest, HighlighterConfigTest, TestStressRecovery, SyncSliceTest, CoreContainerCoreInitFailuresTest, SimpleMLTQParserTest, TestCloudManagedSchemaConcurrent, DeleteShardTest, QueryResultKeyTest, ZkNodePropsTest, SuggesterTest, ShardSplitTest, CurrencyFieldXmlFileTest, SolrCmdDistributorTest, TestValueSourceCache, DistributedSuggestComponentTest, DeleteReplicaTest, BasicDistributedZk2Test, TestReplicationHandlerBackup, SoftAutoCommitTest, SolrRequestParserTest, NotRequiredUniqueKeyTest, TestOmitPositions, HdfsWriteToMultipleCollectionsTest, HdfsRecoveryZkTest, TestConfigSets, TestCSVResponseWriter, TestCSVLoader, DOMUtilTest, TestSolrDynamicMBean, MultiThreadedOCPTest, OverseerStatusTest, TestHighFrequencyDictionaryFactory, PingRequestHandlerTest, TestHashPartitioner, DirectUpdateHandlerTest, TestSweetSpotSimilarityFactory, TestSortingResponseWriter, TriLevelCompositeIdRoutingTest, ChaosMonkeySafeLeaderTest, UnloadDistributedZkTest, CollectionsAPIDistributedZkTest, OpenCloseCoreStressTest, OverseerTest, ClusterStateUpdateTest, TestRandomFaceting, TestZkChroot, ZkCLITest, ShardRoutingCustomTest, TestDistributedSearch, TestDistributedGrouping, DistributedSpellCheckComponentTest, ZkControllerTest, TestStressReorder, TestJoin, TestMultiCoreConfBootstrap, TestReload, TestStressVersions, DistributedTermsComponentTest, TestRangeQuery, TestSolr4Spatial, SolrCoreTest, StatsComponentTest, SpellCheckComponentTest, TestGroupingSearch, QueryElevationComponentTest, PeerSyncTest, BadIndexSchemaTest, ConvertedLegacyTest, BasicFunctionalityTest, HighlighterTest]
   [junit4] Completed in 1.06s, 31 tests, 9 errors <<< FAILURES!

[...truncated 613 lines...]
BUILD FAILED
C:\Users\JenkinsSlave\workspace\Lucene-Solr-trunk-Windows\build.xml:515: The following error occurred while executing this line:
C:\Users\JenkinsSlave\workspace\Lucene-Solr-trunk-Windows\build.xml:463: The following error occurred while executing this line:
C:\Users\JenkinsSlave\workspace\Lucene-Solr-trunk-Windows\build.xml:61: The following error occurred while executing this line:
C:\Users\JenkinsSlave\workspace\Lucene-Solr-trunk-Windows\extra-targets.xml:39: The following error occurred while executing this line:
C:\Users\JenkinsSlave\workspace\Lucene-Solr-trunk-Windows\solr\build.xml:186: The following error occurred while executing this line:
C:\Users\JenkinsSlave\workspace\Lucene-Solr-trunk-Windows\solr\common-build.xml:510: The following error occurred while executing this line:
C:\Users\JenkinsSlave\workspace\Lucene-Solr-trunk-Windows\lucene\common-build.xml:1349: The following error occurred while executing this line:
C:\Users\JenkinsSlave\workspace\Lucene-Solr-trunk-Windows\lucene\common-build.xml:956: There were test failures: 450 suites, 1838 tests, 9 errors, 55 ignored (31 assumptions)

Total time: 150 minutes 53 seconds
Build step 'Invoke Ant' marked build as failure
[description-setter] Description set: Java: 32bit/jdk1.8.0_20 -server -XX:+UseParallelGC (asserts: true)
Archiving artifacts
Recording test results
Email was triggered for: Failure - Any
Sending email for trigger: Failure - Any



Mime
View raw message