lucene-dev mailing list archives

Site index · List index
Message view « Date » · « Thread »
Top « Date » · « Thread »
From Policeman Jenkins Server <jenk...@thetaphi.de>
Subject [JENKINS] Lucene-Solr-5.x-Linux (32bit/jdk1.8.0_20) - Build # 11517 - Still Failing!
Date Fri, 28 Nov 2014 23:11:39 GMT
Build: http://jenkins.thetaphi.de/job/Lucene-Solr-5.x-Linux/11517/
Java: 32bit/jdk1.8.0_20 -server -XX:+UseParallelGC (asserts: true)

9 tests failed.
FAILED:  org.apache.solr.highlight.HighlighterTest.testLongFragment

Error Message:
Exception during query

Stack Trace:
java.lang.RuntimeException: Exception during query
	at __randomizedtesting.SeedInfo.seed([B616D122261A4A31:2ED1AD85293641F9]:0)
	at org.apache.solr.SolrTestCaseJ4.assertQ(SolrTestCaseJ4.java:729)
	at org.apache.solr.highlight.HighlighterTest.testLongFragment(HighlighterTest.java:496)
	at sun.reflect.NativeMethodAccessorImpl.invoke0(Native Method)
	at sun.reflect.NativeMethodAccessorImpl.invoke(NativeMethodAccessorImpl.java:62)
	at sun.reflect.DelegatingMethodAccessorImpl.invoke(DelegatingMethodAccessorImpl.java:43)
	at java.lang.reflect.Method.invoke(Method.java:483)
	at com.carrotsearch.randomizedtesting.RandomizedRunner.invoke(RandomizedRunner.java:1618)
	at com.carrotsearch.randomizedtesting.RandomizedRunner$6.evaluate(RandomizedRunner.java:827)
	at com.carrotsearch.randomizedtesting.RandomizedRunner$7.evaluate(RandomizedRunner.java:863)
	at com.carrotsearch.randomizedtesting.RandomizedRunner$8.evaluate(RandomizedRunner.java:877)
	at com.carrotsearch.randomizedtesting.rules.SystemPropertiesRestoreRule$1.evaluate(SystemPropertiesRestoreRule.java:53)
	at org.apache.lucene.util.TestRuleSetupTeardownChained$1.evaluate(TestRuleSetupTeardownChained.java:50)
	at org.apache.lucene.util.AbstractBeforeAfterRule$1.evaluate(AbstractBeforeAfterRule.java:46)
	at com.carrotsearch.randomizedtesting.rules.SystemPropertiesInvariantRule$1.evaluate(SystemPropertiesInvariantRule.java:55)
	at org.apache.lucene.util.TestRuleThreadAndTestName$1.evaluate(TestRuleThreadAndTestName.java:49)
	at org.apache.lucene.util.TestRuleIgnoreAfterMaxFailures$1.evaluate(TestRuleIgnoreAfterMaxFailures.java:65)
	at org.apache.lucene.util.TestRuleMarkFailure$1.evaluate(TestRuleMarkFailure.java:48)
	at com.carrotsearch.randomizedtesting.rules.StatementAdapter.evaluate(StatementAdapter.java:36)
	at com.carrotsearch.randomizedtesting.ThreadLeakControl$StatementRunner.run(ThreadLeakControl.java:365)
	at com.carrotsearch.randomizedtesting.ThreadLeakControl.forkTimeoutingTask(ThreadLeakControl.java:798)
	at com.carrotsearch.randomizedtesting.ThreadLeakControl$3.evaluate(ThreadLeakControl.java:458)
	at com.carrotsearch.randomizedtesting.RandomizedRunner.runSingleTest(RandomizedRunner.java:836)
	at com.carrotsearch.randomizedtesting.RandomizedRunner$3.evaluate(RandomizedRunner.java:738)
	at com.carrotsearch.randomizedtesting.RandomizedRunner$4.evaluate(RandomizedRunner.java:772)
	at com.carrotsearch.randomizedtesting.RandomizedRunner$5.evaluate(RandomizedRunner.java:783)
	at com.carrotsearch.randomizedtesting.rules.StatementAdapter.evaluate(StatementAdapter.java:36)
	at com.carrotsearch.randomizedtesting.rules.SystemPropertiesRestoreRule$1.evaluate(SystemPropertiesRestoreRule.java:53)
	at org.apache.lucene.util.AbstractBeforeAfterRule$1.evaluate(AbstractBeforeAfterRule.java:46)
	at org.apache.lucene.util.TestRuleStoreClassName$1.evaluate(TestRuleStoreClassName.java:42)
	at com.carrotsearch.randomizedtesting.rules.SystemPropertiesInvariantRule$1.evaluate(SystemPropertiesInvariantRule.java:55)
	at com.carrotsearch.randomizedtesting.rules.NoShadowingOrOverridesOnMethodsRule$1.evaluate(NoShadowingOrOverridesOnMethodsRule.java:39)
	at com.carrotsearch.randomizedtesting.rules.NoShadowingOrOverridesOnMethodsRule$1.evaluate(NoShadowingOrOverridesOnMethodsRule.java:39)
	at com.carrotsearch.randomizedtesting.rules.StatementAdapter.evaluate(StatementAdapter.java:36)
	at com.carrotsearch.randomizedtesting.rules.StatementAdapter.evaluate(StatementAdapter.java:36)
	at com.carrotsearch.randomizedtesting.rules.StatementAdapter.evaluate(StatementAdapter.java:36)
	at org.apache.lucene.util.TestRuleAssertionsRequired$1.evaluate(TestRuleAssertionsRequired.java:54)
	at org.apache.lucene.util.TestRuleMarkFailure$1.evaluate(TestRuleMarkFailure.java:48)
	at org.apache.lucene.util.TestRuleIgnoreAfterMaxFailures$1.evaluate(TestRuleIgnoreAfterMaxFailures.java:65)
	at org.apache.lucene.util.TestRuleIgnoreTestSuites$1.evaluate(TestRuleIgnoreTestSuites.java:55)
	at com.carrotsearch.randomizedtesting.rules.StatementAdapter.evaluate(StatementAdapter.java:36)
	at com.carrotsearch.randomizedtesting.ThreadLeakControl$StatementRunner.run(ThreadLeakControl.java:365)
	at java.lang.Thread.run(Thread.java:745)
Caused by: java.lang.RuntimeException: REQUEST FAILED: xpath=//lst[@name='1']/arr[@name='tv_text']/str
	xml response was: <?xml version="1.0" encoding="UTF-8"?>
<response>
<lst name="responseHeader"><int name="status">0</int><int name="QTime">6</int></lst><result name="response" numFound="1" start="0"><doc><arr name="tv_text"><str>junit: [mkdir] Created dir: /home/klaas/worio/backend/trunk/build-src/solr-nightly/build/test-results [junit] Running org.apache.solr.BasicFunctionalityTest [junit] Tests run: 7, Failures: 0, Errors: 0, Time elapsed: 5.36 sec [junit] Running org.apache.solr.ConvertedLegacyTest [junit] Tests run: 1, Failures: 0, Errors: 0, Time elapsed: 8.268 sec [junit] Running org.apache.solr.DisMaxRequestHandlerTest [junit] Tests run: 1, Failures: 0, Errors: 0, Time elapsed: 1.56 sec [junit] Running org.apache.solr.HighlighterTest [junit] Tests run: 7, Failures: 0, Errors: 0, Time elapsed: 4.979 sec [junit] Running org.apache.solr.OutputWriterTest [junit] Tests run: 2, Failures: 0, Errors: 0, Time elapsed: 0.797 sec [junit] Running org.apache.solr.SampleTest [junit] Tests run: 2, Failures: 0, Errors: 0, Time elapsed: 1.021 sec [junit] Running org.apache.solr.analysis.TestBufferedTokenStream [junit] Tests run: 2, Failures: 0, Errors: 0, Time elapsed: 0.05 sec [junit] Running org.apache.solr.analysis.TestRemoveDuplicatesTokenFilter [junit] Tests run: 3, Failures: 0, Errors: 0, Time elapsed: 0.054 sec [junit] Running org.apache.solr.analysis.TestSynonymFilter [junit] Tests run: 6, Failures: 0, Errors: 0, Time elapsed: 0.081 sec [junit] Running org.apache.solr.analysis.TestWordDelimiterFilter [junit] Tests run: 1, Failures: 0, Errors: 0, Time elapsed: 1.714 sec [junit] Running org.apache.solr.search.TestDocSet [junit] Tests run: 1, Failures: 0, Errors: 0, Time elapsed: 0.788 sec [junit] Running org.apache.solr.util.SolrPluginUtilsTest [junit] Tests run: 5, Failures: 0, Errors: 0, Time elapsed: 3.519 sec [junit] Running org.apache.solr.util.TestOpenBitSet [junit] Tests run: 2, Failures: 0, Errors: 0, Time elapsed: 0.533 sec</str></arr><int name="id">1</int><arr name="range_facet_l"><long>1</long></arr><long name="_version_">1486057695791284224</long><arr name="multiDefault"><str>muLti-Default</str></arr><int name="intDefault">42</int><date name="timestamp">2014-11-28T22:50:57.174Z</date></doc></result><lst name="highlighting"><lst name="1"/></lst>
</response>

	request was:q=tv_text:dir&qt=standard&hl=true&start=0&hl.fl=tv_text&rows=200
	at org.apache.solr.SolrTestCaseJ4.assertQ(SolrTestCaseJ4.java:722)
	... 41 more


FAILED:  org.apache.solr.highlight.HighlighterTest.testDisMaxHighlight

Error Message:
Exception during query

Stack Trace:
java.lang.RuntimeException: Exception during query
	at __randomizedtesting.SeedInfo.seed([B616D122261A4A31:ACBEFEA667C4BBA0]:0)
	at org.apache.solr.SolrTestCaseJ4.assertQ(SolrTestCaseJ4.java:729)
	at org.apache.solr.highlight.HighlighterTest.testDisMaxHighlight(HighlighterTest.java:262)
	at sun.reflect.NativeMethodAccessorImpl.invoke0(Native Method)
	at sun.reflect.NativeMethodAccessorImpl.invoke(NativeMethodAccessorImpl.java:62)
	at sun.reflect.DelegatingMethodAccessorImpl.invoke(DelegatingMethodAccessorImpl.java:43)
	at java.lang.reflect.Method.invoke(Method.java:483)
	at com.carrotsearch.randomizedtesting.RandomizedRunner.invoke(RandomizedRunner.java:1618)
	at com.carrotsearch.randomizedtesting.RandomizedRunner$6.evaluate(RandomizedRunner.java:827)
	at com.carrotsearch.randomizedtesting.RandomizedRunner$7.evaluate(RandomizedRunner.java:863)
	at com.carrotsearch.randomizedtesting.RandomizedRunner$8.evaluate(RandomizedRunner.java:877)
	at com.carrotsearch.randomizedtesting.rules.SystemPropertiesRestoreRule$1.evaluate(SystemPropertiesRestoreRule.java:53)
	at org.apache.lucene.util.TestRuleSetupTeardownChained$1.evaluate(TestRuleSetupTeardownChained.java:50)
	at org.apache.lucene.util.AbstractBeforeAfterRule$1.evaluate(AbstractBeforeAfterRule.java:46)
	at com.carrotsearch.randomizedtesting.rules.SystemPropertiesInvariantRule$1.evaluate(SystemPropertiesInvariantRule.java:55)
	at org.apache.lucene.util.TestRuleThreadAndTestName$1.evaluate(TestRuleThreadAndTestName.java:49)
	at org.apache.lucene.util.TestRuleIgnoreAfterMaxFailures$1.evaluate(TestRuleIgnoreAfterMaxFailures.java:65)
	at org.apache.lucene.util.TestRuleMarkFailure$1.evaluate(TestRuleMarkFailure.java:48)
	at com.carrotsearch.randomizedtesting.rules.StatementAdapter.evaluate(StatementAdapter.java:36)
	at com.carrotsearch.randomizedtesting.ThreadLeakControl$StatementRunner.run(ThreadLeakControl.java:365)
	at com.carrotsearch.randomizedtesting.ThreadLeakControl.forkTimeoutingTask(ThreadLeakControl.java:798)
	at com.carrotsearch.randomizedtesting.ThreadLeakControl$3.evaluate(ThreadLeakControl.java:458)
	at com.carrotsearch.randomizedtesting.RandomizedRunner.runSingleTest(RandomizedRunner.java:836)
	at com.carrotsearch.randomizedtesting.RandomizedRunner$3.evaluate(RandomizedRunner.java:738)
	at com.carrotsearch.randomizedtesting.RandomizedRunner$4.evaluate(RandomizedRunner.java:772)
	at com.carrotsearch.randomizedtesting.RandomizedRunner$5.evaluate(RandomizedRunner.java:783)
	at com.carrotsearch.randomizedtesting.rules.StatementAdapter.evaluate(StatementAdapter.java:36)
	at com.carrotsearch.randomizedtesting.rules.SystemPropertiesRestoreRule$1.evaluate(SystemPropertiesRestoreRule.java:53)
	at org.apache.lucene.util.AbstractBeforeAfterRule$1.evaluate(AbstractBeforeAfterRule.java:46)
	at org.apache.lucene.util.TestRuleStoreClassName$1.evaluate(TestRuleStoreClassName.java:42)
	at com.carrotsearch.randomizedtesting.rules.SystemPropertiesInvariantRule$1.evaluate(SystemPropertiesInvariantRule.java:55)
	at com.carrotsearch.randomizedtesting.rules.NoShadowingOrOverridesOnMethodsRule$1.evaluate(NoShadowingOrOverridesOnMethodsRule.java:39)
	at com.carrotsearch.randomizedtesting.rules.NoShadowingOrOverridesOnMethodsRule$1.evaluate(NoShadowingOrOverridesOnMethodsRule.java:39)
	at com.carrotsearch.randomizedtesting.rules.StatementAdapter.evaluate(StatementAdapter.java:36)
	at com.carrotsearch.randomizedtesting.rules.StatementAdapter.evaluate(StatementAdapter.java:36)
	at com.carrotsearch.randomizedtesting.rules.StatementAdapter.evaluate(StatementAdapter.java:36)
	at org.apache.lucene.util.TestRuleAssertionsRequired$1.evaluate(TestRuleAssertionsRequired.java:54)
	at org.apache.lucene.util.TestRuleMarkFailure$1.evaluate(TestRuleMarkFailure.java:48)
	at org.apache.lucene.util.TestRuleIgnoreAfterMaxFailures$1.evaluate(TestRuleIgnoreAfterMaxFailures.java:65)
	at org.apache.lucene.util.TestRuleIgnoreTestSuites$1.evaluate(TestRuleIgnoreTestSuites.java:55)
	at com.carrotsearch.randomizedtesting.rules.StatementAdapter.evaluate(StatementAdapter.java:36)
	at com.carrotsearch.randomizedtesting.ThreadLeakControl$StatementRunner.run(ThreadLeakControl.java:365)
	at java.lang.Thread.run(Thread.java:745)
Caused by: java.lang.RuntimeException: REQUEST FAILED: xpath=//lst[@name='1']/arr[@name='tv_text']/str
	xml response was: <?xml version="1.0" encoding="UTF-8"?>
<response>
<lst name="responseHeader"><int name="status">0</int><int name="QTime">7</int></lst><result name="response" numFound="1" start="0"><doc><arr name="tv_text"><str>a long day's night</str></arr><int name="id">1</int><arr name="range_facet_l"><long>1</long></arr><long name="_version_">1486057695933890560</long><arr name="multiDefault"><str>muLti-Default</str></arr><int name="intDefault">42</int><date name="timestamp">2014-11-28T22:50:57.309Z</date></doc></result><lst name="highlighting"><lst name="1"/></lst>
</response>

	request was:q=long&q.alt=*:*&qt=dismax&hl=true&qf=tv_text&start=0&hl.fl=tv_text&rows=200
	at org.apache.solr.SolrTestCaseJ4.assertQ(SolrTestCaseJ4.java:722)
	... 41 more


FAILED:  org.apache.solr.highlight.HighlighterTest.testTermVecMultiValuedHighlight

Error Message:
Exception during query

Stack Trace:
java.lang.RuntimeException: Exception during query
	at __randomizedtesting.SeedInfo.seed([B616D122261A4A31:1C48D54E93F05E29]:0)
	at org.apache.solr.SolrTestCaseJ4.assertQ(SolrTestCaseJ4.java:729)
	at org.apache.solr.highlight.HighlighterTest.testTermVecMultiValuedHighlight(HighlighterTest.java:211)
	at sun.reflect.NativeMethodAccessorImpl.invoke0(Native Method)
	at sun.reflect.NativeMethodAccessorImpl.invoke(NativeMethodAccessorImpl.java:62)
	at sun.reflect.DelegatingMethodAccessorImpl.invoke(DelegatingMethodAccessorImpl.java:43)
	at java.lang.reflect.Method.invoke(Method.java:483)
	at com.carrotsearch.randomizedtesting.RandomizedRunner.invoke(RandomizedRunner.java:1618)
	at com.carrotsearch.randomizedtesting.RandomizedRunner$6.evaluate(RandomizedRunner.java:827)
	at com.carrotsearch.randomizedtesting.RandomizedRunner$7.evaluate(RandomizedRunner.java:863)
	at com.carrotsearch.randomizedtesting.RandomizedRunner$8.evaluate(RandomizedRunner.java:877)
	at com.carrotsearch.randomizedtesting.rules.SystemPropertiesRestoreRule$1.evaluate(SystemPropertiesRestoreRule.java:53)
	at org.apache.lucene.util.TestRuleSetupTeardownChained$1.evaluate(TestRuleSetupTeardownChained.java:50)
	at org.apache.lucene.util.AbstractBeforeAfterRule$1.evaluate(AbstractBeforeAfterRule.java:46)
	at com.carrotsearch.randomizedtesting.rules.SystemPropertiesInvariantRule$1.evaluate(SystemPropertiesInvariantRule.java:55)
	at org.apache.lucene.util.TestRuleThreadAndTestName$1.evaluate(TestRuleThreadAndTestName.java:49)
	at org.apache.lucene.util.TestRuleIgnoreAfterMaxFailures$1.evaluate(TestRuleIgnoreAfterMaxFailures.java:65)
	at org.apache.lucene.util.TestRuleMarkFailure$1.evaluate(TestRuleMarkFailure.java:48)
	at com.carrotsearch.randomizedtesting.rules.StatementAdapter.evaluate(StatementAdapter.java:36)
	at com.carrotsearch.randomizedtesting.ThreadLeakControl$StatementRunner.run(ThreadLeakControl.java:365)
	at com.carrotsearch.randomizedtesting.ThreadLeakControl.forkTimeoutingTask(ThreadLeakControl.java:798)
	at com.carrotsearch.randomizedtesting.ThreadLeakControl$3.evaluate(ThreadLeakControl.java:458)
	at com.carrotsearch.randomizedtesting.RandomizedRunner.runSingleTest(RandomizedRunner.java:836)
	at com.carrotsearch.randomizedtesting.RandomizedRunner$3.evaluate(RandomizedRunner.java:738)
	at com.carrotsearch.randomizedtesting.RandomizedRunner$4.evaluate(RandomizedRunner.java:772)
	at com.carrotsearch.randomizedtesting.RandomizedRunner$5.evaluate(RandomizedRunner.java:783)
	at com.carrotsearch.randomizedtesting.rules.StatementAdapter.evaluate(StatementAdapter.java:36)
	at com.carrotsearch.randomizedtesting.rules.SystemPropertiesRestoreRule$1.evaluate(SystemPropertiesRestoreRule.java:53)
	at org.apache.lucene.util.AbstractBeforeAfterRule$1.evaluate(AbstractBeforeAfterRule.java:46)
	at org.apache.lucene.util.TestRuleStoreClassName$1.evaluate(TestRuleStoreClassName.java:42)
	at com.carrotsearch.randomizedtesting.rules.SystemPropertiesInvariantRule$1.evaluate(SystemPropertiesInvariantRule.java:55)
	at com.carrotsearch.randomizedtesting.rules.NoShadowingOrOverridesOnMethodsRule$1.evaluate(NoShadowingOrOverridesOnMethodsRule.java:39)
	at com.carrotsearch.randomizedtesting.rules.NoShadowingOrOverridesOnMethodsRule$1.evaluate(NoShadowingOrOverridesOnMethodsRule.java:39)
	at com.carrotsearch.randomizedtesting.rules.StatementAdapter.evaluate(StatementAdapter.java:36)
	at com.carrotsearch.randomizedtesting.rules.StatementAdapter.evaluate(StatementAdapter.java:36)
	at com.carrotsearch.randomizedtesting.rules.StatementAdapter.evaluate(StatementAdapter.java:36)
	at org.apache.lucene.util.TestRuleAssertionsRequired$1.evaluate(TestRuleAssertionsRequired.java:54)
	at org.apache.lucene.util.TestRuleMarkFailure$1.evaluate(TestRuleMarkFailure.java:48)
	at org.apache.lucene.util.TestRuleIgnoreAfterMaxFailures$1.evaluate(TestRuleIgnoreAfterMaxFailures.java:65)
	at org.apache.lucene.util.TestRuleIgnoreTestSuites$1.evaluate(TestRuleIgnoreTestSuites.java:55)
	at com.carrotsearch.randomizedtesting.rules.StatementAdapter.evaluate(StatementAdapter.java:36)
	at com.carrotsearch.randomizedtesting.ThreadLeakControl$StatementRunner.run(ThreadLeakControl.java:365)
	at java.lang.Thread.run(Thread.java:745)
Caused by: java.lang.RuntimeException: REQUEST FAILED: xpath=//lst[@name='1']/arr[@name='tv_mv_text']/str[.='a <em>long</em> days night this should be a piece of text which']
	xml response was: <?xml version="1.0" encoding="UTF-8"?>
<response>
<lst name="responseHeader"><int name="status">0</int><int name="QTime">1</int></lst><result name="response" numFound="1" start="0"><doc><arr name="tv_mv_text"><str>a long days night this should be a piece of text which is is is is is is is is is is is is is is is is is is is is is is is is isis is is is is is is is is is is is is is is is is is is is is is is is is is is is is is is is is is is is is is is is is is is is is is is is is is is is is is is is is is is is is is is is is is is is is is is is is is is sufficiently lengthly to produce multiple fragments which are not concatenated at all--we want two disjoint long fragments.</str><str>a long days night this should be a piece of text which is is is is is is is is is is is is is is is is is is is is is is is is isis is is is is is is is is is is is is is is is is is is is is is is is is is is is is is is is is is is is is is is is is is is is is is is is is is is is is is is is is is is is is is is is is is is is is is is is is is is sufficiently lengthly to produce multiple fragments which are not concatenated at all--we want two disjoint long fragments.</str></arr><int name="id">1</int><arr name="range_facet_l"><long>1</long></arr><long name="_version_">1486057696007290880</long><arr name="multiDefault"><str>muLti-Default</str></arr><int name="intDefault">42</int><date name="timestamp">2014-11-28T22:50:57.38Z</date></doc></result><lst name="highlighting"><lst name="1"/></lst>
</response>

	request was:hl.snippets=2&q=tv_mv_text:long&qt=standard&hl=true&start=0&hl.fl=tv_mv_text&rows=200
	at org.apache.solr.SolrTestCaseJ4.assertQ(SolrTestCaseJ4.java:722)
	... 41 more


FAILED:  org.apache.solr.highlight.HighlighterTest.testVariableFragsize

Error Message:
Exception during query

Stack Trace:
java.lang.RuntimeException: Exception during query
	at __randomizedtesting.SeedInfo.seed([B616D122261A4A31:B15AD153C4A4E6A3]:0)
	at org.apache.solr.SolrTestCaseJ4.assertQ(SolrTestCaseJ4.java:729)
	at org.apache.solr.highlight.HighlighterTest.testVariableFragsize(HighlighterTest.java:592)
	at sun.reflect.NativeMethodAccessorImpl.invoke0(Native Method)
	at sun.reflect.NativeMethodAccessorImpl.invoke(NativeMethodAccessorImpl.java:62)
	at sun.reflect.DelegatingMethodAccessorImpl.invoke(DelegatingMethodAccessorImpl.java:43)
	at java.lang.reflect.Method.invoke(Method.java:483)
	at com.carrotsearch.randomizedtesting.RandomizedRunner.invoke(RandomizedRunner.java:1618)
	at com.carrotsearch.randomizedtesting.RandomizedRunner$6.evaluate(RandomizedRunner.java:827)
	at com.carrotsearch.randomizedtesting.RandomizedRunner$7.evaluate(RandomizedRunner.java:863)
	at com.carrotsearch.randomizedtesting.RandomizedRunner$8.evaluate(RandomizedRunner.java:877)
	at com.carrotsearch.randomizedtesting.rules.SystemPropertiesRestoreRule$1.evaluate(SystemPropertiesRestoreRule.java:53)
	at org.apache.lucene.util.TestRuleSetupTeardownChained$1.evaluate(TestRuleSetupTeardownChained.java:50)
	at org.apache.lucene.util.AbstractBeforeAfterRule$1.evaluate(AbstractBeforeAfterRule.java:46)
	at com.carrotsearch.randomizedtesting.rules.SystemPropertiesInvariantRule$1.evaluate(SystemPropertiesInvariantRule.java:55)
	at org.apache.lucene.util.TestRuleThreadAndTestName$1.evaluate(TestRuleThreadAndTestName.java:49)
	at org.apache.lucene.util.TestRuleIgnoreAfterMaxFailures$1.evaluate(TestRuleIgnoreAfterMaxFailures.java:65)
	at org.apache.lucene.util.TestRuleMarkFailure$1.evaluate(TestRuleMarkFailure.java:48)
	at com.carrotsearch.randomizedtesting.rules.StatementAdapter.evaluate(StatementAdapter.java:36)
	at com.carrotsearch.randomizedtesting.ThreadLeakControl$StatementRunner.run(ThreadLeakControl.java:365)
	at com.carrotsearch.randomizedtesting.ThreadLeakControl.forkTimeoutingTask(ThreadLeakControl.java:798)
	at com.carrotsearch.randomizedtesting.ThreadLeakControl$3.evaluate(ThreadLeakControl.java:458)
	at com.carrotsearch.randomizedtesting.RandomizedRunner.runSingleTest(RandomizedRunner.java:836)
	at com.carrotsearch.randomizedtesting.RandomizedRunner$3.evaluate(RandomizedRunner.java:738)
	at com.carrotsearch.randomizedtesting.RandomizedRunner$4.evaluate(RandomizedRunner.java:772)
	at com.carrotsearch.randomizedtesting.RandomizedRunner$5.evaluate(RandomizedRunner.java:783)
	at com.carrotsearch.randomizedtesting.rules.StatementAdapter.evaluate(StatementAdapter.java:36)
	at com.carrotsearch.randomizedtesting.rules.SystemPropertiesRestoreRule$1.evaluate(SystemPropertiesRestoreRule.java:53)
	at org.apache.lucene.util.AbstractBeforeAfterRule$1.evaluate(AbstractBeforeAfterRule.java:46)
	at org.apache.lucene.util.TestRuleStoreClassName$1.evaluate(TestRuleStoreClassName.java:42)
	at com.carrotsearch.randomizedtesting.rules.SystemPropertiesInvariantRule$1.evaluate(SystemPropertiesInvariantRule.java:55)
	at com.carrotsearch.randomizedtesting.rules.NoShadowingOrOverridesOnMethodsRule$1.evaluate(NoShadowingOrOverridesOnMethodsRule.java:39)
	at com.carrotsearch.randomizedtesting.rules.NoShadowingOrOverridesOnMethodsRule$1.evaluate(NoShadowingOrOverridesOnMethodsRule.java:39)
	at com.carrotsearch.randomizedtesting.rules.StatementAdapter.evaluate(StatementAdapter.java:36)
	at com.carrotsearch.randomizedtesting.rules.StatementAdapter.evaluate(StatementAdapter.java:36)
	at com.carrotsearch.randomizedtesting.rules.StatementAdapter.evaluate(StatementAdapter.java:36)
	at org.apache.lucene.util.TestRuleAssertionsRequired$1.evaluate(TestRuleAssertionsRequired.java:54)
	at org.apache.lucene.util.TestRuleMarkFailure$1.evaluate(TestRuleMarkFailure.java:48)
	at org.apache.lucene.util.TestRuleIgnoreAfterMaxFailures$1.evaluate(TestRuleIgnoreAfterMaxFailures.java:65)
	at org.apache.lucene.util.TestRuleIgnoreTestSuites$1.evaluate(TestRuleIgnoreTestSuites.java:55)
	at com.carrotsearch.randomizedtesting.rules.StatementAdapter.evaluate(StatementAdapter.java:36)
	at com.carrotsearch.randomizedtesting.ThreadLeakControl$StatementRunner.run(ThreadLeakControl.java:365)
	at java.lang.Thread.run(Thread.java:745)
Caused by: java.lang.RuntimeException: REQUEST FAILED: xpath=//lst[@name='1']/arr[@name='tv_text']/str[.='a <em>long</em> days night this should be a piece of text which']
	xml response was: <?xml version="1.0" encoding="UTF-8"?>
<response>
<lst name="responseHeader"><int name="status">0</int><int name="QTime">1</int></lst><result name="response" numFound="1" start="0"><doc><arr name="tv_text"><str>a long days night this should be a piece of text which is is is is is is is is is is is is is is is is is is is is is is is is isis is is is is is is is is is is is is is is is is is is is is is is is is is is is is is is is is is is is is is is is is is is is is is is is is is is is is is is is is is is is is is is is is is is is is is is is is is is sufficiently lengthly to produce multiple fragments which are not concatenated at all</str></arr><int name="id">1</int><arr name="range_facet_l"><long>1</long></arr><long name="_version_">1486057696070205440</long><arr name="multiDefault"><str>muLti-Default</str></arr><int name="intDefault">42</int><date name="timestamp">2014-11-28T22:50:57.44Z</date></doc></result><lst name="highlighting"><lst name="1"/></lst>
</response>

	request was:q=tv_text:long&qt=standard&hl=true&start=0&hl.fl=tv_text&rows=200
	at org.apache.solr.SolrTestCaseJ4.assertQ(SolrTestCaseJ4.java:722)
	... 41 more


FAILED:  org.apache.solr.highlight.HighlighterTest.testSubwordWildcardHighlightWithTermOffsets

Error Message:
Exception during query

Stack Trace:
java.lang.RuntimeException: Exception during query
	at __randomizedtesting.SeedInfo.seed([B616D122261A4A31:89B035E1D3BF284C]:0)
	at org.apache.solr.SolrTestCaseJ4.assertQ(SolrTestCaseJ4.java:729)
	at org.apache.solr.highlight.HighlighterTest.testSubwordWildcardHighlightWithTermOffsets(HighlighterTest.java:834)
	at sun.reflect.NativeMethodAccessorImpl.invoke0(Native Method)
	at sun.reflect.NativeMethodAccessorImpl.invoke(NativeMethodAccessorImpl.java:62)
	at sun.reflect.DelegatingMethodAccessorImpl.invoke(DelegatingMethodAccessorImpl.java:43)
	at java.lang.reflect.Method.invoke(Method.java:483)
	at com.carrotsearch.randomizedtesting.RandomizedRunner.invoke(RandomizedRunner.java:1618)
	at com.carrotsearch.randomizedtesting.RandomizedRunner$6.evaluate(RandomizedRunner.java:827)
	at com.carrotsearch.randomizedtesting.RandomizedRunner$7.evaluate(RandomizedRunner.java:863)
	at com.carrotsearch.randomizedtesting.RandomizedRunner$8.evaluate(RandomizedRunner.java:877)
	at com.carrotsearch.randomizedtesting.rules.SystemPropertiesRestoreRule$1.evaluate(SystemPropertiesRestoreRule.java:53)
	at org.apache.lucene.util.TestRuleSetupTeardownChained$1.evaluate(TestRuleSetupTeardownChained.java:50)
	at org.apache.lucene.util.AbstractBeforeAfterRule$1.evaluate(AbstractBeforeAfterRule.java:46)
	at com.carrotsearch.randomizedtesting.rules.SystemPropertiesInvariantRule$1.evaluate(SystemPropertiesInvariantRule.java:55)
	at org.apache.lucene.util.TestRuleThreadAndTestName$1.evaluate(TestRuleThreadAndTestName.java:49)
	at org.apache.lucene.util.TestRuleIgnoreAfterMaxFailures$1.evaluate(TestRuleIgnoreAfterMaxFailures.java:65)
	at org.apache.lucene.util.TestRuleMarkFailure$1.evaluate(TestRuleMarkFailure.java:48)
	at com.carrotsearch.randomizedtesting.rules.StatementAdapter.evaluate(StatementAdapter.java:36)
	at com.carrotsearch.randomizedtesting.ThreadLeakControl$StatementRunner.run(ThreadLeakControl.java:365)
	at com.carrotsearch.randomizedtesting.ThreadLeakControl.forkTimeoutingTask(ThreadLeakControl.java:798)
	at com.carrotsearch.randomizedtesting.ThreadLeakControl$3.evaluate(ThreadLeakControl.java:458)
	at com.carrotsearch.randomizedtesting.RandomizedRunner.runSingleTest(RandomizedRunner.java:836)
	at com.carrotsearch.randomizedtesting.RandomizedRunner$3.evaluate(RandomizedRunner.java:738)
	at com.carrotsearch.randomizedtesting.RandomizedRunner$4.evaluate(RandomizedRunner.java:772)
	at com.carrotsearch.randomizedtesting.RandomizedRunner$5.evaluate(RandomizedRunner.java:783)
	at com.carrotsearch.randomizedtesting.rules.StatementAdapter.evaluate(StatementAdapter.java:36)
	at com.carrotsearch.randomizedtesting.rules.SystemPropertiesRestoreRule$1.evaluate(SystemPropertiesRestoreRule.java:53)
	at org.apache.lucene.util.AbstractBeforeAfterRule$1.evaluate(AbstractBeforeAfterRule.java:46)
	at org.apache.lucene.util.TestRuleStoreClassName$1.evaluate(TestRuleStoreClassName.java:42)
	at com.carrotsearch.randomizedtesting.rules.SystemPropertiesInvariantRule$1.evaluate(SystemPropertiesInvariantRule.java:55)
	at com.carrotsearch.randomizedtesting.rules.NoShadowingOrOverridesOnMethodsRule$1.evaluate(NoShadowingOrOverridesOnMethodsRule.java:39)
	at com.carrotsearch.randomizedtesting.rules.NoShadowingOrOverridesOnMethodsRule$1.evaluate(NoShadowingOrOverridesOnMethodsRule.java:39)
	at com.carrotsearch.randomizedtesting.rules.StatementAdapter.evaluate(StatementAdapter.java:36)
	at com.carrotsearch.randomizedtesting.rules.StatementAdapter.evaluate(StatementAdapter.java:36)
	at com.carrotsearch.randomizedtesting.rules.StatementAdapter.evaluate(StatementAdapter.java:36)
	at org.apache.lucene.util.TestRuleAssertionsRequired$1.evaluate(TestRuleAssertionsRequired.java:54)
	at org.apache.lucene.util.TestRuleMarkFailure$1.evaluate(TestRuleMarkFailure.java:48)
	at org.apache.lucene.util.TestRuleIgnoreAfterMaxFailures$1.evaluate(TestRuleIgnoreAfterMaxFailures.java:65)
	at org.apache.lucene.util.TestRuleIgnoreTestSuites$1.evaluate(TestRuleIgnoreTestSuites.java:55)
	at com.carrotsearch.randomizedtesting.rules.StatementAdapter.evaluate(StatementAdapter.java:36)
	at com.carrotsearch.randomizedtesting.ThreadLeakControl$StatementRunner.run(ThreadLeakControl.java:365)
	at java.lang.Thread.run(Thread.java:745)
Caused by: java.lang.RuntimeException: REQUEST FAILED: xpath=//lst[@name='highlighting']/lst[@name='1']/arr[@name='subword_offsets']/str='lorem <em>PowerShot.com</em> ipsum'
	xml response was: <?xml version="1.0" encoding="UTF-8"?>
<response>
<lst name="responseHeader"><int name="status">0</int><int name="QTime">1</int></lst><result name="response" numFound="1" start="0"><doc><arr name="subword_offsets"><str>lorem PowerShot.com ipsum</str></arr><int name="id">1</int><arr name="range_facet_l"><long>1</long></arr><long name="_version_">1486057696146751488</long><arr name="multiDefault"><str>muLti-Default</str></arr><int name="intDefault">42</int><date name="timestamp">2014-11-28T22:50:57.513Z</date></doc></result><lst name="highlighting"><lst name="1"/></lst>
</response>

	request was:q=subword_offsets:pow*&hl=true&hl.fl=subword_offsets&wt=xml
	at org.apache.solr.SolrTestCaseJ4.assertQ(SolrTestCaseJ4.java:722)
	... 41 more


FAILED:  org.apache.solr.highlight.HighlighterTest.testTwoFieldHighlight

Error Message:
Exception during query

Stack Trace:
java.lang.RuntimeException: Exception during query
	at __randomizedtesting.SeedInfo.seed([B616D122261A4A31:CF641420C16C1C8B]:0)
	at org.apache.solr.SolrTestCaseJ4.assertQ(SolrTestCaseJ4.java:729)
	at org.apache.solr.highlight.HighlighterTest.testTwoFieldHighlight(HighlighterTest.java:391)
	at sun.reflect.NativeMethodAccessorImpl.invoke0(Native Method)
	at sun.reflect.NativeMethodAccessorImpl.invoke(NativeMethodAccessorImpl.java:62)
	at sun.reflect.DelegatingMethodAccessorImpl.invoke(DelegatingMethodAccessorImpl.java:43)
	at java.lang.reflect.Method.invoke(Method.java:483)
	at com.carrotsearch.randomizedtesting.RandomizedRunner.invoke(RandomizedRunner.java:1618)
	at com.carrotsearch.randomizedtesting.RandomizedRunner$6.evaluate(RandomizedRunner.java:827)
	at com.carrotsearch.randomizedtesting.RandomizedRunner$7.evaluate(RandomizedRunner.java:863)
	at com.carrotsearch.randomizedtesting.RandomizedRunner$8.evaluate(RandomizedRunner.java:877)
	at com.carrotsearch.randomizedtesting.rules.SystemPropertiesRestoreRule$1.evaluate(SystemPropertiesRestoreRule.java:53)
	at org.apache.lucene.util.TestRuleSetupTeardownChained$1.evaluate(TestRuleSetupTeardownChained.java:50)
	at org.apache.lucene.util.AbstractBeforeAfterRule$1.evaluate(AbstractBeforeAfterRule.java:46)
	at com.carrotsearch.randomizedtesting.rules.SystemPropertiesInvariantRule$1.evaluate(SystemPropertiesInvariantRule.java:55)
	at org.apache.lucene.util.TestRuleThreadAndTestName$1.evaluate(TestRuleThreadAndTestName.java:49)
	at org.apache.lucene.util.TestRuleIgnoreAfterMaxFailures$1.evaluate(TestRuleIgnoreAfterMaxFailures.java:65)
	at org.apache.lucene.util.TestRuleMarkFailure$1.evaluate(TestRuleMarkFailure.java:48)
	at com.carrotsearch.randomizedtesting.rules.StatementAdapter.evaluate(StatementAdapter.java:36)
	at com.carrotsearch.randomizedtesting.ThreadLeakControl$StatementRunner.run(ThreadLeakControl.java:365)
	at com.carrotsearch.randomizedtesting.ThreadLeakControl.forkTimeoutingTask(ThreadLeakControl.java:798)
	at com.carrotsearch.randomizedtesting.ThreadLeakControl$3.evaluate(ThreadLeakControl.java:458)
	at com.carrotsearch.randomizedtesting.RandomizedRunner.runSingleTest(RandomizedRunner.java:836)
	at com.carrotsearch.randomizedtesting.RandomizedRunner$3.evaluate(RandomizedRunner.java:738)
	at com.carrotsearch.randomizedtesting.RandomizedRunner$4.evaluate(RandomizedRunner.java:772)
	at com.carrotsearch.randomizedtesting.RandomizedRunner$5.evaluate(RandomizedRunner.java:783)
	at com.carrotsearch.randomizedtesting.rules.StatementAdapter.evaluate(StatementAdapter.java:36)
	at com.carrotsearch.randomizedtesting.rules.SystemPropertiesRestoreRule$1.evaluate(SystemPropertiesRestoreRule.java:53)
	at org.apache.lucene.util.AbstractBeforeAfterRule$1.evaluate(AbstractBeforeAfterRule.java:46)
	at org.apache.lucene.util.TestRuleStoreClassName$1.evaluate(TestRuleStoreClassName.java:42)
	at com.carrotsearch.randomizedtesting.rules.SystemPropertiesInvariantRule$1.evaluate(SystemPropertiesInvariantRule.java:55)
	at com.carrotsearch.randomizedtesting.rules.NoShadowingOrOverridesOnMethodsRule$1.evaluate(NoShadowingOrOverridesOnMethodsRule.java:39)
	at com.carrotsearch.randomizedtesting.rules.NoShadowingOrOverridesOnMethodsRule$1.evaluate(NoShadowingOrOverridesOnMethodsRule.java:39)
	at com.carrotsearch.randomizedtesting.rules.StatementAdapter.evaluate(StatementAdapter.java:36)
	at com.carrotsearch.randomizedtesting.rules.StatementAdapter.evaluate(StatementAdapter.java:36)
	at com.carrotsearch.randomizedtesting.rules.StatementAdapter.evaluate(StatementAdapter.java:36)
	at org.apache.lucene.util.TestRuleAssertionsRequired$1.evaluate(TestRuleAssertionsRequired.java:54)
	at org.apache.lucene.util.TestRuleMarkFailure$1.evaluate(TestRuleMarkFailure.java:48)
	at org.apache.lucene.util.TestRuleIgnoreAfterMaxFailures$1.evaluate(TestRuleIgnoreAfterMaxFailures.java:65)
	at org.apache.lucene.util.TestRuleIgnoreTestSuites$1.evaluate(TestRuleIgnoreTestSuites.java:55)
	at com.carrotsearch.randomizedtesting.rules.StatementAdapter.evaluate(StatementAdapter.java:36)
	at com.carrotsearch.randomizedtesting.ThreadLeakControl$StatementRunner.run(ThreadLeakControl.java:365)
	at java.lang.Thread.run(Thread.java:745)
Caused by: java.lang.RuntimeException: REQUEST FAILED: xpath=//lst[@name='1']/arr[@name='tv_text']/str
	xml response was: <?xml version="1.0" encoding="UTF-8"?>
<response>
<lst name="responseHeader"><int name="status">0</int><int name="QTime">0</int></lst><result name="response" numFound="1" start="0"><doc><arr name="t_text"><str>a long day's night</str></arr><int name="id">1</int><arr name="range_facet_l"><long>1</long></arr><arr name="tv_text"><str>a long night's day</str></arr><long name="_version_">1486057696210714624</long><arr name="multiDefault"><str>muLti-Default</str></arr><int name="intDefault">42</int><date name="timestamp">2014-11-28T22:50:57.574Z</date></doc></result><lst name="highlighting"><lst name="1"><arr name="t_text"><str>a &lt;em&gt;long&lt;/em&gt; day's night</str></arr></lst></lst>
</response>

	request was:q=t_text:long&qt=standard&hl=true&start=0&hl.fl=t_text+tv_text&rows=200
	at org.apache.solr.SolrTestCaseJ4.assertQ(SolrTestCaseJ4.java:722)
	... 41 more


FAILED:  org.apache.solr.highlight.HighlighterTest.testTermVecHighlight

Error Message:
Exception during query

Stack Trace:
java.lang.RuntimeException: Exception during query
	at __randomizedtesting.SeedInfo.seed([B616D122261A4A31:9736A9F32F499E22]:0)
	at org.apache.solr.SolrTestCaseJ4.assertQ(SolrTestCaseJ4.java:729)
	at org.apache.solr.highlight.HighlighterTest.testTermVecHighlight(HighlighterTest.java:145)
	at sun.reflect.NativeMethodAccessorImpl.invoke0(Native Method)
	at sun.reflect.NativeMethodAccessorImpl.invoke(NativeMethodAccessorImpl.java:62)
	at sun.reflect.DelegatingMethodAccessorImpl.invoke(DelegatingMethodAccessorImpl.java:43)
	at java.lang.reflect.Method.invoke(Method.java:483)
	at com.carrotsearch.randomizedtesting.RandomizedRunner.invoke(RandomizedRunner.java:1618)
	at com.carrotsearch.randomizedtesting.RandomizedRunner$6.evaluate(RandomizedRunner.java:827)
	at com.carrotsearch.randomizedtesting.RandomizedRunner$7.evaluate(RandomizedRunner.java:863)
	at com.carrotsearch.randomizedtesting.RandomizedRunner$8.evaluate(RandomizedRunner.java:877)
	at com.carrotsearch.randomizedtesting.rules.SystemPropertiesRestoreRule$1.evaluate(SystemPropertiesRestoreRule.java:53)
	at org.apache.lucene.util.TestRuleSetupTeardownChained$1.evaluate(TestRuleSetupTeardownChained.java:50)
	at org.apache.lucene.util.AbstractBeforeAfterRule$1.evaluate(AbstractBeforeAfterRule.java:46)
	at com.carrotsearch.randomizedtesting.rules.SystemPropertiesInvariantRule$1.evaluate(SystemPropertiesInvariantRule.java:55)
	at org.apache.lucene.util.TestRuleThreadAndTestName$1.evaluate(TestRuleThreadAndTestName.java:49)
	at org.apache.lucene.util.TestRuleIgnoreAfterMaxFailures$1.evaluate(TestRuleIgnoreAfterMaxFailures.java:65)
	at org.apache.lucene.util.TestRuleMarkFailure$1.evaluate(TestRuleMarkFailure.java:48)
	at com.carrotsearch.randomizedtesting.rules.StatementAdapter.evaluate(StatementAdapter.java:36)
	at com.carrotsearch.randomizedtesting.ThreadLeakControl$StatementRunner.run(ThreadLeakControl.java:365)
	at com.carrotsearch.randomizedtesting.ThreadLeakControl.forkTimeoutingTask(ThreadLeakControl.java:798)
	at com.carrotsearch.randomizedtesting.ThreadLeakControl$3.evaluate(ThreadLeakControl.java:458)
	at com.carrotsearch.randomizedtesting.RandomizedRunner.runSingleTest(RandomizedRunner.java:836)
	at com.carrotsearch.randomizedtesting.RandomizedRunner$3.evaluate(RandomizedRunner.java:738)
	at com.carrotsearch.randomizedtesting.RandomizedRunner$4.evaluate(RandomizedRunner.java:772)
	at com.carrotsearch.randomizedtesting.RandomizedRunner$5.evaluate(RandomizedRunner.java:783)
	at com.carrotsearch.randomizedtesting.rules.StatementAdapter.evaluate(StatementAdapter.java:36)
	at com.carrotsearch.randomizedtesting.rules.SystemPropertiesRestoreRule$1.evaluate(SystemPropertiesRestoreRule.java:53)
	at org.apache.lucene.util.AbstractBeforeAfterRule$1.evaluate(AbstractBeforeAfterRule.java:46)
	at org.apache.lucene.util.TestRuleStoreClassName$1.evaluate(TestRuleStoreClassName.java:42)
	at com.carrotsearch.randomizedtesting.rules.SystemPropertiesInvariantRule$1.evaluate(SystemPropertiesInvariantRule.java:55)
	at com.carrotsearch.randomizedtesting.rules.NoShadowingOrOverridesOnMethodsRule$1.evaluate(NoShadowingOrOverridesOnMethodsRule.java:39)
	at com.carrotsearch.randomizedtesting.rules.NoShadowingOrOverridesOnMethodsRule$1.evaluate(NoShadowingOrOverridesOnMethodsRule.java:39)
	at com.carrotsearch.randomizedtesting.rules.StatementAdapter.evaluate(StatementAdapter.java:36)
	at com.carrotsearch.randomizedtesting.rules.StatementAdapter.evaluate(StatementAdapter.java:36)
	at com.carrotsearch.randomizedtesting.rules.StatementAdapter.evaluate(StatementAdapter.java:36)
	at org.apache.lucene.util.TestRuleAssertionsRequired$1.evaluate(TestRuleAssertionsRequired.java:54)
	at org.apache.lucene.util.TestRuleMarkFailure$1.evaluate(TestRuleMarkFailure.java:48)
	at org.apache.lucene.util.TestRuleIgnoreAfterMaxFailures$1.evaluate(TestRuleIgnoreAfterMaxFailures.java:65)
	at org.apache.lucene.util.TestRuleIgnoreTestSuites$1.evaluate(TestRuleIgnoreTestSuites.java:55)
	at com.carrotsearch.randomizedtesting.rules.StatementAdapter.evaluate(StatementAdapter.java:36)
	at com.carrotsearch.randomizedtesting.ThreadLeakControl$StatementRunner.run(ThreadLeakControl.java:365)
	at java.lang.Thread.run(Thread.java:745)
Caused by: java.lang.RuntimeException: REQUEST FAILED: xpath=//lst[@name='1']/arr[@name='tv_text']/str[.='a <em>long</em> days night this should be a piece of text which']
	xml response was: <?xml version="1.0" encoding="UTF-8"?>
<response>
<lst name="responseHeader"><int name="status">0</int><int name="QTime">0</int></lst><result name="response" numFound="1" start="0"><doc><arr name="tv_text"><str>a long days night this should be a piece of text which is is is is is is is is is is is is is is is is is is is is is is is is isis is is is is is is is is is is is is is is is is is is is is is is is is is is is is is is is is is is is is is is is is is is is is is is is is is is is is is is is is is is is is is is is is is is is is is is is is is is sufficiently lengthly to produce multiple fragments which are not concatenated at all--we want two disjoint long fragments.</str></arr><int name="id">1</int><arr name="range_facet_l"><long>1</long></arr><long name="_version_">1486057696297746432</long><arr name="multiDefault"><str>muLti-Default</str></arr><int name="intDefault">42</int><date name="timestamp">2014-11-28T22:50:57.657Z</date></doc></result><lst name="highlighting"><lst name="1"/></lst>
</response>

	request was:hl.snippets=2&q=tv_text:long&qt=standard&hl=true&start=0&hl.fl=tv_text&rows=200
	at org.apache.solr.SolrTestCaseJ4.assertQ(SolrTestCaseJ4.java:722)
	... 41 more


FAILED:  org.apache.solr.highlight.HighlighterTest.testTermVecMultiValuedHighlight2

Error Message:
Exception during query

Stack Trace:
java.lang.RuntimeException: Exception during query
	at __randomizedtesting.SeedInfo.seed([B616D122261A4A31:AE9FECFEB8C9DF03]:0)
	at org.apache.solr.SolrTestCaseJ4.assertQ(SolrTestCaseJ4.java:729)
	at org.apache.solr.highlight.HighlighterTest.testTermVecMultiValuedHighlight2(HighlighterTest.java:239)
	at sun.reflect.NativeMethodAccessorImpl.invoke0(Native Method)
	at sun.reflect.NativeMethodAccessorImpl.invoke(NativeMethodAccessorImpl.java:62)
	at sun.reflect.DelegatingMethodAccessorImpl.invoke(DelegatingMethodAccessorImpl.java:43)
	at java.lang.reflect.Method.invoke(Method.java:483)
	at com.carrotsearch.randomizedtesting.RandomizedRunner.invoke(RandomizedRunner.java:1618)
	at com.carrotsearch.randomizedtesting.RandomizedRunner$6.evaluate(RandomizedRunner.java:827)
	at com.carrotsearch.randomizedtesting.RandomizedRunner$7.evaluate(RandomizedRunner.java:863)
	at com.carrotsearch.randomizedtesting.RandomizedRunner$8.evaluate(RandomizedRunner.java:877)
	at com.carrotsearch.randomizedtesting.rules.SystemPropertiesRestoreRule$1.evaluate(SystemPropertiesRestoreRule.java:53)
	at org.apache.lucene.util.TestRuleSetupTeardownChained$1.evaluate(TestRuleSetupTeardownChained.java:50)
	at org.apache.lucene.util.AbstractBeforeAfterRule$1.evaluate(AbstractBeforeAfterRule.java:46)
	at com.carrotsearch.randomizedtesting.rules.SystemPropertiesInvariantRule$1.evaluate(SystemPropertiesInvariantRule.java:55)
	at org.apache.lucene.util.TestRuleThreadAndTestName$1.evaluate(TestRuleThreadAndTestName.java:49)
	at org.apache.lucene.util.TestRuleIgnoreAfterMaxFailures$1.evaluate(TestRuleIgnoreAfterMaxFailures.java:65)
	at org.apache.lucene.util.TestRuleMarkFailure$1.evaluate(TestRuleMarkFailure.java:48)
	at com.carrotsearch.randomizedtesting.rules.StatementAdapter.evaluate(StatementAdapter.java:36)
	at com.carrotsearch.randomizedtesting.ThreadLeakControl$StatementRunner.run(ThreadLeakControl.java:365)
	at com.carrotsearch.randomizedtesting.ThreadLeakControl.forkTimeoutingTask(ThreadLeakControl.java:798)
	at com.carrotsearch.randomizedtesting.ThreadLeakControl$3.evaluate(ThreadLeakControl.java:458)
	at com.carrotsearch.randomizedtesting.RandomizedRunner.runSingleTest(RandomizedRunner.java:836)
	at com.carrotsearch.randomizedtesting.RandomizedRunner$3.evaluate(RandomizedRunner.java:738)
	at com.carrotsearch.randomizedtesting.RandomizedRunner$4.evaluate(RandomizedRunner.java:772)
	at com.carrotsearch.randomizedtesting.RandomizedRunner$5.evaluate(RandomizedRunner.java:783)
	at com.carrotsearch.randomizedtesting.rules.StatementAdapter.evaluate(StatementAdapter.java:36)
	at com.carrotsearch.randomizedtesting.rules.SystemPropertiesRestoreRule$1.evaluate(SystemPropertiesRestoreRule.java:53)
	at org.apache.lucene.util.AbstractBeforeAfterRule$1.evaluate(AbstractBeforeAfterRule.java:46)
	at org.apache.lucene.util.TestRuleStoreClassName$1.evaluate(TestRuleStoreClassName.java:42)
	at com.carrotsearch.randomizedtesting.rules.SystemPropertiesInvariantRule$1.evaluate(SystemPropertiesInvariantRule.java:55)
	at com.carrotsearch.randomizedtesting.rules.NoShadowingOrOverridesOnMethodsRule$1.evaluate(NoShadowingOrOverridesOnMethodsRule.java:39)
	at com.carrotsearch.randomizedtesting.rules.NoShadowingOrOverridesOnMethodsRule$1.evaluate(NoShadowingOrOverridesOnMethodsRule.java:39)
	at com.carrotsearch.randomizedtesting.rules.StatementAdapter.evaluate(StatementAdapter.java:36)
	at com.carrotsearch.randomizedtesting.rules.StatementAdapter.evaluate(StatementAdapter.java:36)
	at com.carrotsearch.randomizedtesting.rules.StatementAdapter.evaluate(StatementAdapter.java:36)
	at org.apache.lucene.util.TestRuleAssertionsRequired$1.evaluate(TestRuleAssertionsRequired.java:54)
	at org.apache.lucene.util.TestRuleMarkFailure$1.evaluate(TestRuleMarkFailure.java:48)
	at org.apache.lucene.util.TestRuleIgnoreAfterMaxFailures$1.evaluate(TestRuleIgnoreAfterMaxFailures.java:65)
	at org.apache.lucene.util.TestRuleIgnoreTestSuites$1.evaluate(TestRuleIgnoreTestSuites.java:55)
	at com.carrotsearch.randomizedtesting.rules.StatementAdapter.evaluate(StatementAdapter.java:36)
	at com.carrotsearch.randomizedtesting.ThreadLeakControl$StatementRunner.run(ThreadLeakControl.java:365)
	at java.lang.Thread.run(Thread.java:745)
Caused by: java.lang.RuntimeException: REQUEST FAILED: xpath=//lst[@name='1']/arr[@name='tv_mv_text']/str[.='a <em>long</em> days night this should be a piece of text which']
	xml response was: <?xml version="1.0" encoding="UTF-8"?>
<response>
<lst name="responseHeader"><int name="status">0</int><int name="QTime">2</int></lst><result name="response" numFound="1" start="0"><doc><arr name="tv_mv_text"><str>short</str><str>a long days night this should be a piece of text which is is is is is is is is is is is is is is is is is is is is is is is is isis is is is is is is is is is is is is is is is is is is is is is is is is is is is is is is is is is is is is is is is is is is is is is is is is is is is is is is is is is is is is is is is is is is is is is is is is is is sufficiently lengthly to produce multiple fragments which are not concatenated at all--we want two disjoint long fragments.</str></arr><int name="id">1</int><arr name="range_facet_l"><long>1</long></arr><long name="_version_">1486057696578764800</long><arr name="multiDefault"><str>muLti-Default</str></arr><int name="intDefault">42</int><date name="timestamp">2014-11-28T22:50:57.925Z</date></doc></result><lst name="highlighting"><lst name="1"/></lst>
</response>

	request was:hl.snippets=2&q=tv_mv_text:long&qt=standard&hl=true&start=0&hl.fl=tv_mv_text&rows=200
	at org.apache.solr.SolrTestCaseJ4.assertQ(SolrTestCaseJ4.java:722)
	... 41 more


FAILED:  org.apache.solr.highlight.HighlighterTest.testSubwordWildcardHighlightWithTermOffsets2

Error Message:
Exception during query

Stack Trace:
java.lang.RuntimeException: Exception during query
	at __randomizedtesting.SeedInfo.seed([B616D122261A4A31:84B58AABE6B6B05F]:0)
	at org.apache.solr.SolrTestCaseJ4.assertQ(SolrTestCaseJ4.java:729)
	at org.apache.solr.highlight.HighlighterTest.testSubwordWildcardHighlightWithTermOffsets2(HighlighterTest.java:843)
	at sun.reflect.NativeMethodAccessorImpl.invoke0(Native Method)
	at sun.reflect.NativeMethodAccessorImpl.invoke(NativeMethodAccessorImpl.java:62)
	at sun.reflect.DelegatingMethodAccessorImpl.invoke(DelegatingMethodAccessorImpl.java:43)
	at java.lang.reflect.Method.invoke(Method.java:483)
	at com.carrotsearch.randomizedtesting.RandomizedRunner.invoke(RandomizedRunner.java:1618)
	at com.carrotsearch.randomizedtesting.RandomizedRunner$6.evaluate(RandomizedRunner.java:827)
	at com.carrotsearch.randomizedtesting.RandomizedRunner$7.evaluate(RandomizedRunner.java:863)
	at com.carrotsearch.randomizedtesting.RandomizedRunner$8.evaluate(RandomizedRunner.java:877)
	at com.carrotsearch.randomizedtesting.rules.SystemPropertiesRestoreRule$1.evaluate(SystemPropertiesRestoreRule.java:53)
	at org.apache.lucene.util.TestRuleSetupTeardownChained$1.evaluate(TestRuleSetupTeardownChained.java:50)
	at org.apache.lucene.util.AbstractBeforeAfterRule$1.evaluate(AbstractBeforeAfterRule.java:46)
	at com.carrotsearch.randomizedtesting.rules.SystemPropertiesInvariantRule$1.evaluate(SystemPropertiesInvariantRule.java:55)
	at org.apache.lucene.util.TestRuleThreadAndTestName$1.evaluate(TestRuleThreadAndTestName.java:49)
	at org.apache.lucene.util.TestRuleIgnoreAfterMaxFailures$1.evaluate(TestRuleIgnoreAfterMaxFailures.java:65)
	at org.apache.lucene.util.TestRuleMarkFailure$1.evaluate(TestRuleMarkFailure.java:48)
	at com.carrotsearch.randomizedtesting.rules.StatementAdapter.evaluate(StatementAdapter.java:36)
	at com.carrotsearch.randomizedtesting.ThreadLeakControl$StatementRunner.run(ThreadLeakControl.java:365)
	at com.carrotsearch.randomizedtesting.ThreadLeakControl.forkTimeoutingTask(ThreadLeakControl.java:798)
	at com.carrotsearch.randomizedtesting.ThreadLeakControl$3.evaluate(ThreadLeakControl.java:458)
	at com.carrotsearch.randomizedtesting.RandomizedRunner.runSingleTest(RandomizedRunner.java:836)
	at com.carrotsearch.randomizedtesting.RandomizedRunner$3.evaluate(RandomizedRunner.java:738)
	at com.carrotsearch.randomizedtesting.RandomizedRunner$4.evaluate(RandomizedRunner.java:772)
	at com.carrotsearch.randomizedtesting.RandomizedRunner$5.evaluate(RandomizedRunner.java:783)
	at com.carrotsearch.randomizedtesting.rules.StatementAdapter.evaluate(StatementAdapter.java:36)
	at com.carrotsearch.randomizedtesting.rules.SystemPropertiesRestoreRule$1.evaluate(SystemPropertiesRestoreRule.java:53)
	at org.apache.lucene.util.AbstractBeforeAfterRule$1.evaluate(AbstractBeforeAfterRule.java:46)
	at org.apache.lucene.util.TestRuleStoreClassName$1.evaluate(TestRuleStoreClassName.java:42)
	at com.carrotsearch.randomizedtesting.rules.SystemPropertiesInvariantRule$1.evaluate(SystemPropertiesInvariantRule.java:55)
	at com.carrotsearch.randomizedtesting.rules.NoShadowingOrOverridesOnMethodsRule$1.evaluate(NoShadowingOrOverridesOnMethodsRule.java:39)
	at com.carrotsearch.randomizedtesting.rules.NoShadowingOrOverridesOnMethodsRule$1.evaluate(NoShadowingOrOverridesOnMethodsRule.java:39)
	at com.carrotsearch.randomizedtesting.rules.StatementAdapter.evaluate(StatementAdapter.java:36)
	at com.carrotsearch.randomizedtesting.rules.StatementAdapter.evaluate(StatementAdapter.java:36)
	at com.carrotsearch.randomizedtesting.rules.StatementAdapter.evaluate(StatementAdapter.java:36)
	at org.apache.lucene.util.TestRuleAssertionsRequired$1.evaluate(TestRuleAssertionsRequired.java:54)
	at org.apache.lucene.util.TestRuleMarkFailure$1.evaluate(TestRuleMarkFailure.java:48)
	at org.apache.lucene.util.TestRuleIgnoreAfterMaxFailures$1.evaluate(TestRuleIgnoreAfterMaxFailures.java:65)
	at org.apache.lucene.util.TestRuleIgnoreTestSuites$1.evaluate(TestRuleIgnoreTestSuites.java:55)
	at com.carrotsearch.randomizedtesting.rules.StatementAdapter.evaluate(StatementAdapter.java:36)
	at com.carrotsearch.randomizedtesting.ThreadLeakControl$StatementRunner.run(ThreadLeakControl.java:365)
	at java.lang.Thread.run(Thread.java:745)
Caused by: java.lang.RuntimeException: REQUEST FAILED: xpath=//lst[@name='highlighting']/lst[@name='1']/arr[@name='subword_offsets']/str='lorem <em>PowerShot</em> ipsum'
	xml response was: <?xml version="1.0" encoding="UTF-8"?>
<response>
<lst name="responseHeader"><int name="status">0</int><int name="QTime">0</int></lst><result name="response" numFound="1" start="0"><doc><arr name="subword_offsets"><str>lorem PowerShot ipsum</str></arr><int name="id">1</int><arr name="range_facet_l"><long>1</long></arr><long name="_version_">1486057696895434752</long><arr name="multiDefault"><str>muLti-Default</str></arr><int name="intDefault">42</int><date name="timestamp">2014-11-28T22:50:58.227Z</date></doc></result><lst name="highlighting"><lst name="1"/></lst>
</response>

	request was:q=subword_offsets:pow*&hl=true&hl.fl=subword_offsets&wt=xml
	at org.apache.solr.SolrTestCaseJ4.assertQ(SolrTestCaseJ4.java:722)
	... 41 more




Build Log:
[...truncated 9728 lines...]
   [junit4] Suite: org.apache.solr.highlight.HighlighterTest
   [junit4]   2> Creating dataDir: /mnt/ssd/jenkins/workspace/Lucene-Solr-5.x-Linux/solr/build/solr-core/test/J1/temp/solr.highlight.HighlighterTest-B616D122261A4A31-001/init-core-data-001
   [junit4]   2> 2242756 T8732 oas.SolrTestCaseJ4.buildSSLConfig Randomized ssl (true) and clientAuth (false)
   [junit4]   2> 2242757 T8732 oas.SolrTestCaseJ4.initCore ####initCore
   [junit4]   2> 2242757 T8732 oasc.SolrResourceLoader.<init> new SolrResourceLoader for directory: '/mnt/ssd/jenkins/workspace/Lucene-Solr-5.x-Linux/solr/core/src/test-files/solr/collection1/'
   [junit4]   2> 2242758 T8732 oasc.SolrResourceLoader.replaceClassLoader Adding 'file:/mnt/ssd/jenkins/workspace/Lucene-Solr-5.x-Linux/solr/core/src/test-files/solr/collection1/lib/.svn/' to classloader
   [junit4]   2> 2242758 T8732 oasc.SolrResourceLoader.replaceClassLoader Adding 'file:/mnt/ssd/jenkins/workspace/Lucene-Solr-5.x-Linux/solr/core/src/test-files/solr/collection1/lib/classes/' to classloader
   [junit4]   2> 2242759 T8732 oasc.SolrResourceLoader.replaceClassLoader Adding 'file:/mnt/ssd/jenkins/workspace/Lucene-Solr-5.x-Linux/solr/core/src/test-files/solr/collection1/lib/README' to classloader
   [junit4]   2> 2242801 T8732 oasc.SolrConfig.<init> Using Lucene MatchVersion: 5.0.0
   [junit4]   2> 2242831 T8732 oasc.SolrConfig.<init> Loaded SolrConfig: solrconfig.xml
   [junit4]   2> 2242832 T8732 oass.IndexSchema.readSchema Reading Solr Schema from /mnt/ssd/jenkins/workspace/Lucene-Solr-5.x-Linux/solr/core/src/test-files/solr/collection1/conf/schema.xml
   [junit4]   2> 2242839 T8732 oass.IndexSchema.readSchema [null] Schema name=test
   [junit4]   2> 2242948 T8732 oass.OpenExchangeRatesOrgProvider.init Initialized with rates=open-exchange-rates.json, refreshInterval=1440.
   [junit4]   2> 2242954 T8732 oass.IndexSchema.readSchema default search field in schema is text
   [junit4]   2> 2242956 T8732 oass.IndexSchema.readSchema unique key field: id
   [junit4]   2> 2242962 T8732 oass.FileExchangeRateProvider.reload Reloading exchange rates from file currency.xml
   [junit4]   2> 2242965 T8732 oass.FileExchangeRateProvider.reload Reloading exchange rates from file currency.xml
   [junit4]   2> 2242967 T8732 oass.OpenExchangeRatesOrgProvider.reload Reloading exchange rates from open-exchange-rates.json
   [junit4]   2> 2242968 T8732 oass.OpenExchangeRatesOrgProvider$OpenExchangeRates.<init> WARN Unknown key IMPORTANT NOTE
   [junit4]   2> 2242969 T8732 oass.OpenExchangeRatesOrgProvider$OpenExchangeRates.<init> WARN Expected key, got STRING
   [junit4]   2> 2242969 T8732 oass.OpenExchangeRatesOrgProvider.reload Reloading exchange rates from open-exchange-rates.json
   [junit4]   2> 2242970 T8732 oass.OpenExchangeRatesOrgProvider$OpenExchangeRates.<init> WARN Unknown key IMPORTANT NOTE
   [junit4]   2> 2242970 T8732 oass.OpenExchangeRatesOrgProvider$OpenExchangeRates.<init> WARN Expected key, got STRING
   [junit4]   2> 2242971 T8732 oasc.SolrResourceLoader.locateSolrHome JNDI not configured for solr (NoInitialContextEx)
   [junit4]   2> 2242971 T8732 oasc.SolrResourceLoader.locateSolrHome using system property solr.solr.home: /mnt/ssd/jenkins/workspace/Lucene-Solr-5.x-Linux/solr/core/src/test-files/solr
   [junit4]   2> 2242971 T8732 oasc.SolrResourceLoader.<init> new SolrResourceLoader for directory: '/mnt/ssd/jenkins/workspace/Lucene-Solr-5.x-Linux/solr/core/src/test-files/solr/'
   [junit4]   2> 2242991 T8732 oasc.CoreContainer.<init> New CoreContainer 19845663
   [junit4]   2> 2242991 T8732 oasc.CoreContainer.load Loading cores into CoreContainer [instanceDir=/mnt/ssd/jenkins/workspace/Lucene-Solr-5.x-Linux/solr/core/src/test-files/solr/]
   [junit4]   2> 2242992 T8732 oashc.HttpShardHandlerFactory.getParameter Setting socketTimeout to: 0
   [junit4]   2> 2242992 T8732 oashc.HttpShardHandlerFactory.getParameter Setting urlScheme to: null
   [junit4]   2> 2242993 T8732 oashc.HttpShardHandlerFactory.getParameter Setting connTimeout to: 0
   [junit4]   2> 2242993 T8732 oashc.HttpShardHandlerFactory.getParameter Setting maxConnectionsPerHost to: 20
   [junit4]   2> 2242993 T8732 oashc.HttpShardHandlerFactory.getParameter Setting maxConnections to: 10000
   [junit4]   2> 2242994 T8732 oashc.HttpShardHandlerFactory.getParameter Setting corePoolSize to: 0
   [junit4]   2> 2242994 T8732 oashc.HttpShardHandlerFactory.getParameter Setting maximumPoolSize to: 2147483647
   [junit4]   2> 2242994 T8732 oashc.HttpShardHandlerFactory.getParameter Setting maxThreadIdleTime to: 5
   [junit4]   2> 2242995 T8732 oashc.HttpShardHandlerFactory.getParameter Setting sizeOfQueue to: -1
   [junit4]   2> 2242995 T8732 oashc.HttpShardHandlerFactory.getParameter Setting fairnessPolicy to: false
   [junit4]   2> 2242996 T8732 oasu.UpdateShardHandler.<init> Creating UpdateShardHandler HTTP client with params: socketTimeout=30000&connTimeout=30000&retry=false
   [junit4]   2> 2242998 T8732 oasl.LogWatcher.createWatcher SLF4J impl is org.slf4j.impl.Log4jLoggerFactory
   [junit4]   2> 2242998 T8732 oasl.LogWatcher.newRegisteredLogWatcher Registering Log Listener [Log4j (org.slf4j.impl.Log4jLoggerFactory)]
   [junit4]   2> 2242998 T8732 oasc.CoreContainer.load Host Name: 
   [junit4]   2> 2243000 T8733 oasc.SolrResourceLoader.<init> new SolrResourceLoader for directory: '/mnt/ssd/jenkins/workspace/Lucene-Solr-5.x-Linux/solr/core/src/test-files/solr/collection1/'
   [junit4]   2> 2243001 T8733 oasc.SolrResourceLoader.replaceClassLoader Adding 'file:/mnt/ssd/jenkins/workspace/Lucene-Solr-5.x-Linux/solr/core/src/test-files/solr/collection1/lib/.svn/' to classloader
   [junit4]   2> 2243002 T8733 oasc.SolrResourceLoader.replaceClassLoader Adding 'file:/mnt/ssd/jenkins/workspace/Lucene-Solr-5.x-Linux/solr/core/src/test-files/solr/collection1/lib/classes/' to classloader
   [junit4]   2> 2243002 T8733 oasc.SolrResourceLoader.replaceClassLoader Adding 'file:/mnt/ssd/jenkins/workspace/Lucene-Solr-5.x-Linux/solr/core/src/test-files/solr/collection1/lib/README' to classloader
   [junit4]   2> 2243031 T8733 oasc.SolrConfig.<init> Using Lucene MatchVersion: 5.0.0
   [junit4]   2> 2243056 T8733 oasc.SolrConfig.<init> Loaded SolrConfig: solrconfig.xml
   [junit4]   2> 2243057 T8733 oass.IndexSchema.readSchema Reading Solr Schema from /mnt/ssd/jenkins/workspace/Lucene-Solr-5.x-Linux/solr/core/src/test-files/solr/collection1/conf/schema.xml
   [junit4]   2> 2243063 T8733 oass.IndexSchema.readSchema [collection1] Schema name=test
   [junit4]   2> 2243171 T8733 oass.OpenExchangeRatesOrgProvider.init Initialized with rates=open-exchange-rates.json, refreshInterval=1440.
   [junit4]   2> 2243175 T8733 oass.IndexSchema.readSchema default search field in schema is text
   [junit4]   2> 2243177 T8733 oass.IndexSchema.readSchema unique key field: id
   [junit4]   2> 2243181 T8733 oass.FileExchangeRateProvider.reload Reloading exchange rates from file currency.xml
   [junit4]   2> 2243184 T8733 oass.FileExchangeRateProvider.reload Reloading exchange rates from file currency.xml
   [junit4]   2> 2243186 T8733 oass.OpenExchangeRatesOrgProvider.reload Reloading exchange rates from open-exchange-rates.json
   [junit4]   2> 2243186 T8733 oass.OpenExchangeRatesOrgProvider$OpenExchangeRates.<init> WARN Unknown key IMPORTANT NOTE
   [junit4]   2> 2243186 T8733 oass.OpenExchangeRatesOrgProvider$OpenExchangeRates.<init> WARN Expected key, got STRING
   [junit4]   2> 2243187 T8733 oass.OpenExchangeRatesOrgProvider.reload Reloading exchange rates from open-exchange-rates.json
   [junit4]   2> 2243187 T8733 oass.OpenExchangeRatesOrgProvider$OpenExchangeRates.<init> WARN Unknown key IMPORTANT NOTE
   [junit4]   2> 2243187 T8733 oass.OpenExchangeRatesOrgProvider$OpenExchangeRates.<init> WARN Expected key, got STRING
   [junit4]   2> 2243188 T8733 oasc.CoreContainer.create Creating SolrCore 'collection1' using configuration from instancedir /mnt/ssd/jenkins/workspace/Lucene-Solr-5.x-Linux/solr/core/src/test-files/solr/collection1/
   [junit4]   2> 2243188 T8733 oasc.SolrCore.initDirectoryFactory org.apache.solr.core.MockDirectoryFactory
   [junit4]   2> 2243188 T8733 oasc.SolrCore.<init> [collection1] Opening new SolrCore at /mnt/ssd/jenkins/workspace/Lucene-Solr-5.x-Linux/solr/core/src/test-files/solr/collection1/, dataDir=/mnt/ssd/jenkins/workspace/Lucene-Solr-5.x-Linux/solr/build/solr-core/test/J1/temp/solr.highlight.HighlighterTest-B616D122261A4A31-001/init-core-data-001/
   [junit4]   2> 2243188 T8733 oasc.JmxMonitoredMap.<init> JMX monitoring is enabled. Adding Solr mbeans to JMX Server: com.sun.jmx.mbeanserver.JmxMBeanServer@157252f
   [junit4]   2> 2243189 T8733 oasc.CachingDirectoryFactory.get return new directory for /mnt/ssd/jenkins/workspace/Lucene-Solr-5.x-Linux/solr/build/solr-core/test/J1/temp/solr.highlight.HighlighterTest-B616D122261A4A31-001/init-core-data-001
   [junit4]   2> 2243189 T8733 oasc.SolrCore.getNewIndexDir New index directory detected: old=null new=/mnt/ssd/jenkins/workspace/Lucene-Solr-5.x-Linux/solr/build/solr-core/test/J1/temp/solr.highlight.HighlighterTest-B616D122261A4A31-001/init-core-data-001/index/
   [junit4]   2> 2243190 T8733 oasc.SolrCore.initIndex WARN [collection1] Solr index directory '/mnt/ssd/jenkins/workspace/Lucene-Solr-5.x-Linux/solr/build/solr-core/test/J1/temp/solr.highlight.HighlighterTest-B616D122261A4A31-001/init-core-data-001/index' doesn't exist. Creating new index...
   [junit4]   2> 2243190 T8733 oasc.CachingDirectoryFactory.get return new directory for /mnt/ssd/jenkins/workspace/Lucene-Solr-5.x-Linux/solr/build/solr-core/test/J1/temp/solr.highlight.HighlighterTest-B616D122261A4A31-001/init-core-data-001/index
   [junit4]   2> 2243190 T8733 oasu.RandomMergePolicy.<init> RandomMergePolicy wrapping class org.apache.lucene.index.LogDocMergePolicy: [LogDocMergePolicy: minMergeSize=1000, mergeFactor=22, maxMergeSize=9223372036854775807, maxMergeSizeForForcedMerge=9223372036854775807, calibrateSizeByDeletes=false, maxMergeDocs=2147483647, maxCFSSegmentSizeMB=0.296875, noCFSRatio=0.26911317487157604]
   [junit4]   2> 2243191 T8733 oasc.SolrDeletionPolicy.onCommit SolrDeletionPolicy.onCommit: commits: num=1
   [junit4]   2> 		commit{dir=RateLimitedDirectoryWrapper(MockDirectoryWrapper(RAMDirectory@19e3610 lockFactory=org.apache.lucene.store.SingleInstanceLockFactory@7750cb)),segFN=segments_1,generation=1}
   [junit4]   2> 2243191 T8733 oasc.SolrDeletionPolicy.updateCommits newest commit generation = 1
   [junit4]   2> 2243192 T8733 oasc.SolrCore.initWriters created xml: solr.XMLResponseWriter
   [junit4]   2> 2243194 T8733 oasup.UpdateRequestProcessorChain.init creating updateRequestProcessorChain "dedupe"
   [junit4]   2> 2243195 T8733 oasup.UpdateRequestProcessorChain.init inserting DistributedUpdateProcessorFactory into updateRequestProcessorChain "dedupe"
   [junit4]   2> 2243195 T8733 oasup.UpdateRequestProcessorChain.init creating updateRequestProcessorChain "dedupe-allfields"
   [junit4]   2> 2243195 T8733 oasup.UpdateRequestProcessorChain.init inserting DistributedUpdateProcessorFactory into updateRequestProcessorChain "dedupe-allfields"
   [junit4]   2> 2243196 T8733 oasup.UpdateRequestProcessorChain.init creating updateRequestProcessorChain "stored_sig"
   [junit4]   2> 2243196 T8733 oasup.UpdateRequestProcessorChain.init inserting DistributedUpdateProcessorFactory into updateRequestProcessorChain "stored_sig"
   [junit4]   2> 2243196 T8733 oasup.UpdateRequestProcessorChain.init creating updateRequestProcessorChain "uniq-fields"
   [junit4]   2> 2243196 T8733 oasup.UpdateRequestProcessorChain.init inserting DistributedUpdateProcessorFactory into updateRequestProcessorChain "uniq-fields"
   [junit4]   2> 2243197 T8733 oasup.UpdateRequestProcessorChain.init creating updateRequestProcessorChain "distrib-dup-test-chain-explicit"
   [junit4]   2> 2243197 T8733 oasup.UpdateRequestProcessorChain.init creating updateRequestProcessorChain "distrib-dup-test-chain-implicit"
   [junit4]   2> 2243197 T8733 oasup.UpdateRequestProcessorChain.init inserting DistributedUpdateProcessorFactory into updateRequestProcessorChain "distrib-dup-test-chain-implicit"
   [junit4]   2> 2243198 T8733 oasc.SolrCore.loadUpdateProcessorChains no updateRequestProcessorChain defined as default, creating implicit default
   [junit4]   2> 2243198 T8733 oasc.RequestHandlers.initHandlersFromConfig created /update: org.apache.solr.handler.UpdateRequestHandler
   [junit4]   2> 2243199 T8733 oasc.RequestHandlers.initHandlersFromConfig created /update/json: org.apache.solr.handler.UpdateRequestHandler
   [junit4]   2> 2243199 T8733 oasc.RequestHandlers.initHandlersFromConfig created /update/csv: org.apache.solr.handler.UpdateRequestHandler
   [junit4]   2> 2243199 T8733 oasc.RequestHandlers.initHandlersFromConfig created /update/json/docs: org.apache.solr.handler.UpdateRequestHandler
   [junit4]   2> 2243200 T8733 oasc.RequestHandlers.initHandlersFromConfig created /config: org.apache.solr.handler.SolrConfigHandler
   [junit4]   2> 2243200 T8733 oasc.RequestHandlers.initHandlersFromConfig created /replication: org.apache.solr.handler.ReplicationHandler
   [junit4]   2> 2243201 T8733 oasc.RequestHandlers.initHandlersFromConfig created /get: org.apache.solr.handler.RealTimeGetHandler
   [junit4]   2> 2243201 T8733 oasc.RequestHandlers.initHandlersFromConfig created /admin/luke: org.apache.solr.handler.admin.LukeRequestHandler
   [junit4]   2> 2243202 T8733 oasc.RequestHandlers.initHandlersFromConfig created /admin/system: org.apache.solr.handler.admin.SystemInfoHandler
   [junit4]   2> 2243202 T8733 oasc.RequestHandlers.initHandlersFromConfig created /admin/mbeans: org.apache.solr.handler.admin.SolrInfoMBeanHandler
   [junit4]   2> 2243203 T8733 oasc.RequestHandlers.initHandlersFromConfig created /admin/plugins: org.apache.solr.handler.admin.PluginInfoHandler
   [junit4]   2> 2243203 T8733 oasc.RequestHandlers.initHandlersFromConfig created /admin/threads: org.apache.solr.handler.admin.ThreadDumpHandler
   [junit4]   2> 2243203 T8733 oasc.RequestHandlers.initHandlersFromConfig created /admin/properties: org.apache.solr.handler.admin.PropertiesRequestHandler
   [junit4]   2> 2243204 T8733 oasc.RequestHandlers.initHandlersFromConfig created /admin/logging: org.apache.solr.handler.admin.LoggingHandler
   [junit4]   2> 2243204 T8733 oasc.RequestHandlers.initHandlersFromConfig created /admin/ping: org.apache.solr.handler.PingRequestHandler
   [junit4]   2> 2243205 T8733 oasc.RequestHandlers.initHandlersFromConfig created standard: solr.StandardRequestHandler
   [junit4]   2> 2243205 T8733 oasc.RequestHandlers.initHandlersFromConfig created dismax: solr.SearchHandler
   [junit4]   2> 2243205 T8733 oasc.RequestHandlers.initHandlersFromConfig created mock: org.apache.solr.core.MockQuerySenderListenerReqHandler
   [junit4]   2> 2243206 T8733 oasc.RequestHandlers.initHandlersFromConfig created /admin/file: solr.admin.ShowFileRequestHandler
   [junit4]   2> 2243206 T8733 oasc.RequestHandlers.initHandlersFromConfig created /admin/fileedit: solr.admin.EditFileRequestHandler
   [junit4]   2> 2243206 T8733 oasc.RequestHandlers.initHandlersFromConfig created defaults: solr.StandardRequestHandler
   [junit4]   2> 2243207 T8733 oasc.RequestHandlers.initHandlersFromConfig adding lazy requestHandler: solr.StandardRequestHandler
   [junit4]   2> 2243207 T8733 oasc.RequestHandlers.initHandlersFromConfig created lazy: solr.StandardRequestHandler
   [junit4]   2> 2243207 T8733 oasc.RequestHandlers.initHandlersFromConfig created /terms: org.apache.solr.handler.component.SearchHandler
   [junit4]   2> 2243208 T8733 oasc.RequestHandlers.initHandlersFromConfig created spellCheckCompRH: org.apache.solr.handler.component.SearchHandler
   [junit4]   2> 2243208 T8733 oasc.RequestHandlers.initHandlersFromConfig created spellCheckCompRH_Direct: org.apache.solr.handler.component.SearchHandler
   [junit4]   2> 2243208 T8733 oasc.RequestHandlers.initHandlersFromConfig created spellCheckWithWordbreak: org.apache.solr.handler.component.SearchHandler
   [junit4]   2> 2243209 T8733 oasc.RequestHandlers.initHandlersFromConfig created spellCheckWithWordbreak_Direct: org.apache.solr.handler.component.SearchHandler
   [junit4]   2> 2243209 T8733 oasc.RequestHandlers.initHandlersFromConfig created spellCheckCompRH1: org.apache.solr.handler.component.SearchHandler
   [junit4]   2> 2243209 T8733 oasc.RequestHandlers.initHandlersFromConfig created mltrh: org.apache.solr.handler.component.SearchHandler
   [junit4]   2> 2243210 T8733 oasc.RequestHandlers.initHandlersFromConfig created tvrh: org.apache.solr.handler.component.SearchHandler
   [junit4]   2> 2243210 T8733 oasc.RequestHandlers.initHandlersFromConfig created /mlt: solr.MoreLikeThisHandler
   [junit4]   2> 2243210 T8733 oasc.RequestHandlers.initHandlersFromConfig created /debug/dump: solr.DumpRequestHandler
   [junit4]   2> 2243213 T8733 oashl.XMLLoader.init xsltCacheLifetimeSeconds=60
   [junit4]   2> 2243214 T8733 oashl.XMLLoader.init xsltCacheLifetimeSeconds=60
   [junit4]   2> 2243215 T8733 oashl.XMLLoader.init xsltCacheLifetimeSeconds=60
   [junit4]   2> 2243216 T8733 oashl.XMLLoader.init xsltCacheLifetimeSeconds=60
   [junit4]   2> 2243217 T8733 oasc.SolrCore.initDeprecatedSupport WARN solrconfig.xml uses deprecated <admin/gettableFiles>, Please update your config to use the ShowFileRequestHandler.
   [junit4]   2> 2243218 T8733 oasu.CommitTracker.<init> Hard AutoCommit: disabled
   [junit4]   2> 2243219 T8733 oasu.CommitTracker.<init> Soft AutoCommit: disabled
   [junit4]   2> 2243219 T8733 oasu.RandomMergePolicy.<init> RandomMergePolicy wrapping class org.apache.lucene.index.LogDocMergePolicy: [LogDocMergePolicy: minMergeSize=1000, mergeFactor=4, maxMergeSize=9223372036854775807, maxMergeSizeForForcedMerge=9223372036854775807, calibrateSizeByDeletes=true, maxMergeDocs=2147483647, maxCFSSegmentSizeMB=8.796093022207999E12, noCFSRatio=0.0]
   [junit4]   2> 2243220 T8733 oasc.SolrDeletionPolicy.onInit SolrDeletionPolicy.onInit: commits: num=1
   [junit4]   2> 		commit{dir=RateLimitedDirectoryWrapper(MockDirectoryWrapper(RAMDirectory@19e3610 lockFactory=org.apache.lucene.store.SingleInstanceLockFactory@7750cb)),segFN=segments_1,generation=1}
   [junit4]   2> 2243220 T8733 oasc.SolrDeletionPolicy.updateCommits newest commit generation = 1
   [junit4]   2> 2243220 T8733 oass.SolrIndexSearcher.<init> Opening Searcher@7f0248[collection1] main
   [junit4]   2> 2243221 T8733 oasr.RestManager.init Initializing RestManager with initArgs: {storageIO=org.apache.solr.rest.ManagedResourceStorage$InMemoryStorageIO}
   [junit4]   2> 2243221 T8733 oasr.ManagedResourceStorage.load Reading _rest_managed.json using InMemoryStorage
   [junit4]   2> 2243221 T8733 oasr.ManagedResource.reloadFromStorage WARN No stored data found for /rest/managed
   [junit4]   2> 2243222 T8733 oasr.ManagedResourceStorage$JsonStorage.store Saved JSON object to path _rest_managed.json using InMemoryStorage
   [junit4]   2> 2243222 T8733 oasr.RestManager.init Initializing 0 registered ManagedResources
   [junit4]   2> 2243222 T8733 oashc.SpellCheckComponent.inform Initializing spell checkers
   [junit4]   2> 2243585 T8733 oass.DirectSolrSpellChecker.init init: {name=direct,classname=DirectSolrSpellChecker,field=lowerfilt,minQueryLength=3}
   [junit4]   2> 2243598 T8733 oash.ReplicationHandler.inform Commits will be reserved for  10000
   [junit4]   2> 2243599 T8734 oasc.SolrCore.registerSearcher [collection1] Registered new searcher Searcher@7f0248[collection1] main{ExitableDirectoryReader(UninvertingDirectoryReader())}
   [junit4]   2> 2243600 T8733 oasc.CoreContainer.registerCore registering core: collection1
   [junit4]   2> 2243601 T8732 oas.SolrTestCaseJ4.initCore ####initCore end
   [junit4]   2> 2243605 T8732 oas.SolrTestCaseJ4.setUp ###Starting testMaxMvParams
   [junit4]   2> ASYNC  NEW_CORE C1513 name=collection1 org.apache.solr.core.SolrCore@12dd518
   [junit4]   2> 2243632 T8732 C1513 oasup.LogUpdateProcessor.finish [collection1] webapp=null path=null params={} {add=[1000 (1486057695458885632)]} 0 26
   [junit4]   2> 2243634 T8732 C1513 oasu.DirectUpdateHandler2.commit start commit{,optimize=false,openSearcher=true,waitSearcher=true,expungeDeletes=false,softCommit=false,prepareCommit=false}
   [junit4]   2> 2243644 T8732 C1513 oasc.SolrDeletionPolicy.onCommit SolrDeletionPolicy.onCommit: commits: num=2
   [junit4]   2> 		commit{dir=RateLimitedDirectoryWrapper(MockDirectoryWrapper(RAMDirectory@19e3610 lockFactory=org.apache.lucene.store.SingleInstanceLockFactory@7750cb)),segFN=segments_1,generation=1}
   [junit4]   2> 		commit{dir=RateLimitedDirectoryWrapper(MockDirectoryWrapper(RAMDirectory@19e3610 lockFactory=org.apache.lucene.store.SingleInstanceLockFactory@7750cb)),segFN=segments_2,generation=2}
   [junit4]   2> 2243645 T8732 C1513 oasc.SolrDeletionPolicy.updateCommits newest commit generation = 2
   [junit4]   2> 2243712 T8732 C1513 oass.SolrIndexSearcher.<init> Opening Searcher@853db0[collection1] main
   [junit4]   2> 2243713 T8732 C1513 oasu.DirectUpdateHandler2.commit end_commit_flush
   [junit4]   2> 2243714 T8734 oasc.SolrCore.registerSearcher [collection1] Registered new searcher Searcher@853db0[collection1] main{ExitableDirectoryReader(UninvertingDirectoryReader(Uninverting(_0(5.0.0):C1)))}
   [junit4]   2> 2243715 T8732 C1513 oasup.LogUpdateProcessor.finish [collection1] webapp=null path=null params={} {commit=} 0 81
   [junit4]   2> 2243717 T8732 C1513 oasc.SolrCore.execute [collection1] webapp=null path=null params={hl.snippets=100&q=id:1000&hl=true&hl.q=target&hl.fl=lower&wt=xml} hits=1 status=0 QTime=2 
   [junit4]   2> 2243719 T8732 C1513 oasc.SolrCore.execute [collection1] webapp=null path=null params={hl.snippets=100&q=id:1000&hl=true&hl.q=target&hl.fl=lower&hl.maxMultiValuedToExamine=4&wt=xml} hits=1 status=0 QTime=1 
   [junit4]   2> 2243720 T8732 C1513 oasc.SolrCore.execute [collection1] webapp=null path=null params={hl.snippets=100&q=id:1000&hl=true&hl.q=target&hl.fl=lower&hl.maxMultiValuedToExamine=0&wt=xml} hits=1 status=0 QTime=0 
   [junit4]   2> 2243722 T8732 C1513 oasc.SolrCore.execute [collection1] webapp=null path=null params={hl.snippets=100&q=id:1000&hl=true&hl.q=target&hl.fl=lower&hl.maxMultiValuedToExamine=2&wt=xml} hits=1 status=0 QTime=0 
   [junit4]   2> 2243725 T8732 C1513 oasc.SolrCore.execute [collection1] webapp=null path=null params={hl.snippets=100&q=id:1000&hl=true&hl.q=target&hl.fl=lower&hl.maxMultiValuedToExamine=1&wt=xml} hits=1 status=0 QTime=1 
   [junit4]   2> 2243727 T8732 C1513 oasc.SolrCore.execute [collection1] webapp=null path=null params={hl.snippets=100&q=id:1000&hl=true&hl.maxMultiValuedToMatch=4&hl.q=target&hl.fl=lower&wt=xml} hits=1 status=0 QTime=0 
   [junit4]   2> 2243731 T8732 C1513 oasc.SolrCore.execute [collection1] webapp=null path=null params={hl.snippets=100&q=id:1000&hl=true&hl.maxMultiValuedToMatch=6&hl.q=target&hl.fl=lower&wt=xml} hits=1 status=0 QTime=2 
   [junit4]   2> 2243733 T8732 C1513 oasc.SolrCore.execute [collection1] webapp=null path=null params={hl.snippets=100&q=id:1000&hl=true&hl.maxMultiValuedToMatch=1&hl.q=target&hl.fl=lower&wt=xml} hits=1 status=0 QTime=1 
   [junit4]   2> 2243734 T8732 C1513 oasc.SolrCore.execute [collection1] webapp=null path=null params={hl.snippets=100&q=id:1000&hl=true&hl.maxMultiValuedToMatch=0&hl.q=target&hl.fl=lower&wt=xml} hits=1 status=0 QTime=0 
   [junit4]   2> 2243735 T8732 C1513 oasc.SolrCore.execute [collection1] webapp=null path=null params={hl.snippets=100&q=id:1000&hl=true&hl.maxMultiValuedToMatch=2&hl.q=target&hl.fl=lower&hl.maxMultiValuedToExamine=10&wt=xml} hits=1 status=0 QTime=0 
   [junit4]   2> 2243737 T8732 C1513 oasc.SolrCore.execute [collection1] webapp=null path=null params={hl.snippets=100&q=id:1000&hl=true&hl.maxMultiValuedToMatch=10&hl.q=target&hl.fl=lower&hl.maxMultiValuedToExamine=2&wt=xml} hits=1 status=0 QTime=1 
   [junit4]   2> 2243752 T8732 C1513 oass.SolrIndexSearcher.<init> Opening Searcher@1e0b6fa[collection1] realtime
   [junit4]   2> 2243752 T8732 C1513 oasup.LogUpdateProcessor.finish [collection1] webapp=null path=null params={} {deleteByQuery=*:* (-1486057695608832000)} 0 4
   [junit4]   2> 2243753 T8732 oas.SolrTestCaseJ4.tearDown ###Ending testMaxMvParams
   [junit4]   2> 2243779 T8732 oas.SolrTestCaseJ4.setUp ###Starting testPhraseHighlighter
   [junit4]   2> 2243789 T8732 C1513 oasup.LogUpdateProcessor.finish [collection1] webapp=null path=null params={} {add=[1 (1486057695642386432)]} 0 9
   [junit4]   2> 2243790 T8732 C1513 oasu.DirectUpdateHandler2.commit start commit{,optimize=false,openSearcher=true,waitSearcher=true,expungeDeletes=false,softCommit=false,prepareCommit=false}
   [junit4]   2> 2243791 T8732 C1513 oasc.SolrDeletionPolicy.onCommit SolrDeletionPolicy.onCommit: commits: num=2
   [junit4]   2> 		commit{dir=RateLimitedDirectoryWrapper(MockDirectoryWrapper(RAMDirectory@19e3610 lockFactory=org.apache.lucene.store.SingleInstanceLockFactory@7750cb)),segFN=segments_2,generation=2}
   [junit4]   2> 		commit{dir=RateLimitedDirectoryWrapper(MockDirectoryWrapper(RAMDirectory@19e3610 lockFactory=org.apache.lucene.store.SingleInstanceLockFactory@7750cb)),segFN=segments_3,generation=3}
   [junit4]   2> 2243792 T8732 C1513 oasc.SolrDeletionPolicy.updateCommits newest commit generation = 3
   [junit4]   2> 2243793 T8732 C1513 oass.SolrIndexSearcher.<init> Opening Searcher@1d4b9b8[collection1] main
   [junit4]   2> 2243793 T8732 C1513 oasu.DirectUpdateHandler2.commit end_commit_flush
   [junit4]   2> 2243794 T8734 oasc.SolrCore.registerSearcher [collection1] Registered new searcher Searcher@1d4b9b8[collection1] main{ExitableDirectoryReader(UninvertingDirectoryReader(Uninverting(_1(5.0.0):C1)))}
   [junit4]   2> 2243794 T8732 C1513 oasup.LogUpdateProcessor.finish [collection1] webapp=null path=null params={} {commit=} 0 4
   [junit4]   2> 2243795 T8732 C1513 oasu.DirectUpdateHandler2.commit start commit{,optimize=true,openSearcher=true,waitSearcher=true,expungeDeletes=false,softCommit=false,prepareCommit=false}
   [junit4]   2> 2243797 T8732 C1513 oasu.DirectUpdateHandler2.commit No uncommitted changes. Skipping IW.commit.
   [junit4]   2> 2243798 T8732 C1513 oasc.SolrCore.openNewSearcher SolrIndexSearcher has not changed - not re-opening: org.apache.solr.search.SolrIndexSearcher
   [junit4]   2> 2243798 T8732 C1513 oasu.DirectUpdateHandler2.commit end_commit_flush
   [junit4]   2> 2243799 T8732 C1513 oasup.LogUpdateProcessor.finish [collection1] webapp=null path=null params={} {optimize=} 0 4
   [junit4]   2> 2243814 T8732 C1513 oasc.SolrCore.execute [collection1] webapp=null path=null params={hl.snippets=10&q=t_text:"text+refers"&qt=standard&hl=true&hl.fragsize=40&hl.usePhraseHighlighter=false&start=0&hl.fl=t_text&rows=200} hits=1 status=0 QTime=14 
   [junit4]   2> 2243818 T8732 C1513 oasc.SolrCore.execute [collection1] webapp=null path=null params={hl.snippets=10&q=t_text:text+refers&qt=standard&hl=true&hl.fragsize=40&hl.usePhraseHighlighter=false&start=0&hl.fl=t_text&rows=200} hits=1 status=0 QTime=2 
   [junit4]   2> 2243873 T8732 C1513 oasc.SolrCore.execute [collection1] webapp=null path=null params={hl.snippets=10&q=t_text:"text+refers"&qt=standard&hl=true&hl.fragsize=40&hl.usePhraseHighlighter=true&start=0&hl.fl=t_text&rows=200} hits=1 status=0 QTime=54 
   [junit4]   2> 2243875 T8732 C1513 oasc.SolrCore.execute [collection1] webapp=null path=null params={hl.snippets=10&q=t_text:text+refers&qt=standard&hl=true&hl.fragsize=40&hl.usePhraseHighlighter=true&start=0&hl.fl=t_text&rows=200} hits=1 status=0 QTime=0 
   [junit4]   2> 2243877 T8732 C1513 oass.SolrIndexSearcher.<init> Opening Searcher@19a67e6[collection1] realtime
   [junit4]   2> 2243878 T8732 C1513 oasup.LogUpdateProcessor.finish [collection1] webapp=null path=null params={} {deleteByQuery=*:* (-1486057695743049728)} 0 2
   [junit4]   2> 2243879 T8732 oas.SolrTestCaseJ4.tearDown ###Ending testPhraseHighlighter
   [junit4]   2> 2243883 T8732 oas.SolrTestCaseJ4.setUp ###Starting testDefaultFieldNonPrefixWildcardHighlight
   [junit4]   2> 2243884 T8732 C1513 oasup.LogUpdateProcessor.finish [collection1] webapp=null path=null params={} {add=[1 (1486057695750389760)]} 0 0
   [junit4]   2> 2243885 T8732 C1513 oasu.DirectUpdateHandler2.commit start commit{,optimize=false,openSearcher=true,waitSearcher=true,expungeDeletes=false,softCommit=false,prepareCommit=false}
   [junit4]   2> 2243886 T8732 C1513 oasc.SolrDeletionPolicy.onCommit SolrDeletionPolicy.onCommit: commits: num=2
   [junit4]   2> 		commit{dir=RateLimitedDirectoryWrapper(MockDirectoryWrapper(RAMDirectory@19e3610 lockFactory=org.apache.lucene.store.SingleInstanceLockFactory@7750cb)),segFN=segments_3,generation=3}
   [junit4]   2> 		commit{dir=RateLimitedDirectoryWrapper(MockDirectoryWrapper(RAMDirectory@19e3610 lockFactory=org.apache.lucene.store.SingleInstanceLockFactory@7750cb)),segFN=segments_4,generation=4}
   [junit4]   2> 2243887 T8732 C1513 oasc.SolrDeletionPolicy.updateCommits newest commit generation = 4
   [junit4]   2> 2243888 T8732 C1513 oass.SolrIndexSearcher.<init> Opening Searcher@1db3055[collection1] main
   [junit4]   2> 2243888 T8732 C1513 oasu.DirectUpdateHandler2.commit end_commit_flush
   [junit4]   2> 2243889 T8734 oasc.SolrCore.registerSearcher [collection1] Registered new searcher Searcher@1db3055[collection1] main{ExitableDirectoryReader(UninvertingDirectoryReader(Uninverting(_2(5.0.0):C1)))}
   [junit4]   2> 2243890 T8732 C1513 oasup.LogUpdateProcessor.finish [collection1] webapp=null path=null params={} {commit=} 0 5
   [junit4]   2> 2243890 T8732 C1513 oasu.DirectUpdateHandler2.commit start commit{,optimize=true,openSearcher=true,waitSearcher=true,expungeDeletes=false,softCommit=false,prepareCommit=false}
   [junit4]   2> 2243891 T8732 C1513 oasu.DirectUpdateHandler2.commit No uncommitted changes. Skipping IW.commit.
   [junit4]   2> 2243891 T8732 C1513 oasc.SolrCore.openNewSearcher SolrIndexSearcher has not changed - not re-opening: org.apache.solr.search.SolrIndexSearcher
   [junit4]   2> 2243891 T8732 C1513 oasu.DirectUpdateHandler2.commit end_commit_flush
   [junit4]   2> 2243892 T8732 C1513 oasup.LogUpdateProcessor.finish [collection1] webapp=null path=null params={} {optimize=} 0 2
   [junit4]   2> 2243894 T8732 C1513 oasc.SolrCore.execute [collection1] webapp=null path=null params={q=l*g&df=t_text&qt=standard&hl=true&hl.usePhraseHighlighter=true&start=0&hl.fl=&rows=200&hl.highlightMultiTerm=true} hits=1 status=0 QTime=2 
   [junit4]   2> 2243896 T8732 C1513 oass.SolrIndexSearcher.<init> Opening Searcher@50d747[collection1] realtime
   [junit4]   2> 2243897 T8732 C1513 oasup.LogUpdateProcessor.finish [collection1] webapp=null path=null params={} {deleteByQuery=*:* (-1486057695762972672)} 0 1
   [junit4]   2> 2243898 T8732 oas.SolrTestCaseJ4.tearDown ###Ending testDefaultFieldNonPrefixWildcardHighlight
   [junit4]   2> 2243923 T8732 oas.SolrTestCaseJ4.setUp ###Starting testLongFragment
   [junit4]   2> 2243925 T8732 C1513 oasup.LogUpdateProcessor.finish [collection1] webapp=null path=null params={} {add=[1 (1486057695791284224)]} 0 2
   [junit4]   2> 2243926 T8732 C1513 oasu.DirectUpdateHandler2.commit start commit{,optimize=false,openSearcher=true,waitSearcher=true,expungeDeletes=false,softCommit=false,prepareCommit=false}
   [junit4]   2> 2243928 T8732 C1513 oasc.SolrDeletionPolicy.onCommit SolrDeletionPolicy.onCommit: commits: num=2
   [junit4]   2> 		commit{dir=RateLimitedDirectoryWrapper(MockDirectoryWrapper(RAMDirectory@19e3610 lockFactory=org.apache.lucene.store.SingleInstanceLockFactory@7750cb)),segFN=segments_4,generation=4}
   [junit4]   2> 		commit{dir=RateLimitedDirectoryWrapper(MockDirectoryWrapper(RAMDirectory@19e3610 lockFactory=org.apache.lucene.store.SingleInstanceLockFactory@7750cb)),segFN=segments_5,generation=5}
   [junit4]   2> 2243928 T8732 C1513 oasc.SolrDeletionPolicy.updateCommits newest commit generation = 5
   [junit4]   2> 2243929 T8732 C1513 oass.SolrIndexSearcher.<init> Opening Searcher@1beb070[collection1] main
   [junit4]   2> 2243930 T8732 C1513 oasu.DirectUpdateHandler2.commit end_commit_flush
   [junit4]   2> 2243931 T8734 oasc.SolrCore.registerSearcher [collection1] Registered new searcher Searcher@1beb070[collection1] main{ExitableDirectoryReader(UninvertingDirectoryReader(Uninverting(_3(5.0.0):C1)))}
   [junit4]   2> 2243931 T8732 C1513 oasup.LogUpdateProcessor.finish [collection1] webapp=null path=null params={} {commit=} 0 5
   [junit4]   2> 2243932 T8732 C1513 oasu.DirectUpdateHandler2.commit start commit{,optimize=true,openSearcher=true,waitSearcher=true,expungeDeletes=false,softCommit=false,prepareCommit=false}
   [junit4]   2> 2243932 T8732 C1513 oasu.DirectUpdateHandler2.commit No uncommitted changes. Skipping IW.commit.
   [junit4]   2> 2243933 T8732 C1513 oasc.SolrCore.openNewSearcher SolrIndexSearcher has not changed - not re-opening: org.apache.solr.search.SolrIndexSearcher
   [junit4]   2> 2243933 T8732 C1513 oasu.DirectUpdateHandler2.commit end_commit_flush
   [junit4]   2> 2243933 T8732 C1513 oasup.LogUpdateProcessor.finish [collection1] webapp=null path=null params={} {optimize=} 0 1
   [junit4]   2> 2243940 T8732 C1513 oasc.SolrCore.execute [collection1] webapp=null path=null params={q=tv_text:dir&qt=standard&hl=true&start=0&hl.fl=tv_text&rows=200} hits=1 status=0 QTime=6 
   [junit4]   2> 2243945 T8732 oas.SolrTestCaseJ4.assertQ ERROR REQUEST FAILED: xpath=//lst[@name='1']/arr[@name='tv_text']/str
   [junit4]   2> 		xml response was: <?xml version="1.0" encoding="UTF-8"?>
   [junit4]   2> 	<response>
   [junit4]   2> 	<lst name="responseHeader"><int name="status">0</int><int name="QTime">6</int></lst><result name="response" numFound="1" start="0"><doc><arr name="tv_text"><str>junit: [mkdir] Created dir: /home/klaas/worio/backend/trunk/build-src/solr-nightly/build/test-results [junit] Running org.apache.solr.BasicFunctionalityTest [junit] Tests run: 7, Failures: 0, Errors: 0, Time elapsed: 5.36 sec [junit] Running org.apache.solr.ConvertedLegacyTest [junit] Tests run: 1, Failures: 0, Errors: 0, Time elapsed: 8.268 sec [junit] Running org.apache.solr.DisMaxRequestHandlerTest [junit] Tests run: 1, Failures: 0, Errors: 0, Time elapsed: 1.56 sec [junit] Running org.apache.solr.HighlighterTest [junit] Tests run: 7, Failures: 0, Errors: 0, Time elapsed: 4.979 sec [junit] Running org.apache.solr.OutputWriterTest [junit] Tests run: 2, Failures: 0, Errors: 0, Time elapsed: 0.797 sec [junit] Running org.apache.solr.SampleTest [junit] Tests run: 2, Failures: 0, Errors: 0, Time elapsed: 1.021 sec [junit] Running org.apache.solr.analysis.TestBufferedTokenStream [junit] Tests run: 2, Failures: 0, Errors: 0, Time elapsed: 0.05 sec [junit] Running org.apache.solr.analysis.TestRemoveDuplicatesTokenFilter [junit] Tests run: 3, Failures: 0, Errors: 0, Time elapsed: 0.054 sec [junit] Running org.apache.solr.analysis.TestSynonymFilter [junit] Tests run: 6, Failures: 0, Errors: 0, Time elapsed: 0.081 sec [junit] Running org.apache.solr.analysis.TestWordDelimiterFilter [junit] Tests run: 1, Failures: 0, Errors: 0, Time elapsed: 1.714 sec [junit] Running org.apache.solr.search.TestDocSet [junit] Tests run: 1, Failures: 0, Errors: 0, Time elapsed: 0.788 sec [junit] Running org.apache.solr.util.SolrPluginUtilsTest [junit] Tests run: 5, Failures: 0, Errors: 0, Time elapsed: 3.519 sec [junit] Running org.apache.solr.util.TestOpenBitSet [junit] Tests run: 2, Failures: 0, Errors: 0, Time elapsed: 0.533 sec</str></arr><int name="id">1</int><arr name="range_facet_l"><long>1</long></arr><long name="_version_">1486057695791284224</long><arr name="multiDefault"><str>muLti-Default</str></arr><int name="intDefault">42</int><date name="timestamp">2014-11-28T22:50:57.174Z</date></doc></result><lst name="highlighting"><lst name="1"/></lst>
   [junit4]   2> 	</response>
   [junit4]   2> 	
   [junit4]   2> 		request was:q=tv_text:dir&qt=standard&hl=true&start=0&hl.fl=tv_text&rows=200
   [junit4]   2> 2243947 T8732 oasc.SolrException.log ERROR REQUEST FAILED: q=tv_text:dir&qt=standard&hl=true&start=0&hl.fl=tv_text&rows=200:java.lang.RuntimeException: REQUEST FAILED: xpath=//lst[@name='1']/arr[@name='tv_text']/str
   [junit4]   2> 		xml response was: <?xml version="1.0" encoding="UTF-8"?>
   [junit4]   2> 	<response>
   [junit4]   2> 	<lst name="responseHeader"><int name="status">0</int><int name="QTime">6</int></lst><result name="response" numFound="1" start="0"><doc><arr name="tv_text"><str>junit: [mkdir] Created dir: /home/klaas/worio/backend/trunk/build-src/solr-nightly/build/test-results [junit] Running org.apache.solr.BasicFunctionalityTest [junit] Tests run: 7, Failures: 0, Errors: 0, Time elapsed: 5.36 sec [junit] Running org.apache.solr.ConvertedLegacyTest [junit] Tests run: 1, Failures: 0, Errors: 0, Time elapsed: 8.268 sec [junit] Running org.apache.solr.DisMaxRequestHandlerTest [junit] Tests run: 1, Failures: 0, Errors: 0, Time elapsed: 1.56 sec [junit] Running org.apache.solr.HighlighterTest [junit] Tests run: 7, Failures: 0, Errors: 0, Time elapsed: 4.979 sec [junit] Running org.apache.solr.OutputWriterTest [junit] Tests run: 2, Failures: 0, Errors: 0, Time elapsed: 0.797 sec [junit] Running org.apache.solr.SampleTest [junit] Tests run: 2, Failures: 0, Errors: 0, Time elapsed: 1.021 sec [junit] Running org.apache.solr.analysis.TestBufferedTokenStream [junit] Tests run: 2, Failures: 0, Errors: 0, Time elapsed: 0.05 sec [junit] Running org.apache.solr.analysis.TestRemoveDuplicatesTokenFilter [junit] Tests run: 3, Failures: 0, Errors: 0, Time elapsed: 0.054 sec [junit] Running org.apache.solr.analysis.TestSynonymFilter [junit] Tests run: 6, Failures: 0, Errors: 0, Time elapsed: 0.081 sec [junit] Running org.apache.solr.analysis.TestWordDelimiterFilter [junit] Tests run: 1, Failures: 0, Errors: 0, Time elapsed: 1.714 sec [junit] Running org.apache.solr.search.TestDocSet [junit] Tests run: 1, Failures: 0, Errors: 0, Time elapsed: 0.788 sec [junit] Running org.apache.solr.util.SolrPluginUtilsTest [junit] Tests run: 5, Failures: 0, Errors: 0, Time elapsed: 3.519 sec [junit] Running org.apache.solr.util.TestOpenBitSet [junit] Tests run: 2, Failures: 0, Errors: 0, Time elapsed: 0.533 sec</

[...truncated too long message...]

rverInterceptor.exclusiveUnregisterMBean(DefaultMBeanServerInterceptor.java:430)
   [junit4]   2> 	at com.sun.jmx.interceptor.DefaultMBeanServerInterceptor.unregisterMBean(DefaultMBeanServerInterceptor.java:415)
   [junit4]   2> 	at com.sun.jmx.mbeanserver.JmxMBeanServer.unregisterMBean(JmxMBeanServer.java:546)
   [junit4]   2> 	at org.apache.solr.core.JmxMonitoredMap.clear(JmxMonitoredMap.java:124)
   [junit4]   2> 	at org.apache.solr.core.SolrCore.close(SolrCore.java:1124)
   [junit4]   2> 	at org.apache.solr.core.SolrCores.close(SolrCores.java:117)
   [junit4]   2> 	at org.apache.solr.core.CoreContainer.shutdown(CoreContainer.java:365)
   [junit4]   2> 	at org.apache.solr.util.TestHarness.close(TestHarness.java:337)
   [junit4]   2> 	at org.apache.solr.SolrTestCaseJ4.deleteCore(SolrTestCaseJ4.java:640)
   [junit4]   2> 	at org.apache.solr.SolrTestCaseJ4.afterClass(SolrTestCaseJ4.java:185)
   [junit4]   2> 	at sun.reflect.GeneratedMethodAccessor41.invoke(Unknown Source)
   [junit4]   2> 	at sun.reflect.DelegatingMethodAccessorImpl.invoke(DelegatingMethodAccessorImpl.java:43)
   [junit4]   2> 	at java.lang.reflect.Method.invoke(Method.java:483)
   [junit4]   2> 	at com.carrotsearch.randomizedtesting.RandomizedRunner.invoke(RandomizedRunner.java:1618)
   [junit4]   2> 	at com.carrotsearch.randomizedtesting.RandomizedRunner$5.evaluate(RandomizedRunner.java:790)
   [junit4]   2> 	at com.carrotsearch.randomizedtesting.rules.StatementAdapter.evaluate(StatementAdapter.java:36)
   [junit4]   2> 	at com.carrotsearch.randomizedtesting.rules.SystemPropertiesRestoreRule$1.evaluate(SystemPropertiesRestoreRule.java:53)
   [junit4]   2> 	at org.apache.lucene.util.AbstractBeforeAfterRule$1.evaluate(AbstractBeforeAfterRule.java:46)
   [junit4]   2> 	at org.apache.lucene.util.TestRuleStoreClassName$1.evaluate(TestRuleStoreClassName.java:42)
   [junit4]   2> 	at com.carrotsearch.randomizedtesting.rules.SystemPropertiesInvariantRule$1.evaluate(SystemPropertiesInvariantRule.java:55)
   [junit4]   2> 	at com.carrotsearch.randomizedtesting.rules.NoShadowingOrOverridesOnMethodsRule$1.evaluate(NoShadowingOrOverridesOnMethodsRule.java:39)
   [junit4]   2> 	at com.carrotsearch.randomizedtesting.rules.NoShadowingOrOverridesOnMethodsRule$1.evaluate(NoShadowingOrOverridesOnMethodsRule.java:39)
   [junit4]   2> 	at com.carrotsearch.randomizedtesting.rules.StatementAdapter.evaluate(StatementAdapter.java:36)
   [junit4]   2> 	at com.carrotsearch.randomizedtesting.rules.StatementAdapter.evaluate(StatementAdapter.java:36)
   [junit4]   2> 	at com.carrotsearch.randomizedtesting.rules.StatementAdapter.evaluate(StatementAdapter.java:36)
   [junit4]   2> 	at org.apache.lucene.util.TestRuleAssertionsRequired$1.evaluate(TestRuleAssertionsRequired.java:54)
   [junit4]   2> 	at org.apache.lucene.util.TestRuleMarkFailure$1.evaluate(TestRuleMarkFailure.java:48)
   [junit4]   2> 	at org.apache.lucene.util.TestRuleIgnoreAfterMaxFailures$1.evaluate(TestRuleIgnoreAfterMaxFailures.java:65)
   [junit4]   2> 	at org.apache.lucene.util.TestRuleIgnoreTestSuites$1.evaluate(TestRuleIgnoreTestSuites.java:55)
   [junit4]   2> 	at com.carrotsearch.randomizedtesting.rules.StatementAdapter.evaluate(StatementAdapter.java:36)
   [junit4]   2> 	at com.carrotsearch.randomizedtesting.ThreadLeakControl$StatementRunner.run(ThreadLeakControl.java:365)
   [junit4]   2> 	at java.lang.Thread.run(Thread.java:745)
   [junit4]   2> 
   [junit4]   2> 2245023 T8732 oasc.CachingDirectoryFactory.close Closing MockDirectoryFactory - 2 directories currently being tracked
   [junit4]   2> 2245024 T8732 oasc.CachingDirectoryFactory.closeCacheValue looking to close /mnt/ssd/jenkins/workspace/Lucene-Solr-5.x-Linux/solr/build/solr-core/test/J1/temp/solr.highlight.HighlighterTest-B616D122261A4A31-001/init-core-data-001/index [CachedDir<<refCount=0;path=/mnt/ssd/jenkins/workspace/Lucene-Solr-5.x-Linux/solr/build/solr-core/test/J1/temp/solr.highlight.HighlighterTest-B616D122261A4A31-001/init-core-data-001/index;done=false>>]
   [junit4]   2> 2245024 T8732 oasc.CachingDirectoryFactory.close Closing directory: /mnt/ssd/jenkins/workspace/Lucene-Solr-5.x-Linux/solr/build/solr-core/test/J1/temp/solr.highlight.HighlighterTest-B616D122261A4A31-001/init-core-data-001/index
   [junit4]   2> 2245024 T8732 oasc.CachingDirectoryFactory.closeCacheValue looking to close /mnt/ssd/jenkins/workspace/Lucene-Solr-5.x-Linux/solr/build/solr-core/test/J1/temp/solr.highlight.HighlighterTest-B616D122261A4A31-001/init-core-data-001 [CachedDir<<refCount=0;path=/mnt/ssd/jenkins/workspace/Lucene-Solr-5.x-Linux/solr/build/solr-core/test/J1/temp/solr.highlight.HighlighterTest-B616D122261A4A31-001/init-core-data-001;done=false>>]
   [junit4]   2> 2245024 T8732 oasc.CachingDirectoryFactory.close Closing directory: /mnt/ssd/jenkins/workspace/Lucene-Solr-5.x-Linux/solr/build/solr-core/test/J1/temp/solr.highlight.HighlighterTest-B616D122261A4A31-001/init-core-data-001
   [junit4]   2> NOTE: leaving temporary files on disk at: /mnt/ssd/jenkins/workspace/Lucene-Solr-5.x-Linux/solr/build/solr-core/test/J1/temp/solr.highlight.HighlighterTest-B616D122261A4A31-001
   [junit4]   2> NOTE: test params are: codec=HighCompressionCompressingStoredFields(storedFieldsFormat=CompressingStoredFieldsFormat(compressionMode=HIGH_COMPRESSION, chunkSize=152), termVectorsFormat=CompressingTermVectorsFormat(compressionMode=HIGH_COMPRESSION, chunkSize=152)), sim=DefaultSimilarity, locale=sl_SI, timezone=Europe/Dublin
   [junit4]   2> NOTE: Linux 3.13.0-39-generic i386/Oracle Corporation 1.8.0_20 (32-bit)/cpus=8,threads=1,free=95559176,total=475004928
   [junit4]   2> NOTE: All tests run in this JVM: [StatsComponentTest, TestTolerantSearch, AnalysisAfterCoreReloadTest, EnumFieldTest, TestCoreContainer, AnalysisErrorHandlingTest, TestBulkSchemaAPI, TestGroupingSearch, SliceStateTest, MultiThreadedOCPTest, SimpleMLTQParserTest, AnalyticsQueryTest, TestNoOpRegenerator, SolrIndexConfigTest, CollectionsAPIDistributedZkTest, TestZkChroot, TestValueSourceCache, ResourceLoaderTest, CSVRequestHandlerTest, OutOfBoxZkACLAndCredentialsProvidersTest, TestXIncludeConfig, QueryElevationComponentTest, BJQParserTest, TestIndexingPerformance, CoreMergeIndexesAdminHandlerTest, TestIndexSearcher, TestBinaryField, TestIntervalFaceting, TestUpdate, TestRealTimeGet, DateMathParserTest, TestExpandComponent, TermVectorComponentDistributedTest, SolrTestCaseJ4Test, VMParamsZkACLAndCredentialsProvidersTest, SSLMigrationTest, TestConfigOverlay, NumericFieldsTest, ResponseHeaderTest, AddSchemaFieldsUpdateProcessorFactoryTest, SharedFSAutoReplicaFailoverTest, SampleTest, SpatialFilterTest, PrimUtilsTest, DateFieldTest, TestPhraseSuggestions, TestChildDocTransformer, TestFieldCollectionResource, TestOverriddenPrefixQueryForCustomFieldType, SortByFunctionTest, TestSchemaVersionResource, TestBadConfig, CoreAdminRequestStatusTest, DocValuesTest, OpenCloseCoreStressTest, LeaderElectionIntegrationTest, CoreContainerCoreInitFailuresTest, TestBM25SimilarityFactory, CollectionsAPIAsyncDistributedZkTest, ChaosMonkeySafeLeaderTest, TestUtils, DebugComponentTest, TestSolrQueryParser, ClusterStateTest, SolrPluginUtilsTest, HdfsLockFactoryTest, SoftAutoCommitTest, DistributedIntervalFacetingTest, MultiTermTest, ShardSplitTest, SchemaVersionSpecificBehaviorTest, TestHighFrequencyDictionaryFactory, QueryParsingTest, TestHighlightDedupGrouping, TestRecoveryHdfs, PolyFieldTest, CachingDirectoryFactoryTest, DefaultValueUpdateProcessorTest, LeaderFailoverAfterPartitionTest, AutoCommitTest, TestCollectionAPI, TermVectorComponentTest, TestCSVResponseWriter, AtomicUpdatesTest, BasicZkTest, UUIDFieldTest, OverseerRolesTest, TestManagedSchemaDynamicFieldResource, TestFileDictionaryLookup, DeleteInactiveReplicaTest, TestStandardQParsers, TestMergePolicyConfig, TestInfoStreamLogging, URLClassifyProcessorTest, HardAutoCommitTest, TestSchemaManager, TestCollationField, TestLFUCache, FieldAnalysisRequestHandlerTest, SuggestComponentTest, TestSortingResponseWriter, DistributedExpandComponentTest, TestElisionMultitermQuery, AssignTest, TestSweetSpotSimilarityFactory, DistanceFunctionTest, TestRandomFaceting, ShardRoutingCustomTest, LukeRequestHandlerTest, HdfsSyncSliceTest, BasicDistributedZkTest, BasicDistributedZk2Test, ClusterStateUpdateTest, ZkSolrClientTest, TestRandomDVFaceting, TestDistributedSearch, TestFaceting, TestRecovery, DistributedSpellCheckComponentTest, DistributedTermsComponentTest, TestFunctionQuery, BasicFunctionalityTest, TestLazyCores, HighlighterTest]
   [junit4] Completed on J1 in 2.30s, 31 tests, 9 errors <<< FAILURES!

[...truncated 633 lines...]
BUILD FAILED
/mnt/ssd/jenkins/workspace/Lucene-Solr-5.x-Linux/build.xml:525: The following error occurred while executing this line:
/mnt/ssd/jenkins/workspace/Lucene-Solr-5.x-Linux/build.xml:473: The following error occurred while executing this line:
/mnt/ssd/jenkins/workspace/Lucene-Solr-5.x-Linux/build.xml:61: The following error occurred while executing this line:
/mnt/ssd/jenkins/workspace/Lucene-Solr-5.x-Linux/extra-targets.xml:39: The following error occurred while executing this line:
/mnt/ssd/jenkins/workspace/Lucene-Solr-5.x-Linux/solr/build.xml:189: The following error occurred while executing this line:
/mnt/ssd/jenkins/workspace/Lucene-Solr-5.x-Linux/solr/common-build.xml:508: The following error occurred while executing this line:
/mnt/ssd/jenkins/workspace/Lucene-Solr-5.x-Linux/lucene/common-build.xml:1363: The following error occurred while executing this line:
/mnt/ssd/jenkins/workspace/Lucene-Solr-5.x-Linux/lucene/common-build.xml:970: There were test failures: 450 suites, 1841 tests, 9 errors, 31 ignored (22 assumptions)

Total time: 95 minutes 48 seconds
Build step 'Invoke Ant' marked build as failure
[description-setter] Description set: Java: 32bit/jdk1.8.0_20 -server -XX:+UseParallelGC (asserts: true)
Archiving artifacts
Recording test results
Email was triggered for: Failure - Any
Sending email for trigger: Failure - Any



Mime
View raw message