lucene-dev mailing list archives

Site index · List index
Message view « Date » · « Thread »
Top « Date » · « Thread »
From Policeman Jenkins Server <jenk...@thetaphi.de>
Subject [JENKINS] Lucene-Solr-trunk-Windows (64bit/jdk1.8.0_40-ea-b09) - Build # 4460 - Still Failing!
Date Sat, 29 Nov 2014 20:31:16 GMT
Build: http://jenkins.thetaphi.de/job/Lucene-Solr-trunk-Windows/4460/
Java: 64bit/jdk1.8.0_40-ea-b09 -XX:+UseCompressedOops -XX:+UseG1GC (asserts: true)

1 tests failed.
FAILED:  org.apache.lucene.util.junitcompat.TestLeaveFilesIfTestFails.testWindowsUnremovableFile

Error Message:
C:\Users\JenkinsSlave\workspace\Lucene-Solr-trunk-Windows\lucene\build\core\test\J0\temp\lucene.util.junitcompat.TestLeaveFilesIfTestFails$Nested2-C5F2CA80130DA348-001\leftover-001\child.locked

Stack Trace:
java.nio.file.AccessDeniedException: C:\Users\JenkinsSlave\workspace\Lucene-Solr-trunk-Windows\lucene\build\core\test\J0\temp\lucene.util.junitcompat.TestLeaveFilesIfTestFails$Nested2-C5F2CA80130DA348-001\leftover-001\child.locked
	at sun.nio.fs.WindowsException.translateToIOException(WindowsException.java:83)
	at sun.nio.fs.WindowsException.rethrowAsIOException(WindowsException.java:97)
	at sun.nio.fs.WindowsException.rethrowAsIOException(WindowsException.java:102)
	at sun.nio.fs.WindowsFileAttributeViews$Basic.readAttributes(WindowsFileAttributeViews.java:53)
	at sun.nio.fs.WindowsFileAttributeViews$Basic.readAttributes(WindowsFileAttributeViews.java:38)
	at org.apache.lucene.mockfile.WindowsFS.getKey(WindowsFS.java:57)
	at org.apache.lucene.mockfile.WindowsFS.onClose(WindowsFS.java:77)
	at org.apache.lucene.mockfile.HandleTrackingFS$5.close(HandleTrackingFS.java:210)
	at org.apache.lucene.util.junitcompat.TestLeaveFilesIfTestFails.testWindowsUnremovableFile(TestLeaveFilesIfTestFails.java:79)
	at sun.reflect.NativeMethodAccessorImpl.invoke0(Native Method)
	at sun.reflect.NativeMethodAccessorImpl.invoke(NativeMethodAccessorImpl.java:62)
	at sun.reflect.DelegatingMethodAccessorImpl.invoke(DelegatingMethodAccessorImpl.java:43)
	at java.lang.reflect.Method.invoke(Method.java:497)
	at org.junit.runners.model.FrameworkMethod$1.runReflectiveCall(FrameworkMethod.java:45)
	at org.junit.internal.runners.model.ReflectiveCallable.run(ReflectiveCallable.java:15)
	at org.junit.runners.model.FrameworkMethod.invokeExplosively(FrameworkMethod.java:42)
	at org.junit.internal.runners.statements.InvokeMethod.evaluate(InvokeMethod.java:20)
	at org.junit.internal.runners.statements.RunBefores.evaluate(RunBefores.java:28)
	at org.junit.internal.runners.statements.RunAfters.evaluate(RunAfters.java:30)
	at org.apache.lucene.util.TestRuleMarkFailure$1.evaluate(TestRuleMarkFailure.java:48)
	at com.carrotsearch.randomizedtesting.rules.StatementAdapter.evaluate(StatementAdapter.java:36)
	at com.carrotsearch.randomizedtesting.rules.SystemPropertiesRestoreRule$1.evaluate(SystemPropertiesRestoreRule.java:53)
	at org.junit.rules.RunRules.evaluate(RunRules.java:18)
	at org.junit.runners.ParentRunner.runLeaf(ParentRunner.java:263)
	at org.junit.runners.BlockJUnit4ClassRunner.runChild(BlockJUnit4ClassRunner.java:68)
	at org.junit.runners.BlockJUnit4ClassRunner.runChild(BlockJUnit4ClassRunner.java:47)
	at org.junit.runners.ParentRunner$3.run(ParentRunner.java:231)
	at org.junit.runners.ParentRunner$1.schedule(ParentRunner.java:60)
	at org.junit.runners.ParentRunner.runChildren(ParentRunner.java:229)
	at org.junit.runners.ParentRunner.access$000(ParentRunner.java:50)
	at org.junit.runners.ParentRunner$2.evaluate(ParentRunner.java:222)
	at com.carrotsearch.randomizedtesting.rules.StatementAdapter.evaluate(StatementAdapter.java:36)
	at org.junit.rules.RunRules.evaluate(RunRules.java:18)
	at org.junit.runners.ParentRunner.run(ParentRunner.java:300)
	at com.carrotsearch.ant.tasks.junit4.slave.SlaveMain.execute(SlaveMain.java:199)
	at com.carrotsearch.ant.tasks.junit4.slave.SlaveMain.main(SlaveMain.java:310)
	at com.carrotsearch.ant.tasks.junit4.slave.SlaveMainSafe.main(SlaveMainSafe.java:12)




Build Log:
[...truncated 436 lines...]
   [junit4] Suite: org.apache.lucene.util.junitcompat.TestLeaveFilesIfTestFails
   [junit4]   1> sysout from nested test: 
   [junit4]   1> 
   [junit4]   1> syserr from nested test: NOTE: test params are: codec=Asserting(Lucene50):
{}, docValues:{}, sim=RandomSimilarityProvider(queryNorm=false,coord=no): {}, locale=sr_CS,
timezone=Etc/UCT
   [junit4]   1> NOTE: Windows 7 6.1 amd64/Oracle Corporation 1.8.0_40-ea (64-bit)/cpus=2,threads=1,free=81523472,total=214958080
   [junit4]   1> NOTE: All tests run in this JVM: [TestAutomaton, TestQueryBuilder, Test2BNumericDocValues,
TestDirectory, TestDocumentsWriterDeleteQueue, TestBooleanOr, TestPositiveScoresOnlyCollector,
TestMmapDirectory, TestBagOfPostings, TestOperations, TestFieldReuse, TestBooleanScorer, TestNoMergeScheduler,
TestFieldMaskingSpanQuery, TestHighCompressionMode, TestFieldsReader, TestLucene50StoredFieldsFormat,
TestFilterIterator, TestStressDeletes, TestIndexWriterOnDiskFull, TestForceMergeForever, MultiCollectorTest,
TestNumericDocValuesUpdates, TestConsistentFieldNumbers, TestSimpleExplanationsOfNonMatches,
TestPayloadExplanations, TestSegmentTermDocs, TestIsCurrent, TestNIOFSDirectory, TestMockAnalyzer,
TestNumericRangeQuery32, TestMultiDocValues, TestLevenshteinAutomata, TestByteArrayDataInput,
TestSortRandom, TestByteSlices, TestMultiMMap, Test2BTerms, TestIndexInput, TestDocValuesIndexing,
TestDemoParallelLeafReader, TestAddIndexes, TestBoolean2, TestDemo, TestIndexWriterExceptions2,
TestManyFields, TestDocumentsWriterStallControl, TestRegExp, TestFieldValueFilter, TestLogMergePolicy,
TestSearcherManager, Nested1, Nested2]
   [junit4]   1> NOTE: reproduce with: ant test  -Dtestcase=Nested2 -Dtests.seed=C5F2CA80130DA348
-Dtests.slow=true -Dtests.locale=sr_CS -Dtests.timezone=Etc/UCT -Dtests.asserts=true -Dtests.file.encoding=ISO-8859-1
   [junit4]   1> 
   [junit4] ERROR   0.04s | TestLeaveFilesIfTestFails.testWindowsUnremovableFile <<<
   [junit4]    > Throwable #1: java.nio.file.AccessDeniedException: C:\Users\JenkinsSlave\workspace\Lucene-Solr-trunk-Windows\lucene\build\core\test\J0\temp\lucene.util.junitcompat.TestLeaveFilesIfTestFails$Nested2-C5F2CA80130DA348-001\leftover-001\child.locked
   [junit4]    > 	at sun.nio.fs.WindowsException.translateToIOException(WindowsException.java:83)
   [junit4]    > 	at sun.nio.fs.WindowsException.rethrowAsIOException(WindowsException.java:97)
   [junit4]    > 	at sun.nio.fs.WindowsException.rethrowAsIOException(WindowsException.java:102)
   [junit4]    > 	at sun.nio.fs.WindowsFileAttributeViews$Basic.readAttributes(WindowsFileAttributeViews.java:53)
   [junit4]    > 	at sun.nio.fs.WindowsFileAttributeViews$Basic.readAttributes(WindowsFileAttributeViews.java:38)
   [junit4]    > 	at org.apache.lucene.mockfile.WindowsFS.getKey(WindowsFS.java:57)
   [junit4]    > 	at org.apache.lucene.mockfile.WindowsFS.onClose(WindowsFS.java:77)
   [junit4]    > 	at org.apache.lucene.mockfile.HandleTrackingFS$5.close(HandleTrackingFS.java:210)
   [junit4]    > 	at org.apache.lucene.util.junitcompat.TestLeaveFilesIfTestFails.testWindowsUnremovableFile(TestLeaveFilesIfTestFails.java:79)
   [junit4] Completed in 0.10s, 2 tests, 1 error <<< FAILURES!

[...truncated 1156 lines...]
BUILD FAILED
C:\Users\JenkinsSlave\workspace\Lucene-Solr-trunk-Windows\build.xml:515: The following error
occurred while executing this line:
C:\Users\JenkinsSlave\workspace\Lucene-Solr-trunk-Windows\build.xml:463: The following error
occurred while executing this line:
C:\Users\JenkinsSlave\workspace\Lucene-Solr-trunk-Windows\build.xml:61: The following error
occurred while executing this line:
C:\Users\JenkinsSlave\workspace\Lucene-Solr-trunk-Windows\extra-targets.xml:39: The following
error occurred while executing this line:
C:\Users\JenkinsSlave\workspace\Lucene-Solr-trunk-Windows\lucene\build.xml:49: The following
error occurred while executing this line:
C:\Users\JenkinsSlave\workspace\Lucene-Solr-trunk-Windows\lucene\common-build.xml:1349: The
following error occurred while executing this line:
C:\Users\JenkinsSlave\workspace\Lucene-Solr-trunk-Windows\lucene\common-build.xml:956: There
were test failures: 405 suites, 3053 tests, 1 error, 63 ignored (53 assumptions)

Total time: 10 minutes 43 seconds
Build step 'Invoke Ant' marked build as failure
[description-setter] Description set: Java: 64bit/jdk1.8.0_40-ea-b09 -XX:+UseCompressedOops
-XX:+UseG1GC (asserts: true)
Archiving artifacts
Recording test results
Email was triggered for: Failure - Any
Sending email for trigger: Failure - Any



Mime
View raw message