lucene-dev mailing list archives

Site index · List index
Message view « Date » · « Thread »
Top « Date » · « Thread »
From Policeman Jenkins Server <jenk...@thetaphi.de>
Subject [JENKINS] Lucene-Solr-5.x-Linux (32bit/jdk1.9.0-ea-b34) - Build # 11515 - Failure!
Date Fri, 28 Nov 2014 16:37:47 GMT
Build: http://jenkins.thetaphi.de/job/Lucene-Solr-5.x-Linux/11515/
Java: 32bit/jdk1.9.0-ea-b34 -server -XX:+UseG1GC (asserts: false)

9 tests failed.
FAILED:  org.apache.solr.highlight.HighlighterTest.testVariableFragsize

Error Message:
Exception during query

Stack Trace:
java.lang.RuntimeException: Exception during query
	at __randomizedtesting.SeedInfo.seed([49ED0023EC0905BB:4EA100520EB7A929]:0)
	at org.apache.solr.SolrTestCaseJ4.assertQ(SolrTestCaseJ4.java:729)
	at org.apache.solr.highlight.HighlighterTest.testVariableFragsize(HighlighterTest.java:592)
	at sun.reflect.NativeMethodAccessorImpl.invoke0(Native Method)
	at sun.reflect.NativeMethodAccessorImpl.invoke(NativeMethodAccessorImpl.java:62)
	at sun.reflect.DelegatingMethodAccessorImpl.invoke(DelegatingMethodAccessorImpl.java:43)
	at java.lang.reflect.Method.invoke(Method.java:498)
	at com.carrotsearch.randomizedtesting.RandomizedRunner.invoke(RandomizedRunner.java:1618)
	at com.carrotsearch.randomizedtesting.RandomizedRunner$6.evaluate(RandomizedRunner.java:827)
	at com.carrotsearch.randomizedtesting.RandomizedRunner$7.evaluate(RandomizedRunner.java:863)
	at com.carrotsearch.randomizedtesting.RandomizedRunner$8.evaluate(RandomizedRunner.java:877)
	at com.carrotsearch.randomizedtesting.rules.SystemPropertiesRestoreRule$1.evaluate(SystemPropertiesRestoreRule.java:53)
	at org.apache.lucene.util.TestRuleSetupTeardownChained$1.evaluate(TestRuleSetupTeardownChained.java:50)
	at org.apache.lucene.util.AbstractBeforeAfterRule$1.evaluate(AbstractBeforeAfterRule.java:46)
	at com.carrotsearch.randomizedtesting.rules.SystemPropertiesInvariantRule$1.evaluate(SystemPropertiesInvariantRule.java:55)
	at org.apache.lucene.util.TestRuleThreadAndTestName$1.evaluate(TestRuleThreadAndTestName.java:49)
	at org.apache.lucene.util.TestRuleIgnoreAfterMaxFailures$1.evaluate(TestRuleIgnoreAfterMaxFailures.java:65)
	at org.apache.lucene.util.TestRuleMarkFailure$1.evaluate(TestRuleMarkFailure.java:48)
	at com.carrotsearch.randomizedtesting.rules.StatementAdapter.evaluate(StatementAdapter.java:36)
	at com.carrotsearch.randomizedtesting.ThreadLeakControl$StatementRunner.run(ThreadLeakControl.java:365)
	at com.carrotsearch.randomizedtesting.ThreadLeakControl.forkTimeoutingTask(ThreadLeakControl.java:798)
	at com.carrotsearch.randomizedtesting.ThreadLeakControl$3.evaluate(ThreadLeakControl.java:458)
	at com.carrotsearch.randomizedtesting.RandomizedRunner.runSingleTest(RandomizedRunner.java:836)
	at com.carrotsearch.randomizedtesting.RandomizedRunner$3.evaluate(RandomizedRunner.java:738)
	at com.carrotsearch.randomizedtesting.RandomizedRunner$4.evaluate(RandomizedRunner.java:772)
	at com.carrotsearch.randomizedtesting.RandomizedRunner$5.evaluate(RandomizedRunner.java:783)
	at com.carrotsearch.randomizedtesting.rules.StatementAdapter.evaluate(StatementAdapter.java:36)
	at com.carrotsearch.randomizedtesting.rules.SystemPropertiesRestoreRule$1.evaluate(SystemPropertiesRestoreRule.java:53)
	at org.apache.lucene.util.AbstractBeforeAfterRule$1.evaluate(AbstractBeforeAfterRule.java:46)
	at org.apache.lucene.util.TestRuleStoreClassName$1.evaluate(TestRuleStoreClassName.java:42)
	at com.carrotsearch.randomizedtesting.rules.SystemPropertiesInvariantRule$1.evaluate(SystemPropertiesInvariantRule.java:55)
	at com.carrotsearch.randomizedtesting.rules.NoShadowingOrOverridesOnMethodsRule$1.evaluate(NoShadowingOrOverridesOnMethodsRule.java:39)
	at com.carrotsearch.randomizedtesting.rules.NoShadowingOrOverridesOnMethodsRule$1.evaluate(NoShadowingOrOverridesOnMethodsRule.java:39)
	at com.carrotsearch.randomizedtesting.rules.StatementAdapter.evaluate(StatementAdapter.java:36)
	at com.carrotsearch.randomizedtesting.rules.StatementAdapter.evaluate(StatementAdapter.java:36)
	at com.carrotsearch.randomizedtesting.rules.StatementAdapter.evaluate(StatementAdapter.java:36)
	at org.apache.lucene.util.TestRuleAssertionsRequired$1.evaluate(TestRuleAssertionsRequired.java:54)
	at org.apache.lucene.util.TestRuleMarkFailure$1.evaluate(TestRuleMarkFailure.java:48)
	at org.apache.lucene.util.TestRuleIgnoreAfterMaxFailures$1.evaluate(TestRuleIgnoreAfterMaxFailures.java:65)
	at org.apache.lucene.util.TestRuleIgnoreTestSuites$1.evaluate(TestRuleIgnoreTestSuites.java:55)
	at com.carrotsearch.randomizedtesting.rules.StatementAdapter.evaluate(StatementAdapter.java:36)
	at com.carrotsearch.randomizedtesting.ThreadLeakControl$StatementRunner.run(ThreadLeakControl.java:365)
	at java.lang.Thread.run(Thread.java:745)
Caused by: java.lang.RuntimeException: REQUEST FAILED: xpath=//lst[@name='1']/arr[@name='tv_text']/str[.='a <em>long</em> days night this should be a piece of text which']
	xml response was: <?xml version="1.0" encoding="UTF-8"?>
<response>
<lst name="responseHeader"><int name="status">0</int><int name="QTime">133</int></lst><result name="response" numFound="1" start="0"><doc><arr name="tv_text"><str>a long days night this should be a piece of text which is is is is is is is is is is is is is is is is is is is is is is is is isis is is is is is is is is is is is is is is is is is is is is is is is is is is is is is is is is is is is is is is is is is is is is is is is is is is is is is is is is is is is is is is is is is is is is is is is is is is sufficiently lengthly to produce multiple fragments which are not concatenated at all</str></arr><int name="id">1</int><arr name="range_facet_l"><long>1</long></arr><long name="_version_">1486030584027283456</long><arr name="multiDefault"><str>muLti-Default</str></arr><int name="intDefault">42</int><date name="timestamp">2014-11-28T15:40:01.38Z</date></doc></result><lst name="highlighting"><lst name="1"/></lst>
</response>

	request was:q=tv_text:long&qt=standard&hl=true&start=0&hl.fl=tv_text&rows=200
	at org.apache.solr.SolrTestCaseJ4.assertQ(SolrTestCaseJ4.java:722)
	... 41 more


FAILED:  org.apache.solr.highlight.HighlighterTest.testTermVecHighlight

Error Message:
Exception during query

Stack Trace:
java.lang.RuntimeException: Exception during query
	at __randomizedtesting.SeedInfo.seed([49ED0023EC0905BB:68CD78F2E55AD1A8]:0)
	at org.apache.solr.SolrTestCaseJ4.assertQ(SolrTestCaseJ4.java:729)
	at org.apache.solr.highlight.HighlighterTest.testTermVecHighlight(HighlighterTest.java:145)
	at sun.reflect.NativeMethodAccessorImpl.invoke0(Native Method)
	at sun.reflect.NativeMethodAccessorImpl.invoke(NativeMethodAccessorImpl.java:62)
	at sun.reflect.DelegatingMethodAccessorImpl.invoke(DelegatingMethodAccessorImpl.java:43)
	at java.lang.reflect.Method.invoke(Method.java:498)
	at com.carrotsearch.randomizedtesting.RandomizedRunner.invoke(RandomizedRunner.java:1618)
	at com.carrotsearch.randomizedtesting.RandomizedRunner$6.evaluate(RandomizedRunner.java:827)
	at com.carrotsearch.randomizedtesting.RandomizedRunner$7.evaluate(RandomizedRunner.java:863)
	at com.carrotsearch.randomizedtesting.RandomizedRunner$8.evaluate(RandomizedRunner.java:877)
	at com.carrotsearch.randomizedtesting.rules.SystemPropertiesRestoreRule$1.evaluate(SystemPropertiesRestoreRule.java:53)
	at org.apache.lucene.util.TestRuleSetupTeardownChained$1.evaluate(TestRuleSetupTeardownChained.java:50)
	at org.apache.lucene.util.AbstractBeforeAfterRule$1.evaluate(AbstractBeforeAfterRule.java:46)
	at com.carrotsearch.randomizedtesting.rules.SystemPropertiesInvariantRule$1.evaluate(SystemPropertiesInvariantRule.java:55)
	at org.apache.lucene.util.TestRuleThreadAndTestName$1.evaluate(TestRuleThreadAndTestName.java:49)
	at org.apache.lucene.util.TestRuleIgnoreAfterMaxFailures$1.evaluate(TestRuleIgnoreAfterMaxFailures.java:65)
	at org.apache.lucene.util.TestRuleMarkFailure$1.evaluate(TestRuleMarkFailure.java:48)
	at com.carrotsearch.randomizedtesting.rules.StatementAdapter.evaluate(StatementAdapter.java:36)
	at com.carrotsearch.randomizedtesting.ThreadLeakControl$StatementRunner.run(ThreadLeakControl.java:365)
	at com.carrotsearch.randomizedtesting.ThreadLeakControl.forkTimeoutingTask(ThreadLeakControl.java:798)
	at com.carrotsearch.randomizedtesting.ThreadLeakControl$3.evaluate(ThreadLeakControl.java:458)
	at com.carrotsearch.randomizedtesting.RandomizedRunner.runSingleTest(RandomizedRunner.java:836)
	at com.carrotsearch.randomizedtesting.RandomizedRunner$3.evaluate(RandomizedRunner.java:738)
	at com.carrotsearch.randomizedtesting.RandomizedRunner$4.evaluate(RandomizedRunner.java:772)
	at com.carrotsearch.randomizedtesting.RandomizedRunner$5.evaluate(RandomizedRunner.java:783)
	at com.carrotsearch.randomizedtesting.rules.StatementAdapter.evaluate(StatementAdapter.java:36)
	at com.carrotsearch.randomizedtesting.rules.SystemPropertiesRestoreRule$1.evaluate(SystemPropertiesRestoreRule.java:53)
	at org.apache.lucene.util.AbstractBeforeAfterRule$1.evaluate(AbstractBeforeAfterRule.java:46)
	at org.apache.lucene.util.TestRuleStoreClassName$1.evaluate(TestRuleStoreClassName.java:42)
	at com.carrotsearch.randomizedtesting.rules.SystemPropertiesInvariantRule$1.evaluate(SystemPropertiesInvariantRule.java:55)
	at com.carrotsearch.randomizedtesting.rules.NoShadowingOrOverridesOnMethodsRule$1.evaluate(NoShadowingOrOverridesOnMethodsRule.java:39)
	at com.carrotsearch.randomizedtesting.rules.NoShadowingOrOverridesOnMethodsRule$1.evaluate(NoShadowingOrOverridesOnMethodsRule.java:39)
	at com.carrotsearch.randomizedtesting.rules.StatementAdapter.evaluate(StatementAdapter.java:36)
	at com.carrotsearch.randomizedtesting.rules.StatementAdapter.evaluate(StatementAdapter.java:36)
	at com.carrotsearch.randomizedtesting.rules.StatementAdapter.evaluate(StatementAdapter.java:36)
	at org.apache.lucene.util.TestRuleAssertionsRequired$1.evaluate(TestRuleAssertionsRequired.java:54)
	at org.apache.lucene.util.TestRuleMarkFailure$1.evaluate(TestRuleMarkFailure.java:48)
	at org.apache.lucene.util.TestRuleIgnoreAfterMaxFailures$1.evaluate(TestRuleIgnoreAfterMaxFailures.java:65)
	at org.apache.lucene.util.TestRuleIgnoreTestSuites$1.evaluate(TestRuleIgnoreTestSuites.java:55)
	at com.carrotsearch.randomizedtesting.rules.StatementAdapter.evaluate(StatementAdapter.java:36)
	at com.carrotsearch.randomizedtesting.ThreadLeakControl$StatementRunner.run(ThreadLeakControl.java:365)
	at java.lang.Thread.run(Thread.java:745)
Caused by: java.lang.RuntimeException: REQUEST FAILED: xpath=//lst[@name='1']/arr[@name='tv_text']/str[.='a <em>long</em> days night this should be a piece of text which']
	xml response was: <?xml version="1.0" encoding="UTF-8"?>
<response>
<lst name="responseHeader"><int name="status">0</int><int name="QTime">0</int></lst><result name="response" numFound="1" start="0"><doc><arr name="tv_text"><str>a long days night this should be a piece of text which is is is is is is is is is is is is is is is is is is is is is is is is isis is is is is is is is is is is is is is is is is is is is is is is is is is is is is is is is is is is is is is is is is is is is is is is is is is is is is is is is is is is is is is is is is is is is is is is is is is is sufficiently lengthly to produce multiple fragments which are not concatenated at all--we want two disjoint long fragments.</str></arr><int name="id">1</int><arr name="range_facet_l"><long>1</long></arr><long name="_version_">1486030584669011968</long><arr name="multiDefault"><str>muLti-Default</str></arr><int name="intDefault">42</int><date name="timestamp">2014-11-28T15:40:01.993Z</date></doc></result><lst name="highlighting"><lst name="1"/></lst>
</response>

	request was:hl.snippets=2&q=tv_text:long&qt=standard&hl=true&start=0&hl.fl=tv_text&rows=200
	at org.apache.solr.SolrTestCaseJ4.assertQ(SolrTestCaseJ4.java:722)
	... 41 more


FAILED:  org.apache.solr.highlight.HighlighterTest.testSubwordWildcardHighlightWithTermOffsets2

Error Message:
Exception during query

Stack Trace:
java.lang.RuntimeException: Exception during query
	at __randomizedtesting.SeedInfo.seed([49ED0023EC0905BB:7B4E5BAA2CA5FFD5]:0)
	at org.apache.solr.SolrTestCaseJ4.assertQ(SolrTestCaseJ4.java:729)
	at org.apache.solr.highlight.HighlighterTest.testSubwordWildcardHighlightWithTermOffsets2(HighlighterTest.java:843)
	at sun.reflect.NativeMethodAccessorImpl.invoke0(Native Method)
	at sun.reflect.NativeMethodAccessorImpl.invoke(NativeMethodAccessorImpl.java:62)
	at sun.reflect.DelegatingMethodAccessorImpl.invoke(DelegatingMethodAccessorImpl.java:43)
	at java.lang.reflect.Method.invoke(Method.java:498)
	at com.carrotsearch.randomizedtesting.RandomizedRunner.invoke(RandomizedRunner.java:1618)
	at com.carrotsearch.randomizedtesting.RandomizedRunner$6.evaluate(RandomizedRunner.java:827)
	at com.carrotsearch.randomizedtesting.RandomizedRunner$7.evaluate(RandomizedRunner.java:863)
	at com.carrotsearch.randomizedtesting.RandomizedRunner$8.evaluate(RandomizedRunner.java:877)
	at com.carrotsearch.randomizedtesting.rules.SystemPropertiesRestoreRule$1.evaluate(SystemPropertiesRestoreRule.java:53)
	at org.apache.lucene.util.TestRuleSetupTeardownChained$1.evaluate(TestRuleSetupTeardownChained.java:50)
	at org.apache.lucene.util.AbstractBeforeAfterRule$1.evaluate(AbstractBeforeAfterRule.java:46)
	at com.carrotsearch.randomizedtesting.rules.SystemPropertiesInvariantRule$1.evaluate(SystemPropertiesInvariantRule.java:55)
	at org.apache.lucene.util.TestRuleThreadAndTestName$1.evaluate(TestRuleThreadAndTestName.java:49)
	at org.apache.lucene.util.TestRuleIgnoreAfterMaxFailures$1.evaluate(TestRuleIgnoreAfterMaxFailures.java:65)
	at org.apache.lucene.util.TestRuleMarkFailure$1.evaluate(TestRuleMarkFailure.java:48)
	at com.carrotsearch.randomizedtesting.rules.StatementAdapter.evaluate(StatementAdapter.java:36)
	at com.carrotsearch.randomizedtesting.ThreadLeakControl$StatementRunner.run(ThreadLeakControl.java:365)
	at com.carrotsearch.randomizedtesting.ThreadLeakControl.forkTimeoutingTask(ThreadLeakControl.java:798)
	at com.carrotsearch.randomizedtesting.ThreadLeakControl$3.evaluate(ThreadLeakControl.java:458)
	at com.carrotsearch.randomizedtesting.RandomizedRunner.runSingleTest(RandomizedRunner.java:836)
	at com.carrotsearch.randomizedtesting.RandomizedRunner$3.evaluate(RandomizedRunner.java:738)
	at com.carrotsearch.randomizedtesting.RandomizedRunner$4.evaluate(RandomizedRunner.java:772)
	at com.carrotsearch.randomizedtesting.RandomizedRunner$5.evaluate(RandomizedRunner.java:783)
	at com.carrotsearch.randomizedtesting.rules.StatementAdapter.evaluate(StatementAdapter.java:36)
	at com.carrotsearch.randomizedtesting.rules.SystemPropertiesRestoreRule$1.evaluate(SystemPropertiesRestoreRule.java:53)
	at org.apache.lucene.util.AbstractBeforeAfterRule$1.evaluate(AbstractBeforeAfterRule.java:46)
	at org.apache.lucene.util.TestRuleStoreClassName$1.evaluate(TestRuleStoreClassName.java:42)
	at com.carrotsearch.randomizedtesting.rules.SystemPropertiesInvariantRule$1.evaluate(SystemPropertiesInvariantRule.java:55)
	at com.carrotsearch.randomizedtesting.rules.NoShadowingOrOverridesOnMethodsRule$1.evaluate(NoShadowingOrOverridesOnMethodsRule.java:39)
	at com.carrotsearch.randomizedtesting.rules.NoShadowingOrOverridesOnMethodsRule$1.evaluate(NoShadowingOrOverridesOnMethodsRule.java:39)
	at com.carrotsearch.randomizedtesting.rules.StatementAdapter.evaluate(StatementAdapter.java:36)
	at com.carrotsearch.randomizedtesting.rules.StatementAdapter.evaluate(StatementAdapter.java:36)
	at com.carrotsearch.randomizedtesting.rules.StatementAdapter.evaluate(StatementAdapter.java:36)
	at org.apache.lucene.util.TestRuleAssertionsRequired$1.evaluate(TestRuleAssertionsRequired.java:54)
	at org.apache.lucene.util.TestRuleMarkFailure$1.evaluate(TestRuleMarkFailure.java:48)
	at org.apache.lucene.util.TestRuleIgnoreAfterMaxFailures$1.evaluate(TestRuleIgnoreAfterMaxFailures.java:65)
	at org.apache.lucene.util.TestRuleIgnoreTestSuites$1.evaluate(TestRuleIgnoreTestSuites.java:55)
	at com.carrotsearch.randomizedtesting.rules.StatementAdapter.evaluate(StatementAdapter.java:36)
	at com.carrotsearch.randomizedtesting.ThreadLeakControl$StatementRunner.run(ThreadLeakControl.java:365)
	at java.lang.Thread.run(Thread.java:745)
Caused by: java.lang.RuntimeException: REQUEST FAILED: xpath=//lst[@name='highlighting']/lst[@name='1']/arr[@name='subword_offsets']/str='lorem <em>PowerShot</em> ipsum'
	xml response was: <?xml version="1.0" encoding="UTF-8"?>
<response>
<lst name="responseHeader"><int name="status">0</int><int name="QTime">1</int></lst><result name="response" numFound="1" start="0"><doc><arr name="subword_offsets"><str>lorem PowerShot ipsum</str></arr><int name="id">1</int><arr name="range_facet_l"><long>1</long></arr><long name="_version_">1486030584917524480</long><arr name="multiDefault"><str>muLti-Default</str></arr><int name="intDefault">42</int><date name="timestamp">2014-11-28T15:40:02.23Z</date></doc></result><lst name="highlighting"><lst name="1"/></lst>
</response>

	request was:q=subword_offsets:pow*&hl=true&hl.fl=subword_offsets&wt=xml
	at org.apache.solr.SolrTestCaseJ4.assertQ(SolrTestCaseJ4.java:722)
	... 41 more


FAILED:  org.apache.solr.highlight.HighlighterTest.testDisMaxHighlight

Error Message:
Exception during query

Stack Trace:
java.lang.RuntimeException: Exception during query
	at __randomizedtesting.SeedInfo.seed([49ED0023EC0905BB:53452FA7ADD7F42A]:0)
	at org.apache.solr.SolrTestCaseJ4.assertQ(SolrTestCaseJ4.java:729)
	at org.apache.solr.highlight.HighlighterTest.testDisMaxHighlight(HighlighterTest.java:262)
	at sun.reflect.NativeMethodAccessorImpl.invoke0(Native Method)
	at sun.reflect.NativeMethodAccessorImpl.invoke(NativeMethodAccessorImpl.java:62)
	at sun.reflect.DelegatingMethodAccessorImpl.invoke(DelegatingMethodAccessorImpl.java:43)
	at java.lang.reflect.Method.invoke(Method.java:498)
	at com.carrotsearch.randomizedtesting.RandomizedRunner.invoke(RandomizedRunner.java:1618)
	at com.carrotsearch.randomizedtesting.RandomizedRunner$6.evaluate(RandomizedRunner.java:827)
	at com.carrotsearch.randomizedtesting.RandomizedRunner$7.evaluate(RandomizedRunner.java:863)
	at com.carrotsearch.randomizedtesting.RandomizedRunner$8.evaluate(RandomizedRunner.java:877)
	at com.carrotsearch.randomizedtesting.rules.SystemPropertiesRestoreRule$1.evaluate(SystemPropertiesRestoreRule.java:53)
	at org.apache.lucene.util.TestRuleSetupTeardownChained$1.evaluate(TestRuleSetupTeardownChained.java:50)
	at org.apache.lucene.util.AbstractBeforeAfterRule$1.evaluate(AbstractBeforeAfterRule.java:46)
	at com.carrotsearch.randomizedtesting.rules.SystemPropertiesInvariantRule$1.evaluate(SystemPropertiesInvariantRule.java:55)
	at org.apache.lucene.util.TestRuleThreadAndTestName$1.evaluate(TestRuleThreadAndTestName.java:49)
	at org.apache.lucene.util.TestRuleIgnoreAfterMaxFailures$1.evaluate(TestRuleIgnoreAfterMaxFailures.java:65)
	at org.apache.lucene.util.TestRuleMarkFailure$1.evaluate(TestRuleMarkFailure.java:48)
	at com.carrotsearch.randomizedtesting.rules.StatementAdapter.evaluate(StatementAdapter.java:36)
	at com.carrotsearch.randomizedtesting.ThreadLeakControl$StatementRunner.run(ThreadLeakControl.java:365)
	at com.carrotsearch.randomizedtesting.ThreadLeakControl.forkTimeoutingTask(ThreadLeakControl.java:798)
	at com.carrotsearch.randomizedtesting.ThreadLeakControl$3.evaluate(ThreadLeakControl.java:458)
	at com.carrotsearch.randomizedtesting.RandomizedRunner.runSingleTest(RandomizedRunner.java:836)
	at com.carrotsearch.randomizedtesting.RandomizedRunner$3.evaluate(RandomizedRunner.java:738)
	at com.carrotsearch.randomizedtesting.RandomizedRunner$4.evaluate(RandomizedRunner.java:772)
	at com.carrotsearch.randomizedtesting.RandomizedRunner$5.evaluate(RandomizedRunner.java:783)
	at com.carrotsearch.randomizedtesting.rules.StatementAdapter.evaluate(StatementAdapter.java:36)
	at com.carrotsearch.randomizedtesting.rules.SystemPropertiesRestoreRule$1.evaluate(SystemPropertiesRestoreRule.java:53)
	at org.apache.lucene.util.AbstractBeforeAfterRule$1.evaluate(AbstractBeforeAfterRule.java:46)
	at org.apache.lucene.util.TestRuleStoreClassName$1.evaluate(TestRuleStoreClassName.java:42)
	at com.carrotsearch.randomizedtesting.rules.SystemPropertiesInvariantRule$1.evaluate(SystemPropertiesInvariantRule.java:55)
	at com.carrotsearch.randomizedtesting.rules.NoShadowingOrOverridesOnMethodsRule$1.evaluate(NoShadowingOrOverridesOnMethodsRule.java:39)
	at com.carrotsearch.randomizedtesting.rules.NoShadowingOrOverridesOnMethodsRule$1.evaluate(NoShadowingOrOverridesOnMethodsRule.java:39)
	at com.carrotsearch.randomizedtesting.rules.StatementAdapter.evaluate(StatementAdapter.java:36)
	at com.carrotsearch.randomizedtesting.rules.StatementAdapter.evaluate(StatementAdapter.java:36)
	at com.carrotsearch.randomizedtesting.rules.StatementAdapter.evaluate(StatementAdapter.java:36)
	at org.apache.lucene.util.TestRuleAssertionsRequired$1.evaluate(TestRuleAssertionsRequired.java:54)
	at org.apache.lucene.util.TestRuleMarkFailure$1.evaluate(TestRuleMarkFailure.java:48)
	at org.apache.lucene.util.TestRuleIgnoreAfterMaxFailures$1.evaluate(TestRuleIgnoreAfterMaxFailures.java:65)
	at org.apache.lucene.util.TestRuleIgnoreTestSuites$1.evaluate(TestRuleIgnoreTestSuites.java:55)
	at com.carrotsearch.randomizedtesting.rules.StatementAdapter.evaluate(StatementAdapter.java:36)
	at com.carrotsearch.randomizedtesting.ThreadLeakControl$StatementRunner.run(ThreadLeakControl.java:365)
	at java.lang.Thread.run(Thread.java:745)
Caused by: java.lang.RuntimeException: REQUEST FAILED: xpath=//lst[@name='1']/arr[@name='tv_text']/str
	xml response was: <?xml version="1.0" encoding="UTF-8"?>
<response>
<lst name="responseHeader"><int name="status">0</int><int name="QTime">2</int></lst><result name="response" numFound="1" start="0"><doc><arr name="tv_text"><str>a long day's night</str></arr><int name="id">1</int><arr name="range_facet_l"><long>1</long></arr><long name="_version_">1486030584976244736</long><arr name="multiDefault"><str>muLti-Default</str></arr><int name="intDefault">42</int><date name="timestamp">2014-11-28T15:40:02.286Z</date></doc></result><lst name="highlighting"><lst name="1"/></lst>
</response>

	request was:q=long&q.alt=*:*&qt=dismax&hl=true&qf=tv_text&start=0&hl.fl=tv_text&rows=200
	at org.apache.solr.SolrTestCaseJ4.assertQ(SolrTestCaseJ4.java:722)
	... 41 more


FAILED:  org.apache.solr.highlight.HighlighterTest.testTwoFieldHighlight

Error Message:
Exception during query

Stack Trace:
java.lang.RuntimeException: Exception during query
	at __randomizedtesting.SeedInfo.seed([49ED0023EC0905BB:309FC5210B7F5301]:0)
	at org.apache.solr.SolrTestCaseJ4.assertQ(SolrTestCaseJ4.java:729)
	at org.apache.solr.highlight.HighlighterTest.testTwoFieldHighlight(HighlighterTest.java:391)
	at sun.reflect.NativeMethodAccessorImpl.invoke0(Native Method)
	at sun.reflect.NativeMethodAccessorImpl.invoke(NativeMethodAccessorImpl.java:62)
	at sun.reflect.DelegatingMethodAccessorImpl.invoke(DelegatingMethodAccessorImpl.java:43)
	at java.lang.reflect.Method.invoke(Method.java:498)
	at com.carrotsearch.randomizedtesting.RandomizedRunner.invoke(RandomizedRunner.java:1618)
	at com.carrotsearch.randomizedtesting.RandomizedRunner$6.evaluate(RandomizedRunner.java:827)
	at com.carrotsearch.randomizedtesting.RandomizedRunner$7.evaluate(RandomizedRunner.java:863)
	at com.carrotsearch.randomizedtesting.RandomizedRunner$8.evaluate(RandomizedRunner.java:877)
	at com.carrotsearch.randomizedtesting.rules.SystemPropertiesRestoreRule$1.evaluate(SystemPropertiesRestoreRule.java:53)
	at org.apache.lucene.util.TestRuleSetupTeardownChained$1.evaluate(TestRuleSetupTeardownChained.java:50)
	at org.apache.lucene.util.AbstractBeforeAfterRule$1.evaluate(AbstractBeforeAfterRule.java:46)
	at com.carrotsearch.randomizedtesting.rules.SystemPropertiesInvariantRule$1.evaluate(SystemPropertiesInvariantRule.java:55)
	at org.apache.lucene.util.TestRuleThreadAndTestName$1.evaluate(TestRuleThreadAndTestName.java:49)
	at org.apache.lucene.util.TestRuleIgnoreAfterMaxFailures$1.evaluate(TestRuleIgnoreAfterMaxFailures.java:65)
	at org.apache.lucene.util.TestRuleMarkFailure$1.evaluate(TestRuleMarkFailure.java:48)
	at com.carrotsearch.randomizedtesting.rules.StatementAdapter.evaluate(StatementAdapter.java:36)
	at com.carrotsearch.randomizedtesting.ThreadLeakControl$StatementRunner.run(ThreadLeakControl.java:365)
	at com.carrotsearch.randomizedtesting.ThreadLeakControl.forkTimeoutingTask(ThreadLeakControl.java:798)
	at com.carrotsearch.randomizedtesting.ThreadLeakControl$3.evaluate(ThreadLeakControl.java:458)
	at com.carrotsearch.randomizedtesting.RandomizedRunner.runSingleTest(RandomizedRunner.java:836)
	at com.carrotsearch.randomizedtesting.RandomizedRunner$3.evaluate(RandomizedRunner.java:738)
	at com.carrotsearch.randomizedtesting.RandomizedRunner$4.evaluate(RandomizedRunner.java:772)
	at com.carrotsearch.randomizedtesting.RandomizedRunner$5.evaluate(RandomizedRunner.java:783)
	at com.carrotsearch.randomizedtesting.rules.StatementAdapter.evaluate(StatementAdapter.java:36)
	at com.carrotsearch.randomizedtesting.rules.SystemPropertiesRestoreRule$1.evaluate(SystemPropertiesRestoreRule.java:53)
	at org.apache.lucene.util.AbstractBeforeAfterRule$1.evaluate(AbstractBeforeAfterRule.java:46)
	at org.apache.lucene.util.TestRuleStoreClassName$1.evaluate(TestRuleStoreClassName.java:42)
	at com.carrotsearch.randomizedtesting.rules.SystemPropertiesInvariantRule$1.evaluate(SystemPropertiesInvariantRule.java:55)
	at com.carrotsearch.randomizedtesting.rules.NoShadowingOrOverridesOnMethodsRule$1.evaluate(NoShadowingOrOverridesOnMethodsRule.java:39)
	at com.carrotsearch.randomizedtesting.rules.NoShadowingOrOverridesOnMethodsRule$1.evaluate(NoShadowingOrOverridesOnMethodsRule.java:39)
	at com.carrotsearch.randomizedtesting.rules.StatementAdapter.evaluate(StatementAdapter.java:36)
	at com.carrotsearch.randomizedtesting.rules.StatementAdapter.evaluate(StatementAdapter.java:36)
	at com.carrotsearch.randomizedtesting.rules.StatementAdapter.evaluate(StatementAdapter.java:36)
	at org.apache.lucene.util.TestRuleAssertionsRequired$1.evaluate(TestRuleAssertionsRequired.java:54)
	at org.apache.lucene.util.TestRuleMarkFailure$1.evaluate(TestRuleMarkFailure.java:48)
	at org.apache.lucene.util.TestRuleIgnoreAfterMaxFailures$1.evaluate(TestRuleIgnoreAfterMaxFailures.java:65)
	at org.apache.lucene.util.TestRuleIgnoreTestSuites$1.evaluate(TestRuleIgnoreTestSuites.java:55)
	at com.carrotsearch.randomizedtesting.rules.StatementAdapter.evaluate(StatementAdapter.java:36)
	at com.carrotsearch.randomizedtesting.ThreadLeakControl$StatementRunner.run(ThreadLeakControl.java:365)
	at java.lang.Thread.run(Thread.java:745)
Caused by: java.lang.RuntimeException: REQUEST FAILED: xpath=//lst[@name='1']/arr[@name='tv_text']/str
	xml response was: <?xml version="1.0" encoding="UTF-8"?>
<response>
<lst name="responseHeader"><int name="status">0</int><int name="QTime">1</int></lst><result name="response" numFound="1" start="0"><doc><arr name="t_text"><str>a long day's night</str></arr><int name="id">1</int><arr name="range_facet_l"><long>1</long></arr><arr name="tv_text"><str>a long night's day</str></arr><long name="_version_">1486030585037062144</long><arr name="multiDefault"><str>muLti-Default</str></arr><int name="intDefault">42</int><date name="timestamp">2014-11-28T15:40:02.344Z</date></doc></result><lst name="highlighting"><lst name="1"><arr name="t_text"><str>a &lt;em&gt;long&lt;/em&gt; day's night</str></arr></lst></lst>
</response>

	request was:q=t_text:long&qt=standard&hl=true&start=0&hl.fl=t_text+tv_text&rows=200
	at org.apache.solr.SolrTestCaseJ4.assertQ(SolrTestCaseJ4.java:722)
	... 41 more


FAILED:  org.apache.solr.highlight.HighlighterTest.testTermVecMultiValuedHighlight2

Error Message:
Exception during query

Stack Trace:
java.lang.RuntimeException: Exception during query
	at __randomizedtesting.SeedInfo.seed([49ED0023EC0905BB:51643DFF72DA9089]:0)
	at org.apache.solr.SolrTestCaseJ4.assertQ(SolrTestCaseJ4.java:729)
	at org.apache.solr.highlight.HighlighterTest.testTermVecMultiValuedHighlight2(HighlighterTest.java:239)
	at sun.reflect.NativeMethodAccessorImpl.invoke0(Native Method)
	at sun.reflect.NativeMethodAccessorImpl.invoke(NativeMethodAccessorImpl.java:62)
	at sun.reflect.DelegatingMethodAccessorImpl.invoke(DelegatingMethodAccessorImpl.java:43)
	at java.lang.reflect.Method.invoke(Method.java:498)
	at com.carrotsearch.randomizedtesting.RandomizedRunner.invoke(RandomizedRunner.java:1618)
	at com.carrotsearch.randomizedtesting.RandomizedRunner$6.evaluate(RandomizedRunner.java:827)
	at com.carrotsearch.randomizedtesting.RandomizedRunner$7.evaluate(RandomizedRunner.java:863)
	at com.carrotsearch.randomizedtesting.RandomizedRunner$8.evaluate(RandomizedRunner.java:877)
	at com.carrotsearch.randomizedtesting.rules.SystemPropertiesRestoreRule$1.evaluate(SystemPropertiesRestoreRule.java:53)
	at org.apache.lucene.util.TestRuleSetupTeardownChained$1.evaluate(TestRuleSetupTeardownChained.java:50)
	at org.apache.lucene.util.AbstractBeforeAfterRule$1.evaluate(AbstractBeforeAfterRule.java:46)
	at com.carrotsearch.randomizedtesting.rules.SystemPropertiesInvariantRule$1.evaluate(SystemPropertiesInvariantRule.java:55)
	at org.apache.lucene.util.TestRuleThreadAndTestName$1.evaluate(TestRuleThreadAndTestName.java:49)
	at org.apache.lucene.util.TestRuleIgnoreAfterMaxFailures$1.evaluate(TestRuleIgnoreAfterMaxFailures.java:65)
	at org.apache.lucene.util.TestRuleMarkFailure$1.evaluate(TestRuleMarkFailure.java:48)
	at com.carrotsearch.randomizedtesting.rules.StatementAdapter.evaluate(StatementAdapter.java:36)
	at com.carrotsearch.randomizedtesting.ThreadLeakControl$StatementRunner.run(ThreadLeakControl.java:365)
	at com.carrotsearch.randomizedtesting.ThreadLeakControl.forkTimeoutingTask(ThreadLeakControl.java:798)
	at com.carrotsearch.randomizedtesting.ThreadLeakControl$3.evaluate(ThreadLeakControl.java:458)
	at com.carrotsearch.randomizedtesting.RandomizedRunner.runSingleTest(RandomizedRunner.java:836)
	at com.carrotsearch.randomizedtesting.RandomizedRunner$3.evaluate(RandomizedRunner.java:738)
	at com.carrotsearch.randomizedtesting.RandomizedRunner$4.evaluate(RandomizedRunner.java:772)
	at com.carrotsearch.randomizedtesting.RandomizedRunner$5.evaluate(RandomizedRunner.java:783)
	at com.carrotsearch.randomizedtesting.rules.StatementAdapter.evaluate(StatementAdapter.java:36)
	at com.carrotsearch.randomizedtesting.rules.SystemPropertiesRestoreRule$1.evaluate(SystemPropertiesRestoreRule.java:53)
	at org.apache.lucene.util.AbstractBeforeAfterRule$1.evaluate(AbstractBeforeAfterRule.java:46)
	at org.apache.lucene.util.TestRuleStoreClassName$1.evaluate(TestRuleStoreClassName.java:42)
	at com.carrotsearch.randomizedtesting.rules.SystemPropertiesInvariantRule$1.evaluate(SystemPropertiesInvariantRule.java:55)
	at com.carrotsearch.randomizedtesting.rules.NoShadowingOrOverridesOnMethodsRule$1.evaluate(NoShadowingOrOverridesOnMethodsRule.java:39)
	at com.carrotsearch.randomizedtesting.rules.NoShadowingOrOverridesOnMethodsRule$1.evaluate(NoShadowingOrOverridesOnMethodsRule.java:39)
	at com.carrotsearch.randomizedtesting.rules.StatementAdapter.evaluate(StatementAdapter.java:36)
	at com.carrotsearch.randomizedtesting.rules.StatementAdapter.evaluate(StatementAdapter.java:36)
	at com.carrotsearch.randomizedtesting.rules.StatementAdapter.evaluate(StatementAdapter.java:36)
	at org.apache.lucene.util.TestRuleAssertionsRequired$1.evaluate(TestRuleAssertionsRequired.java:54)
	at org.apache.lucene.util.TestRuleMarkFailure$1.evaluate(TestRuleMarkFailure.java:48)
	at org.apache.lucene.util.TestRuleIgnoreAfterMaxFailures$1.evaluate(TestRuleIgnoreAfterMaxFailures.java:65)
	at org.apache.lucene.util.TestRuleIgnoreTestSuites$1.evaluate(TestRuleIgnoreTestSuites.java:55)
	at com.carrotsearch.randomizedtesting.rules.StatementAdapter.evaluate(StatementAdapter.java:36)
	at com.carrotsearch.randomizedtesting.ThreadLeakControl$StatementRunner.run(ThreadLeakControl.java:365)
	at java.lang.Thread.run(Thread.java:745)
Caused by: java.lang.RuntimeException: REQUEST FAILED: xpath=//lst[@name='1']/arr[@name='tv_mv_text']/str[.='a <em>long</em> days night this should be a piece of text which']
	xml response was: <?xml version="1.0" encoding="UTF-8"?>
<response>
<lst name="responseHeader"><int name="status">0</int><int name="QTime">1</int></lst><result name="response" numFound="1" start="0"><doc><arr name="tv_mv_text"><str>short</str><str>a long days night this should be a piece of text which is is is is is is is is is is is is is is is is is is is is is is is is isis is is is is is is is is is is is is is is is is is is is is is is is is is is is is is is is is is is is is is is is is is is is is is is is is is is is is is is is is is is is is is is is is is is is is is is is is is is sufficiently lengthly to produce multiple fragments which are not concatenated at all--we want two disjoint long fragments.</str></arr><int name="id">1</int><arr name="range_facet_l"><long>1</long></arr><long name="_version_">1486030585097879552</long><arr name="multiDefault"><str>muLti-Default</str></arr><int name="intDefault">42</int><date name="timestamp">2014-11-28T15:40:02.402Z</date></doc></result><lst name="highlighting"><lst name="1"/></lst>
</response>

	request was:hl.snippets=2&q=tv_mv_text:long&qt=standard&hl=true&start=0&hl.fl=tv_mv_text&rows=200
	at org.apache.solr.SolrTestCaseJ4.assertQ(SolrTestCaseJ4.java:722)
	... 41 more


FAILED:  org.apache.solr.highlight.HighlighterTest.testLongFragment

Error Message:
Exception during query

Stack Trace:
java.lang.RuntimeException: Exception during query
	at __randomizedtesting.SeedInfo.seed([49ED0023EC0905BB:D12A7C84E3250E73]:0)
	at org.apache.solr.SolrTestCaseJ4.assertQ(SolrTestCaseJ4.java:729)
	at org.apache.solr.highlight.HighlighterTest.testLongFragment(HighlighterTest.java:496)
	at sun.reflect.NativeMethodAccessorImpl.invoke0(Native Method)
	at sun.reflect.NativeMethodAccessorImpl.invoke(NativeMethodAccessorImpl.java:62)
	at sun.reflect.DelegatingMethodAccessorImpl.invoke(DelegatingMethodAccessorImpl.java:43)
	at java.lang.reflect.Method.invoke(Method.java:498)
	at com.carrotsearch.randomizedtesting.RandomizedRunner.invoke(RandomizedRunner.java:1618)
	at com.carrotsearch.randomizedtesting.RandomizedRunner$6.evaluate(RandomizedRunner.java:827)
	at com.carrotsearch.randomizedtesting.RandomizedRunner$7.evaluate(RandomizedRunner.java:863)
	at com.carrotsearch.randomizedtesting.RandomizedRunner$8.evaluate(RandomizedRunner.java:877)
	at com.carrotsearch.randomizedtesting.rules.SystemPropertiesRestoreRule$1.evaluate(SystemPropertiesRestoreRule.java:53)
	at org.apache.lucene.util.TestRuleSetupTeardownChained$1.evaluate(TestRuleSetupTeardownChained.java:50)
	at org.apache.lucene.util.AbstractBeforeAfterRule$1.evaluate(AbstractBeforeAfterRule.java:46)
	at com.carrotsearch.randomizedtesting.rules.SystemPropertiesInvariantRule$1.evaluate(SystemPropertiesInvariantRule.java:55)
	at org.apache.lucene.util.TestRuleThreadAndTestName$1.evaluate(TestRuleThreadAndTestName.java:49)
	at org.apache.lucene.util.TestRuleIgnoreAfterMaxFailures$1.evaluate(TestRuleIgnoreAfterMaxFailures.java:65)
	at org.apache.lucene.util.TestRuleMarkFailure$1.evaluate(TestRuleMarkFailure.java:48)
	at com.carrotsearch.randomizedtesting.rules.StatementAdapter.evaluate(StatementAdapter.java:36)
	at com.carrotsearch.randomizedtesting.ThreadLeakControl$StatementRunner.run(ThreadLeakControl.java:365)
	at com.carrotsearch.randomizedtesting.ThreadLeakControl.forkTimeoutingTask(ThreadLeakControl.java:798)
	at com.carrotsearch.randomizedtesting.ThreadLeakControl$3.evaluate(ThreadLeakControl.java:458)
	at com.carrotsearch.randomizedtesting.RandomizedRunner.runSingleTest(RandomizedRunner.java:836)
	at com.carrotsearch.randomizedtesting.RandomizedRunner$3.evaluate(RandomizedRunner.java:738)
	at com.carrotsearch.randomizedtesting.RandomizedRunner$4.evaluate(RandomizedRunner.java:772)
	at com.carrotsearch.randomizedtesting.RandomizedRunner$5.evaluate(RandomizedRunner.java:783)
	at com.carrotsearch.randomizedtesting.rules.StatementAdapter.evaluate(StatementAdapter.java:36)
	at com.carrotsearch.randomizedtesting.rules.SystemPropertiesRestoreRule$1.evaluate(SystemPropertiesRestoreRule.java:53)
	at org.apache.lucene.util.AbstractBeforeAfterRule$1.evaluate(AbstractBeforeAfterRule.java:46)
	at org.apache.lucene.util.TestRuleStoreClassName$1.evaluate(TestRuleStoreClassName.java:42)
	at com.carrotsearch.randomizedtesting.rules.SystemPropertiesInvariantRule$1.evaluate(SystemPropertiesInvariantRule.java:55)
	at com.carrotsearch.randomizedtesting.rules.NoShadowingOrOverridesOnMethodsRule$1.evaluate(NoShadowingOrOverridesOnMethodsRule.java:39)
	at com.carrotsearch.randomizedtesting.rules.NoShadowingOrOverridesOnMethodsRule$1.evaluate(NoShadowingOrOverridesOnMethodsRule.java:39)
	at com.carrotsearch.randomizedtesting.rules.StatementAdapter.evaluate(StatementAdapter.java:36)
	at com.carrotsearch.randomizedtesting.rules.StatementAdapter.evaluate(StatementAdapter.java:36)
	at com.carrotsearch.randomizedtesting.rules.StatementAdapter.evaluate(StatementAdapter.java:36)
	at org.apache.lucene.util.TestRuleAssertionsRequired$1.evaluate(TestRuleAssertionsRequired.java:54)
	at org.apache.lucene.util.TestRuleMarkFailure$1.evaluate(TestRuleMarkFailure.java:48)
	at org.apache.lucene.util.TestRuleIgnoreAfterMaxFailures$1.evaluate(TestRuleIgnoreAfterMaxFailures.java:65)
	at org.apache.lucene.util.TestRuleIgnoreTestSuites$1.evaluate(TestRuleIgnoreTestSuites.java:55)
	at com.carrotsearch.randomizedtesting.rules.StatementAdapter.evaluate(StatementAdapter.java:36)
	at com.carrotsearch.randomizedtesting.ThreadLeakControl$StatementRunner.run(ThreadLeakControl.java:365)
	at java.lang.Thread.run(Thread.java:745)
Caused by: java.lang.RuntimeException: REQUEST FAILED: xpath=//lst[@name='1']/arr[@name='tv_text']/str
	xml response was: <?xml version="1.0" encoding="UTF-8"?>
<response>
<lst name="responseHeader"><int name="status">0</int><int name="QTime">1</int></lst><result name="response" numFound="1" start="0"><doc><arr name="tv_text"><str>junit: [mkdir] Created dir: /home/klaas/worio/backend/trunk/build-src/solr-nightly/build/test-results [junit] Running org.apache.solr.BasicFunctionalityTest [junit] Tests run: 7, Failures: 0, Errors: 0, Time elapsed: 5.36 sec [junit] Running org.apache.solr.ConvertedLegacyTest [junit] Tests run: 1, Failures: 0, Errors: 0, Time elapsed: 8.268 sec [junit] Running org.apache.solr.DisMaxRequestHandlerTest [junit] Tests run: 1, Failures: 0, Errors: 0, Time elapsed: 1.56 sec [junit] Running org.apache.solr.HighlighterTest [junit] Tests run: 7, Failures: 0, Errors: 0, Time elapsed: 4.979 sec [junit] Running org.apache.solr.OutputWriterTest [junit] Tests run: 2, Failures: 0, Errors: 0, Time elapsed: 0.797 sec [junit] Running org.apache.solr.SampleTest [junit] Tests run: 2, Failures: 0, Errors: 0, Time elapsed: 1.021 sec [junit] Running org.apache.solr.analysis.TestBufferedTokenStream [junit] Tests run: 2, Failures: 0, Errors: 0, Time elapsed: 0.05 sec [junit] Running org.apache.solr.analysis.TestRemoveDuplicatesTokenFilter [junit] Tests run: 3, Failures: 0, Errors: 0, Time elapsed: 0.054 sec [junit] Running org.apache.solr.analysis.TestSynonymFilter [junit] Tests run: 6, Failures: 0, Errors: 0, Time elapsed: 0.081 sec [junit] Running org.apache.solr.analysis.TestWordDelimiterFilter [junit] Tests run: 1, Failures: 0, Errors: 0, Time elapsed: 1.714 sec [junit] Running org.apache.solr.search.TestDocSet [junit] Tests run: 1, Failures: 0, Errors: 0, Time elapsed: 0.788 sec [junit] Running org.apache.solr.util.SolrPluginUtilsTest [junit] Tests run: 5, Failures: 0, Errors: 0, Time elapsed: 3.519 sec [junit] Running org.apache.solr.util.TestOpenBitSet [junit] Tests run: 2, Failures: 0, Errors: 0, Time elapsed: 0.533 sec</str></arr><int name="id">1</int><arr name="range_facet_l"><long>1</long></arr><long name="_version_">1486030585462784000</long><arr name="multiDefault"><str>muLti-Default</str></arr><int name="intDefault">42</int><date name="timestamp">2014-11-28T15:40:02.75Z</date></doc></result><lst name="highlighting"><lst name="1"/></lst>
</response>

	request was:q=tv_text:dir&qt=standard&hl=true&start=0&hl.fl=tv_text&rows=200
	at org.apache.solr.SolrTestCaseJ4.assertQ(SolrTestCaseJ4.java:722)
	... 41 more


FAILED:  org.apache.solr.highlight.HighlighterTest.testTermVecMultiValuedHighlight

Error Message:
Exception during query

Stack Trace:
java.lang.RuntimeException: Exception during query
	at __randomizedtesting.SeedInfo.seed([49ED0023EC0905BB:E3B3044F59E311A3]:0)
	at org.apache.solr.SolrTestCaseJ4.assertQ(SolrTestCaseJ4.java:729)
	at org.apache.solr.highlight.HighlighterTest.testTermVecMultiValuedHighlight(HighlighterTest.java:211)
	at sun.reflect.NativeMethodAccessorImpl.invoke0(Native Method)
	at sun.reflect.NativeMethodAccessorImpl.invoke(NativeMethodAccessorImpl.java:62)
	at sun.reflect.DelegatingMethodAccessorImpl.invoke(DelegatingMethodAccessorImpl.java:43)
	at java.lang.reflect.Method.invoke(Method.java:498)
	at com.carrotsearch.randomizedtesting.RandomizedRunner.invoke(RandomizedRunner.java:1618)
	at com.carrotsearch.randomizedtesting.RandomizedRunner$6.evaluate(RandomizedRunner.java:827)
	at com.carrotsearch.randomizedtesting.RandomizedRunner$7.evaluate(RandomizedRunner.java:863)
	at com.carrotsearch.randomizedtesting.RandomizedRunner$8.evaluate(RandomizedRunner.java:877)
	at com.carrotsearch.randomizedtesting.rules.SystemPropertiesRestoreRule$1.evaluate(SystemPropertiesRestoreRule.java:53)
	at org.apache.lucene.util.TestRuleSetupTeardownChained$1.evaluate(TestRuleSetupTeardownChained.java:50)
	at org.apache.lucene.util.AbstractBeforeAfterRule$1.evaluate(AbstractBeforeAfterRule.java:46)
	at com.carrotsearch.randomizedtesting.rules.SystemPropertiesInvariantRule$1.evaluate(SystemPropertiesInvariantRule.java:55)
	at org.apache.lucene.util.TestRuleThreadAndTestName$1.evaluate(TestRuleThreadAndTestName.java:49)
	at org.apache.lucene.util.TestRuleIgnoreAfterMaxFailures$1.evaluate(TestRuleIgnoreAfterMaxFailures.java:65)
	at org.apache.lucene.util.TestRuleMarkFailure$1.evaluate(TestRuleMarkFailure.java:48)
	at com.carrotsearch.randomizedtesting.rules.StatementAdapter.evaluate(StatementAdapter.java:36)
	at com.carrotsearch.randomizedtesting.ThreadLeakControl$StatementRunner.run(ThreadLeakControl.java:365)
	at com.carrotsearch.randomizedtesting.ThreadLeakControl.forkTimeoutingTask(ThreadLeakControl.java:798)
	at com.carrotsearch.randomizedtesting.ThreadLeakControl$3.evaluate(ThreadLeakControl.java:458)
	at com.carrotsearch.randomizedtesting.RandomizedRunner.runSingleTest(RandomizedRunner.java:836)
	at com.carrotsearch.randomizedtesting.RandomizedRunner$3.evaluate(RandomizedRunner.java:738)
	at com.carrotsearch.randomizedtesting.RandomizedRunner$4.evaluate(RandomizedRunner.java:772)
	at com.carrotsearch.randomizedtesting.RandomizedRunner$5.evaluate(RandomizedRunner.java:783)
	at com.carrotsearch.randomizedtesting.rules.StatementAdapter.evaluate(StatementAdapter.java:36)
	at com.carrotsearch.randomizedtesting.rules.SystemPropertiesRestoreRule$1.evaluate(SystemPropertiesRestoreRule.java:53)
	at org.apache.lucene.util.AbstractBeforeAfterRule$1.evaluate(AbstractBeforeAfterRule.java:46)
	at org.apache.lucene.util.TestRuleStoreClassName$1.evaluate(TestRuleStoreClassName.java:42)
	at com.carrotsearch.randomizedtesting.rules.SystemPropertiesInvariantRule$1.evaluate(SystemPropertiesInvariantRule.java:55)
	at com.carrotsearch.randomizedtesting.rules.NoShadowingOrOverridesOnMethodsRule$1.evaluate(NoShadowingOrOverridesOnMethodsRule.java:39)
	at com.carrotsearch.randomizedtesting.rules.NoShadowingOrOverridesOnMethodsRule$1.evaluate(NoShadowingOrOverridesOnMethodsRule.java:39)
	at com.carrotsearch.randomizedtesting.rules.StatementAdapter.evaluate(StatementAdapter.java:36)
	at com.carrotsearch.randomizedtesting.rules.StatementAdapter.evaluate(StatementAdapter.java:36)
	at com.carrotsearch.randomizedtesting.rules.StatementAdapter.evaluate(StatementAdapter.java:36)
	at org.apache.lucene.util.TestRuleAssertionsRequired$1.evaluate(TestRuleAssertionsRequired.java:54)
	at org.apache.lucene.util.TestRuleMarkFailure$1.evaluate(TestRuleMarkFailure.java:48)
	at org.apache.lucene.util.TestRuleIgnoreAfterMaxFailures$1.evaluate(TestRuleIgnoreAfterMaxFailures.java:65)
	at org.apache.lucene.util.TestRuleIgnoreTestSuites$1.evaluate(TestRuleIgnoreTestSuites.java:55)
	at com.carrotsearch.randomizedtesting.rules.StatementAdapter.evaluate(StatementAdapter.java:36)
	at com.carrotsearch.randomizedtesting.ThreadLeakControl$StatementRunner.run(ThreadLeakControl.java:365)
	at java.lang.Thread.run(Thread.java:745)
Caused by: java.lang.RuntimeException: REQUEST FAILED: xpath=//lst[@name='1']/arr[@name='tv_mv_text']/str[.='a <em>long</em> days night this should be a piece of text which']
	xml response was: <?xml version="1.0" encoding="UTF-8"?>
<response>
<lst name="responseHeader"><int name="status">0</int><int name="QTime">1</int></lst><result name="response" numFound="1" start="0"><doc><arr name="tv_mv_text"><str>a long days night this should be a piece of text which is is is is is is is is is is is is is is is is is is is is is is is is isis is is is is is is is is is is is is is is is is is is is is is is is is is is is is is is is is is is is is is is is is is is is is is is is is is is is is is is is is is is is is is is is is is is is is is is is is is is sufficiently lengthly to produce multiple fragments which are not concatenated at all--we want two disjoint long fragments.</str><str>a long days night this should be a piece of text which is is is is is is is is is is is is is is is is is is is is is is is is isis is is is is is is is is is is is is is is is is is is is is is is is is is is is is is is is is is is is is is is is is is is is is is is is is is is is is is is is is is is is is is is is is is is is is is is is is is is sufficiently lengthly to produce multiple fragments which are not concatenated at all--we want two disjoint long fragments.</str></arr><int name="id">1</int><arr name="range_facet_l"><long>1</long></arr><long name="_version_">1486030585566593024</long><arr name="multiDefault"><str>muLti-Default</str></arr><int name="intDefault">42</int><date name="timestamp">2014-11-28T15:40:02.849Z</date></doc></result><lst name="highlighting"><lst name="1"/></lst>
</response>

	request was:hl.snippets=2&q=tv_mv_text:long&qt=standard&hl=true&start=0&hl.fl=tv_mv_text&rows=200
	at org.apache.solr.SolrTestCaseJ4.assertQ(SolrTestCaseJ4.java:722)
	... 41 more


FAILED:  org.apache.solr.highlight.HighlighterTest.testSubwordWildcardHighlightWithTermOffsets

Error Message:
Exception during query

Stack Trace:
java.lang.RuntimeException: Exception during query
	at __randomizedtesting.SeedInfo.seed([49ED0023EC0905BB:764BE4E019AC67C6]:0)
	at org.apache.solr.SolrTestCaseJ4.assertQ(SolrTestCaseJ4.java:729)
	at org.apache.solr.highlight.HighlighterTest.testSubwordWildcardHighlightWithTermOffsets(HighlighterTest.java:834)
	at sun.reflect.NativeMethodAccessorImpl.invoke0(Native Method)
	at sun.reflect.NativeMethodAccessorImpl.invoke(NativeMethodAccessorImpl.java:62)
	at sun.reflect.DelegatingMethodAccessorImpl.invoke(DelegatingMethodAccessorImpl.java:43)
	at java.lang.reflect.Method.invoke(Method.java:498)
	at com.carrotsearch.randomizedtesting.RandomizedRunner.invoke(RandomizedRunner.java:1618)
	at com.carrotsearch.randomizedtesting.RandomizedRunner$6.evaluate(RandomizedRunner.java:827)
	at com.carrotsearch.randomizedtesting.RandomizedRunner$7.evaluate(RandomizedRunner.java:863)
	at com.carrotsearch.randomizedtesting.RandomizedRunner$8.evaluate(RandomizedRunner.java:877)
	at com.carrotsearch.randomizedtesting.rules.SystemPropertiesRestoreRule$1.evaluate(SystemPropertiesRestoreRule.java:53)
	at org.apache.lucene.util.TestRuleSetupTeardownChained$1.evaluate(TestRuleSetupTeardownChained.java:50)
	at org.apache.lucene.util.AbstractBeforeAfterRule$1.evaluate(AbstractBeforeAfterRule.java:46)
	at com.carrotsearch.randomizedtesting.rules.SystemPropertiesInvariantRule$1.evaluate(SystemPropertiesInvariantRule.java:55)
	at org.apache.lucene.util.TestRuleThreadAndTestName$1.evaluate(TestRuleThreadAndTestName.java:49)
	at org.apache.lucene.util.TestRuleIgnoreAfterMaxFailures$1.evaluate(TestRuleIgnoreAfterMaxFailures.java:65)
	at org.apache.lucene.util.TestRuleMarkFailure$1.evaluate(TestRuleMarkFailure.java:48)
	at com.carrotsearch.randomizedtesting.rules.StatementAdapter.evaluate(StatementAdapter.java:36)
	at com.carrotsearch.randomizedtesting.ThreadLeakControl$StatementRunner.run(ThreadLeakControl.java:365)
	at com.carrotsearch.randomizedtesting.ThreadLeakControl.forkTimeoutingTask(ThreadLeakControl.java:798)
	at com.carrotsearch.randomizedtesting.ThreadLeakControl$3.evaluate(ThreadLeakControl.java:458)
	at com.carrotsearch.randomizedtesting.RandomizedRunner.runSingleTest(RandomizedRunner.java:836)
	at com.carrotsearch.randomizedtesting.RandomizedRunner$3.evaluate(RandomizedRunner.java:738)
	at com.carrotsearch.randomizedtesting.RandomizedRunner$4.evaluate(RandomizedRunner.java:772)
	at com.carrotsearch.randomizedtesting.RandomizedRunner$5.evaluate(RandomizedRunner.java:783)
	at com.carrotsearch.randomizedtesting.rules.StatementAdapter.evaluate(StatementAdapter.java:36)
	at com.carrotsearch.randomizedtesting.rules.SystemPropertiesRestoreRule$1.evaluate(SystemPropertiesRestoreRule.java:53)
	at org.apache.lucene.util.AbstractBeforeAfterRule$1.evaluate(AbstractBeforeAfterRule.java:46)
	at org.apache.lucene.util.TestRuleStoreClassName$1.evaluate(TestRuleStoreClassName.java:42)
	at com.carrotsearch.randomizedtesting.rules.SystemPropertiesInvariantRule$1.evaluate(SystemPropertiesInvariantRule.java:55)
	at com.carrotsearch.randomizedtesting.rules.NoShadowingOrOverridesOnMethodsRule$1.evaluate(NoShadowingOrOverridesOnMethodsRule.java:39)
	at com.carrotsearch.randomizedtesting.rules.NoShadowingOrOverridesOnMethodsRule$1.evaluate(NoShadowingOrOverridesOnMethodsRule.java:39)
	at com.carrotsearch.randomizedtesting.rules.StatementAdapter.evaluate(StatementAdapter.java:36)
	at com.carrotsearch.randomizedtesting.rules.StatementAdapter.evaluate(StatementAdapter.java:36)
	at com.carrotsearch.randomizedtesting.rules.StatementAdapter.evaluate(StatementAdapter.java:36)
	at org.apache.lucene.util.TestRuleAssertionsRequired$1.evaluate(TestRuleAssertionsRequired.java:54)
	at org.apache.lucene.util.TestRuleMarkFailure$1.evaluate(TestRuleMarkFailure.java:48)
	at org.apache.lucene.util.TestRuleIgnoreAfterMaxFailures$1.evaluate(TestRuleIgnoreAfterMaxFailures.java:65)
	at org.apache.lucene.util.TestRuleIgnoreTestSuites$1.evaluate(TestRuleIgnoreTestSuites.java:55)
	at com.carrotsearch.randomizedtesting.rules.StatementAdapter.evaluate(StatementAdapter.java:36)
	at com.carrotsearch.randomizedtesting.ThreadLeakControl$StatementRunner.run(ThreadLeakControl.java:365)
	at java.lang.Thread.run(Thread.java:745)
Caused by: java.lang.RuntimeException: REQUEST FAILED: xpath=//lst[@name='highlighting']/lst[@name='1']/arr[@name='subword_offsets']/str='lorem <em>PowerShot.com</em> ipsum'
	xml response was: <?xml version="1.0" encoding="UTF-8"?>
<response>
<lst name="responseHeader"><int name="status">0</int><int name="QTime">2</int></lst><result name="response" numFound="1" start="0"><doc><arr name="subword_offsets"><str>lorem PowerShot.com ipsum</str></arr><int name="id">1</int><arr name="range_facet_l"><long>1</long></arr><long name="_version_">1486030585610633216</long><arr name="multiDefault"><str>muLti-Default</str></arr><int name="intDefault">42</int><date name="timestamp">2014-11-28T15:40:02.891Z</date></doc></result><lst name="highlighting"><lst name="1"/></lst>
</response>

	request was:q=subword_offsets:pow*&hl=true&hl.fl=subword_offsets&wt=xml
	at org.apache.solr.SolrTestCaseJ4.assertQ(SolrTestCaseJ4.java:722)
	... 41 more




Build Log:
[...truncated 9447 lines...]
   [junit4] Suite: org.apache.solr.highlight.HighlighterTest
   [junit4]   2> Creating dataDir: /mnt/ssd/jenkins/workspace/Lucene-Solr-5.x-Linux/solr/build/solr-core/test/J0/temp/solr.highlight.HighlighterTest-49ED0023EC0905BB-001/init-core-data-001
   [junit4]   2> 690520 T1733 oas.SolrTestCaseJ4.buildSSLConfig Randomized ssl (true) and clientAuth (true)
   [junit4]   2> 690521 T1733 oas.SolrTestCaseJ4.initCore ####initCore
   [junit4]   2> 690521 T1733 oasc.SolrResourceLoader.<init> new SolrResourceLoader for directory: '/mnt/ssd/jenkins/workspace/Lucene-Solr-5.x-Linux/solr/core/src/test-files/solr/collection1/'
   [junit4]   2> 690522 T1733 oasc.SolrResourceLoader.replaceClassLoader Adding 'file:/mnt/ssd/jenkins/workspace/Lucene-Solr-5.x-Linux/solr/core/src/test-files/solr/collection1/lib/.svn/' to classloader
   [junit4]   2> 690523 T1733 oasc.SolrResourceLoader.replaceClassLoader Adding 'file:/mnt/ssd/jenkins/workspace/Lucene-Solr-5.x-Linux/solr/core/src/test-files/solr/collection1/lib/classes/' to classloader
   [junit4]   2> 690523 T1733 oasc.SolrResourceLoader.replaceClassLoader Adding 'file:/mnt/ssd/jenkins/workspace/Lucene-Solr-5.x-Linux/solr/core/src/test-files/solr/collection1/lib/README' to classloader
   [junit4]   2> 690555 T1733 oasc.SolrConfig.<init> Using Lucene MatchVersion: 5.0.0
   [junit4]   2> 690582 T1733 oasc.SolrConfig.<init> Loaded SolrConfig: solrconfig.xml
   [junit4]   2> 690583 T1733 oass.IndexSchema.readSchema Reading Solr Schema from /mnt/ssd/jenkins/workspace/Lucene-Solr-5.x-Linux/solr/core/src/test-files/solr/collection1/conf/schema.xml
   [junit4]   2> 690589 T1733 oass.IndexSchema.readSchema [null] Schema name=test
   [junit4]   2> 690676 T1733 oass.OpenExchangeRatesOrgProvider.init Initialized with rates=open-exchange-rates.json, refreshInterval=1440.
   [junit4]   2> 690681 T1733 oass.IndexSchema.readSchema default search field in schema is text
   [junit4]   2> 690683 T1733 oass.IndexSchema.readSchema unique key field: id
   [junit4]   2> 690689 T1733 oass.FileExchangeRateProvider.reload Reloading exchange rates from file currency.xml
   [junit4]   2> 690691 T1733 oass.FileExchangeRateProvider.reload Reloading exchange rates from file currency.xml
   [junit4]   2> 690693 T1733 oass.OpenExchangeRatesOrgProvider.reload Reloading exchange rates from open-exchange-rates.json
   [junit4]   2> 690694 T1733 oass.OpenExchangeRatesOrgProvider$OpenExchangeRates.<init> WARN Unknown key IMPORTANT NOTE
   [junit4]   2> 690694 T1733 oass.OpenExchangeRatesOrgProvider$OpenExchangeRates.<init> WARN Expected key, got STRING
   [junit4]   2> 690695 T1733 oass.OpenExchangeRatesOrgProvider.reload Reloading exchange rates from open-exchange-rates.json
   [junit4]   2> 690695 T1733 oass.OpenExchangeRatesOrgProvider$OpenExchangeRates.<init> WARN Unknown key IMPORTANT NOTE
   [junit4]   2> 690695 T1733 oass.OpenExchangeRatesOrgProvider$OpenExchangeRates.<init> WARN Expected key, got STRING
   [junit4]   2> 690696 T1733 oasc.SolrResourceLoader.locateSolrHome JNDI not configured for solr (NoInitialContextEx)
   [junit4]   2> 690696 T1733 oasc.SolrResourceLoader.locateSolrHome using system property solr.solr.home: /mnt/ssd/jenkins/workspace/Lucene-Solr-5.x-Linux/solr/core/src/test-files/solr
   [junit4]   2> 690696 T1733 oasc.SolrResourceLoader.<init> new SolrResourceLoader for directory: '/mnt/ssd/jenkins/workspace/Lucene-Solr-5.x-Linux/solr/core/src/test-files/solr/'
   [junit4]   2> 690755 T1733 oasc.CoreContainer.<init> New CoreContainer 21599834
   [junit4]   2> 690756 T1733 oasc.CoreContainer.load Loading cores into CoreContainer [instanceDir=/mnt/ssd/jenkins/workspace/Lucene-Solr-5.x-Linux/solr/core/src/test-files/solr/]
   [junit4]   2> 690756 T1733 oashc.HttpShardHandlerFactory.getParameter Setting socketTimeout to: 0
   [junit4]   2> 690756 T1733 oashc.HttpShardHandlerFactory.getParameter Setting urlScheme to: null
   [junit4]   2> 690757 T1733 oashc.HttpShardHandlerFactory.getParameter Setting connTimeout to: 0
   [junit4]   2> 690757 T1733 oashc.HttpShardHandlerFactory.getParameter Setting maxConnectionsPerHost to: 20
   [junit4]   2> 690757 T1733 oashc.HttpShardHandlerFactory.getParameter Setting maxConnections to: 10000
   [junit4]   2> 690757 T1733 oashc.HttpShardHandlerFactory.getParameter Setting corePoolSize to: 0
   [junit4]   2> 690757 T1733 oashc.HttpShardHandlerFactory.getParameter Setting maximumPoolSize to: 2147483647
   [junit4]   2> 690757 T1733 oashc.HttpShardHandlerFactory.getParameter Setting maxThreadIdleTime to: 5
   [junit4]   2> 690758 T1733 oashc.HttpShardHandlerFactory.getParameter Setting sizeOfQueue to: -1
   [junit4]   2> 690758 T1733 oashc.HttpShardHandlerFactory.getParameter Setting fairnessPolicy to: false
   [junit4]   2> 690760 T1733 oasu.UpdateShardHandler.<init> Creating UpdateShardHandler HTTP client with params: socketTimeout=30000&connTimeout=30000&retry=false
   [junit4]   2> 690761 T1733 oasl.LogWatcher.createWatcher SLF4J impl is org.slf4j.impl.Log4jLoggerFactory
   [junit4]   2> 690761 T1733 oasl.LogWatcher.newRegisteredLogWatcher Registering Log Listener [Log4j (org.slf4j.impl.Log4jLoggerFactory)]
   [junit4]   2> 690761 T1733 oasc.CoreContainer.load Host Name: 
   [junit4]   2> 691828 T1734 oasc.SolrResourceLoader.<init> new SolrResourceLoader for directory: '/mnt/ssd/jenkins/workspace/Lucene-Solr-5.x-Linux/solr/core/src/test-files/solr/collection1/'
   [junit4]   2> 691834 T1734 oasc.SolrResourceLoader.replaceClassLoader Adding 'file:/mnt/ssd/jenkins/workspace/Lucene-Solr-5.x-Linux/solr/core/src/test-files/solr/collection1/lib/.svn/' to classloader
   [junit4]   2> 691834 T1734 oasc.SolrResourceLoader.replaceClassLoader Adding 'file:/mnt/ssd/jenkins/workspace/Lucene-Solr-5.x-Linux/solr/core/src/test-files/solr/collection1/lib/classes/' to classloader
   [junit4]   2> 691834 T1734 oasc.SolrResourceLoader.replaceClassLoader Adding 'file:/mnt/ssd/jenkins/workspace/Lucene-Solr-5.x-Linux/solr/core/src/test-files/solr/collection1/lib/README' to classloader
   [junit4]   2> 691865 T1734 oasc.SolrConfig.<init> Using Lucene MatchVersion: 5.0.0
   [junit4]   2> 691888 T1734 oasc.SolrConfig.<init> Loaded SolrConfig: solrconfig.xml
   [junit4]   2> 691889 T1734 oass.IndexSchema.readSchema Reading Solr Schema from /mnt/ssd/jenkins/workspace/Lucene-Solr-5.x-Linux/solr/core/src/test-files/solr/collection1/conf/schema.xml
   [junit4]   2> 691894 T1734 oass.IndexSchema.readSchema [collection1] Schema name=test
   [junit4]   2> 692033 T1734 oass.OpenExchangeRatesOrgProvider.init Initialized with rates=open-exchange-rates.json, refreshInterval=1440.
   [junit4]   2> 692037 T1734 oass.IndexSchema.readSchema default search field in schema is text
   [junit4]   2> 692038 T1734 oass.IndexSchema.readSchema unique key field: id
   [junit4]   2> 692043 T1734 oass.FileExchangeRateProvider.reload Reloading exchange rates from file currency.xml
   [junit4]   2> 692045 T1734 oass.FileExchangeRateProvider.reload Reloading exchange rates from file currency.xml
   [junit4]   2> 692046 T1734 oass.OpenExchangeRatesOrgProvider.reload Reloading exchange rates from open-exchange-rates.json
   [junit4]   2> 692047 T1734 oass.OpenExchangeRatesOrgProvider$OpenExchangeRates.<init> WARN Unknown key IMPORTANT NOTE
   [junit4]   2> 692047 T1734 oass.OpenExchangeRatesOrgProvider$OpenExchangeRates.<init> WARN Expected key, got STRING
   [junit4]   2> 692047 T1734 oass.OpenExchangeRatesOrgProvider.reload Reloading exchange rates from open-exchange-rates.json
   [junit4]   2> 692047 T1734 oass.OpenExchangeRatesOrgProvider$OpenExchangeRates.<init> WARN Unknown key IMPORTANT NOTE
   [junit4]   2> 692047 T1734 oass.OpenExchangeRatesOrgProvider$OpenExchangeRates.<init> WARN Expected key, got STRING
   [junit4]   2> 692047 T1734 oasc.CoreContainer.create Creating SolrCore 'collection1' using configuration from instancedir /mnt/ssd/jenkins/workspace/Lucene-Solr-5.x-Linux/solr/core/src/test-files/solr/collection1/
   [junit4]   2> 692048 T1734 oasc.SolrCore.initDirectoryFactory org.apache.solr.core.MockDirectoryFactory
   [junit4]   2> 692048 T1734 oasc.SolrCore.<init> [collection1] Opening new SolrCore at /mnt/ssd/jenkins/workspace/Lucene-Solr-5.x-Linux/solr/core/src/test-files/solr/collection1/, dataDir=/mnt/ssd/jenkins/workspace/Lucene-Solr-5.x-Linux/solr/build/solr-core/test/J0/temp/solr.highlight.HighlighterTest-49ED0023EC0905BB-001/init-core-data-001/
   [junit4]   2> 692048 T1734 oasc.JmxMonitoredMap.<init> JMX monitoring is enabled. Adding Solr mbeans to JMX Server: com.sun.jmx.mbeanserver.JmxMBeanServer@b7c9ec
   [junit4]   2> 692049 T1734 oasc.CachingDirectoryFactory.get return new directory for /mnt/ssd/jenkins/workspace/Lucene-Solr-5.x-Linux/solr/build/solr-core/test/J0/temp/solr.highlight.HighlighterTest-49ED0023EC0905BB-001/init-core-data-001
   [junit4]   2> 692049 T1734 oasc.SolrCore.getNewIndexDir New index directory detected: old=null new=/mnt/ssd/jenkins/workspace/Lucene-Solr-5.x-Linux/solr/build/solr-core/test/J0/temp/solr.highlight.HighlighterTest-49ED0023EC0905BB-001/init-core-data-001/index/
   [junit4]   2> 692049 T1734 oasc.SolrCore.initIndex WARN [collection1] Solr index directory '/mnt/ssd/jenkins/workspace/Lucene-Solr-5.x-Linux/solr/build/solr-core/test/J0/temp/solr.highlight.HighlighterTest-49ED0023EC0905BB-001/init-core-data-001/index' doesn't exist. Creating new index...
   [junit4]   2> 692050 T1734 oasc.CachingDirectoryFactory.get return new directory for /mnt/ssd/jenkins/workspace/Lucene-Solr-5.x-Linux/solr/build/solr-core/test/J0/temp/solr.highlight.HighlighterTest-49ED0023EC0905BB-001/init-core-data-001/index
   [junit4]   2> 692050 T1734 oasu.RandomMergePolicy.<init> RandomMergePolicy wrapping class org.apache.lucene.index.TieredMergePolicy: [TieredMergePolicy: maxMergeAtOnce=13, maxMergeAtOnceExplicit=25, maxMergedSegmentMB=33.16015625, floorSegmentMB=0.353515625, forceMergeDeletesPctAllowed=27.405276839764802, segmentsPerTier=25.0, maxCFSSegmentSizeMB=8.796093022207999E12, noCFSRatio=0.3941026037543759
   [junit4]   2> 692051 T1734 oasc.SolrDeletionPolicy.onCommit SolrDeletionPolicy.onCommit: commits: num=1
   [junit4]   2> 		commit{dir=RateLimitedDirectoryWrapper(MockDirectoryWrapper(RAMDirectory@b99933 lockFactory=org.apache.lucene.store.SingleInstanceLockFactory@554eef)),segFN=segments_1,generation=1}
   [junit4]   2> 692051 T1734 oasc.SolrDeletionPolicy.updateCommits newest commit generation = 1
   [junit4]   2> 692051 T1734 oasc.SolrCore.initWriters created xml: solr.XMLResponseWriter
   [junit4]   2> 692054 T1734 oasup.UpdateRequestProcessorChain.init creating updateRequestProcessorChain "dedupe"
   [junit4]   2> 692054 T1734 oasup.UpdateRequestProcessorChain.init inserting DistributedUpdateProcessorFactory into updateRequestProcessorChain "dedupe"
   [junit4]   2> 692054 T1734 oasup.UpdateRequestProcessorChain.init creating updateRequestProcessorChain "dedupe-allfields"
   [junit4]   2> 692054 T1734 oasup.UpdateRequestProcessorChain.init inserting DistributedUpdateProcessorFactory into updateRequestProcessorChain "dedupe-allfields"
   [junit4]   2> 692055 T1734 oasup.UpdateRequestProcessorChain.init creating updateRequestProcessorChain "stored_sig"
   [junit4]   2> 692055 T1734 oasup.UpdateRequestProcessorChain.init inserting DistributedUpdateProcessorFactory into updateRequestProcessorChain "stored_sig"
   [junit4]   2> 692055 T1734 oasup.UpdateRequestProcessorChain.init creating updateRequestProcessorChain "uniq-fields"
   [junit4]   2> 692055 T1734 oasup.UpdateRequestProcessorChain.init inserting DistributedUpdateProcessorFactory into updateRequestProcessorChain "uniq-fields"
   [junit4]   2> 692056 T1734 oasup.UpdateRequestProcessorChain.init creating updateRequestProcessorChain "distrib-dup-test-chain-explicit"
   [junit4]   2> 692056 T1734 oasup.UpdateRequestProcessorChain.init creating updateRequestProcessorChain "distrib-dup-test-chain-implicit"
   [junit4]   2> 692056 T1734 oasup.UpdateRequestProcessorChain.init inserting DistributedUpdateProcessorFactory into updateRequestProcessorChain "distrib-dup-test-chain-implicit"
   [junit4]   2> 692056 T1734 oasc.SolrCore.loadUpdateProcessorChains no updateRequestProcessorChain defined as default, creating implicit default
   [junit4]   2> 692057 T1734 oasc.RequestHandlers.initHandlersFromConfig created /update: org.apache.solr.handler.UpdateRequestHandler
   [junit4]   2> 692057 T1734 oasc.RequestHandlers.initHandlersFromConfig created /update/json: org.apache.solr.handler.UpdateRequestHandler
   [junit4]   2> 692057 T1734 oasc.RequestHandlers.initHandlersFromConfig created /update/csv: org.apache.solr.handler.UpdateRequestHandler
   [junit4]   2> 692057 T1734 oasc.RequestHandlers.initHandlersFromConfig created /update/json/docs: org.apache.solr.handler.UpdateRequestHandler
   [junit4]   2> 692058 T1734 oasc.RequestHandlers.initHandlersFromConfig created /config: org.apache.solr.handler.SolrConfigHandler
   [junit4]   2> 692058 T1734 oasc.RequestHandlers.initHandlersFromConfig created /replication: org.apache.solr.handler.ReplicationHandler
   [junit4]   2> 692058 T1734 oasc.RequestHandlers.initHandlersFromConfig created /get: org.apache.solr.handler.RealTimeGetHandler
   [junit4]   2> 692059 T1734 oasc.RequestHandlers.initHandlersFromConfig created /admin/luke: org.apache.solr.handler.admin.LukeRequestHandler
   [junit4]   2> 692059 T1734 oasc.RequestHandlers.initHandlersFromConfig created /admin/system: org.apache.solr.handler.admin.SystemInfoHandler
   [junit4]   2> 692059 T1734 oasc.RequestHandlers.initHandlersFromConfig created /admin/mbeans: org.apache.solr.handler.admin.SolrInfoMBeanHandler
   [junit4]   2> 692060 T1734 oasc.RequestHandlers.initHandlersFromConfig created /admin/plugins: org.apache.solr.handler.admin.PluginInfoHandler
   [junit4]   2> 692060 T1734 oasc.RequestHandlers.initHandlersFromConfig created /admin/threads: org.apache.solr.handler.admin.ThreadDumpHandler
   [junit4]   2> 692060 T1734 oasc.RequestHandlers.initHandlersFromConfig created /admin/properties: org.apache.solr.handler.admin.PropertiesRequestHandler
   [junit4]   2> 692060 T1734 oasc.RequestHandlers.initHandlersFromConfig created /admin/logging: org.apache.solr.handler.admin.LoggingHandler
   [junit4]   2> 692061 T1734 oasc.RequestHandlers.initHandlersFromConfig created /admin/ping: org.apache.solr.handler.PingRequestHandler
   [junit4]   2> 692061 T1734 oasc.RequestHandlers.initHandlersFromConfig created standard: solr.StandardRequestHandler
   [junit4]   2> 692061 T1734 oasc.RequestHandlers.initHandlersFromConfig created dismax: solr.SearchHandler
   [junit4]   2> 692062 T1734 oasc.RequestHandlers.initHandlersFromConfig created mock: org.apache.solr.core.MockQuerySenderListenerReqHandler
   [junit4]   2> 692062 T1734 oasc.RequestHandlers.initHandlersFromConfig created /admin/file: solr.admin.ShowFileRequestHandler
   [junit4]   2> 692062 T1734 oasc.RequestHandlers.initHandlersFromConfig created /admin/fileedit: solr.admin.EditFileRequestHandler
   [junit4]   2> 692063 T1734 oasc.RequestHandlers.initHandlersFromConfig created defaults: solr.StandardRequestHandler
   [junit4]   2> 692063 T1734 oasc.RequestHandlers.initHandlersFromConfig adding lazy requestHandler: solr.StandardRequestHandler
   [junit4]   2> 692063 T1734 oasc.RequestHandlers.initHandlersFromConfig created lazy: solr.StandardRequestHandler
   [junit4]   2> 692063 T1734 oasc.RequestHandlers.initHandlersFromConfig created /terms: org.apache.solr.handler.component.SearchHandler
   [junit4]   2> 692064 T1734 oasc.RequestHandlers.initHandlersFromConfig created spellCheckCompRH: org.apache.solr.handler.component.SearchHandler
   [junit4]   2> 692064 T1734 oasc.RequestHandlers.initHandlersFromConfig created spellCheckCompRH_Direct: org.apache.solr.handler.component.SearchHandler
   [junit4]   2> 692064 T1734 oasc.RequestHandlers.initHandlersFromConfig created spellCheckWithWordbreak: org.apache.solr.handler.component.SearchHandler
   [junit4]   2> 692065 T1734 oasc.RequestHandlers.initHandlersFromConfig created spellCheckWithWordbreak_Direct: org.apache.solr.handler.component.SearchHandler
   [junit4]   2> 692065 T1734 oasc.RequestHandlers.initHandlersFromConfig created spellCheckCompRH1: org.apache.solr.handler.component.SearchHandler
   [junit4]   2> 692065 T1734 oasc.RequestHandlers.initHandlersFromConfig created mltrh: org.apache.solr.handler.component.SearchHandler
   [junit4]   2> 692065 T1734 oasc.RequestHandlers.initHandlersFromConfig created tvrh: org.apache.solr.handler.component.SearchHandler
   [junit4]   2> 692066 T1734 oasc.RequestHandlers.initHandlersFromConfig created /mlt: solr.MoreLikeThisHandler
   [junit4]   2> 692066 T1734 oasc.RequestHandlers.initHandlersFromConfig created /debug/dump: solr.DumpRequestHandler
   [junit4]   2> 692077 T1734 oashl.XMLLoader.init xsltCacheLifetimeSeconds=60
   [junit4]   2> 692078 T1734 oashl.XMLLoader.init xsltCacheLifetimeSeconds=60
   [junit4]   2> 692079 T1734 oashl.XMLLoader.init xsltCacheLifetimeSeconds=60
   [junit4]   2> 692086 T1734 oashl.XMLLoader.init xsltCacheLifetimeSeconds=60
   [junit4]   2> 692087 T1734 oasc.SolrCore.initDeprecatedSupport WARN solrconfig.xml uses deprecated <admin/gettableFiles>, Please update your config to use the ShowFileRequestHandler.
   [junit4]   2> 692094 T1734 oasu.CommitTracker.<init> Hard AutoCommit: disabled
   [junit4]   2> 692094 T1734 oasu.CommitTracker.<init> Soft AutoCommit: disabled
   [junit4]   2> 692095 T1734 oasu.RandomMergePolicy.<init> RandomMergePolicy wrapping class org.apache.lucene.index.AlcoholicMergePolicy: [AlcoholicMergePolicy: minMergeSize=0, mergeFactor=10, maxMergeSize=1209254500, maxMergeSizeForForcedMerge=9223372036854775807, calibrateSizeByDeletes=true, maxMergeDocs=2147483647, maxCFSSegmentSizeMB=8.796093022207999E12, noCFSRatio=0.1]
   [junit4]   2> 692095 T1734 oasc.SolrDeletionPolicy.onInit SolrDeletionPolicy.onInit: commits: num=1
   [junit4]   2> 		commit{dir=RateLimitedDirectoryWrapper(MockDirectoryWrapper(RAMDirectory@b99933 lockFactory=org.apache.lucene.store.SingleInstanceLockFactory@554eef)),segFN=segments_1,generation=1}
   [junit4]   2> 692096 T1734 oasc.SolrDeletionPolicy.updateCommits newest commit generation = 1
   [junit4]   2> 692096 T1734 oass.SolrIndexSearcher.<init> Opening Searcher@120708f[collection1] main
   [junit4]   2> 692096 T1734 oasr.RestManager.init Initializing RestManager with initArgs: {storageIO=org.apache.solr.rest.ManagedResourceStorage$InMemoryStorageIO}
   [junit4]   2> 692097 T1734 oasr.ManagedResourceStorage.load Reading _rest_managed.json using InMemoryStorage
   [junit4]   2> 692097 T1734 oasr.ManagedResource.reloadFromStorage WARN No stored data found for /rest/managed
   [junit4]   2> 692097 T1734 oasr.ManagedResourceStorage$JsonStorage.store Saved JSON object to path _rest_managed.json using InMemoryStorage
   [junit4]   2> 692097 T1734 oasr.RestManager.init Initializing 0 registered ManagedResources
   [junit4]   2> 692097 T1734 oashc.SpellCheckComponent.inform Initializing spell checkers
   [junit4]   2> 692104 T1734 oass.DirectSolrSpellChecker.init init: {name=direct,classname=DirectSolrSpellChecker,field=lowerfilt,minQueryLength=3}
   [junit4]   2> 692125 T1734 oash.ReplicationHandler.inform Commits will be reserved for  10000
   [junit4]   2> 692126 T1735 oasc.SolrCore.registerSearcher [collection1] Registered new searcher Searcher@120708f[collection1] main{ExitableDirectoryReader(UninvertingDirectoryReader())}
   [junit4]   2> 692127 T1734 oasc.CoreContainer.registerCore registering core: collection1
   [junit4]   2> 692129 T1733 oas.SolrTestCaseJ4.initCore ####initCore end
   [junit4]   2> 692140 T1733 oas.SolrTestCaseJ4.setUp ###Starting testMaxChars
   [junit4]   2> ASYNC  NEW_CORE C415 name=collection1 org.apache.solr.core.SolrCore@dd58e
   [junit4]   2> 692142 T1733 C415 oasup.LogUpdateProcessor.finish [collection1] webapp=null path=null params={} {add=[1 (1486030582987096064)]} 0 2
   [junit4]   2> 692145 T1733 C415 oasu.DirectUpdateHandler2.commit start commit{,optimize=false,openSearcher=true,waitSearcher=true,expungeDeletes=false,softCommit=false,prepareCommit=false}
   [junit4]   2> 692151 T1733 C415 oasc.SolrDeletionPolicy.onCommit SolrDeletionPolicy.onCommit: commits: num=2
   [junit4]   2> 		commit{dir=RateLimitedDirectoryWrapper(MockDirectoryWrapper(RAMDirectory@b99933 lockFactory=org.apache.lucene.store.SingleInstanceLockFactory@554eef)),segFN=segments_1,generation=1}
   [junit4]   2> 		commit{dir=RateLimitedDirectoryWrapper(MockDirectoryWrapper(RAMDirectory@b99933 lockFactory=org.apache.lucene.store.SingleInstanceLockFactory@554eef)),segFN=segments_2,generation=2}
   [junit4]   2> 692152 T1733 C415 oasc.SolrDeletionPolicy.updateCommits newest commit generation = 2
   [junit4]   2> 692155 T1733 C415 oass.SolrIndexSearcher.<init> Opening Searcher@f44d1b[collection1] main
   [junit4]   2> 692158 T1735 oasc.SolrCore.registerSearcher [collection1] Registered new searcher Searcher@f44d1b[collection1] main{ExitableDirectoryReader(UninvertingDirectoryReader(Uninverting(_0(5.0.0):c1)))}
   [junit4]   2> 692158 T1733 C415 oasu.DirectUpdateHandler2.commit end_commit_flush
   [junit4]   2> 692159 T1733 C415 oasup.LogUpdateProcessor.finish [collection1] webapp=null path=null params={} {commit=} 0 14
   [junit4]   2> 692160 T1733 C415 oasu.DirectUpdateHandler2.commit start commit{,optimize=true,openSearcher=true,waitSearcher=true,expungeDeletes=false,softCommit=false,prepareCommit=false}
   [junit4]   2> 692165 T1733 C415 oasc.SolrDeletionPolicy.onCommit SolrDeletionPolicy.onCommit: commits: num=2
   [junit4]   2> 		commit{dir=RateLimitedDirectoryWrapper(MockDirectoryWrapper(RAMDirectory@b99933 lockFactory=org.apache.lucene.store.SingleInstanceLockFactory@554eef)),segFN=segments_2,generation=2}
   [junit4]   2> 		commit{dir=RateLimitedDirectoryWrapper(MockDirectoryWrapper(RAMDirectory@b99933 lockFactory=org.apache.lucene.store.SingleInstanceLockFactory@554eef)),segFN=segments_3,generation=3}
   [junit4]   2> 692165 T1733 C415 oasc.SolrDeletionPolicy.updateCommits newest commit generation = 3
   [junit4]   2> 692167 T1733 C415 oass.SolrIndexSearcher.<init> Opening Searcher@1a0612d[collection1] main
   [junit4]   2> 692167 T1733 C415 oasu.DirectUpdateHandler2.commit end_commit_flush
   [junit4]   2> 692169 T1735 oasc.SolrCore.registerSearcher [collection1] Registered new searcher Searcher@1a0612d[collection1] main{ExitableDirectoryReader(UninvertingDirectoryReader(Uninverting(_1(5.0.0):C1)))}
   [junit4]   2> 692169 T1733 C415 oasup.LogUpdateProcessor.finish [collection1] webapp=null path=null params={} {optimize=} 0 10
   [junit4]   2> 692171 T1733 C415 oasc.SolrCore.execute [collection1] webapp=null path=null params={hl.snippets=10&q=t_text:disjoint&qt=standard&hl=true&fl=id+score&start=0&hl.fl=t_text&rows=200} hits=1 status=0 QTime=1 
   [junit4]   2> 692173 T1733 C415 oasc.SolrCore.execute [collection1] webapp=null path=null params={hl.snippets=10&q=t_text:disjoint&qt=standard&hl=true&hl.maxAnalyzedChars=20&fl=id+score&start=0&hl.fl=t_text&rows=200} hits=1 status=0 QTime=0 
   [junit4]   2> 692176 T1733 C415 oasc.SolrCore.execute [collection1] webapp=null path=null params={hl.snippets=10&q=t_text:disjoint&qt=standard&hl=true&hl.maxAnalyzedChars=-1&fl=id+score&start=0&hl.fl=t_text&rows=200} hits=1 status=0 QTime=1 
   [junit4]   2> 692194 T1733 C415 oass.SolrIndexSearcher.<init> Opening Searcher@15d8205[collection1] realtime
   [junit4]   2> 692198 T1733 C415 oasup.LogUpdateProcessor.finish [collection1] webapp=null path=null params={} {deleteByQuery=*:* (-1486030583040573440)} 0 8
   [junit4]   2> 692210 T1733 oas.SolrTestCaseJ4.tearDown ###Ending testMaxChars
   [junit4]   2> 692225 T1733 oas.SolrTestCaseJ4.setUp ###Starting testHlQEdismaxParameter
   [junit4]   2> 692241 T1733 C415 oasup.LogUpdateProcessor.finish [collection1] webapp=null path=null params={} {add=[1 (1486030583077273600)]} 0 15
   [junit4]   2> 692243 T1733 C415 oasu.DirectUpdateHandler2.commit start commit{,optimize=false,openSearcher=true,waitSearcher=true,expungeDeletes=false,softCommit=false,prepareCommit=false}
   [junit4]   2> 692247 T1733 C415 oasc.SolrDeletionPolicy.onCommit SolrDeletionPolicy.onCommit: commits: num=2
   [junit4]   2> 		commit{dir=RateLimitedDirectoryWrapper(MockDirectoryWrapper(RAMDirectory@b99933 lockFactory=org.apache.lucene.store.SingleInstanceLockFactory@554eef)),segFN=segments_3,generation=3}
   [junit4]   2> 		commit{dir=RateLimitedDirectoryWrapper(MockDirectoryWrapper(RAMDirectory@b99933 lockFactory=org.apache.lucene.store.SingleInstanceLockFactory@554eef)),segFN=segments_4,generation=4}
   [junit4]   2> 692248 T1733 C415 oasc.SolrDeletionPolicy.updateCommits newest commit generation = 4
   [junit4]   2> 692249 T1733 C415 oass.SolrIndexSearcher.<init> Opening Searcher@be61ce[collection1] main
   [junit4]   2> 692250 T1733 C415 oasu.DirectUpdateHandler2.commit end_commit_flush
   [junit4]   2> 692251 T1735 oasc.SolrCore.registerSearcher [collection1] Registered new searcher Searcher@be61ce[collection1] main{ExitableDirectoryReader(UninvertingDirectoryReader(Uninverting(_2(5.0.0):c1)))}
   [junit4]   2> 692252 T1733 C415 oasup.LogUpdateProcessor.finish [collection1] webapp=null path=null params={} {commit=} 0 10
   [junit4]   2> 692430 T1733 C415 oasc.SolrCore.execute [collection1] webapp=null path=null params={q=title:Apache&hl=true&hl.q={!edismax+qf%3Dtitle+v%3DSoftware}&hl.fl=title&wt=xml} hits=1 status=0 QTime=177 
   [junit4]   2> 692453 T1733 C415 oasc.SolrCore.execute [collection1] webapp=null path=null params={qq=title:Foundation&q=title:Apache&hl=true&hl.q={!v%3D$qq}&hl.fl=title&wt=xml} hits=1 status=0 QTime=21 
   [junit4]   2> 692455 T1733 C415 oass.SolrIndexSearcher.<init> Opening Searcher@ffeeff[collection1] realtime
   [junit4]   2> 692456 T1733 C415 oasup.LogUpdateProcessor.finish [collection1] webapp=null path=null params={} {deleteByQuery=*:* (-1486030583316348928)} 0 2
   [junit4]   2> 692461 T1733 oas.SolrTestCaseJ4.tearDown ###Ending testHlQEdismaxParameter
   [junit4]   2> 692474 T1733 oas.SolrTestCaseJ4.setUp ###Starting testAlternateSummary
   [junit4]   2> 692955 T1733 C415 oasup.LogUpdateProcessor.finish [collection1] webapp=null path=null params={} {add=[1 (1486030583337320448)]} 0 481
   [junit4]   2> 692958 T1733 C415 oasu.DirectUpdateHandler2.commit start commit{,optimize=false,openSearcher=true,waitSearcher=true,expungeDeletes=false,softCommit=false,prepareCommit=false}
   [junit4]   2> 692992 T1733 C415 oasc.SolrDeletionPolicy.onCommit SolrDeletionPolicy.onCommit: commits: num=2
   [junit4]   2> 		commit{dir=RateLimitedDirectoryWrapper(MockDirectoryWrapper(RAMDirectory@b99933 lockFactory=org.apache.lucene.store.SingleInstanceLockFactory@554eef)),segFN=segments_4,generation=4}
   [junit4]   2> 		commit{dir=RateLimitedDirectoryWrapper(MockDirectoryWrapper(RAMDirectory@b99933 lockFactory=org.apache.lucene.store.SingleInstanceLockFactory@554eef)),segFN=segments_5,generation=5}
   [junit4]   2> 692993 T1733 C415 oasc.SolrDeletionPolicy.updateCommits newest commit generation = 5
   [junit4]   2> 693046 T1733 C415 oass.SolrIndexSearcher.<init> Opening Searcher@c852fe[collection1] main
   [junit4]   2> 693047 T1733 C415 oasu.DirectUpdateHandler2.commit end_commit_flush
   [junit4]   2> 693050 T1735 oasc.SolrCore.registerSearcher [collection1] Registered new searcher Searcher@c852fe[collection1] main{ExitableDirectoryReader(UninvertingDirectoryReader(Uninverting(_3(5.0.0):c1)))}
   [junit4]   2> 693051 T1733 C415 oasup.LogUpdateProcessor.finish [collection1] webapp=null path=null params={} {commit=} 0 94
   [junit4]   2> 693052 T1733 C415 oasu.DirectUpdateHandler2.commit start commit{,optimize=true,openSearcher=true,waitSearcher=true,expungeDeletes=false,softCommit=false,prepareCommit=false}
   [junit4]   2> 693080 T1733 C415 oasc.SolrDeletionPolicy.onCommit SolrDeletionPolicy.onCommit: commits: num=2
   [junit4]   2> 		commit{dir=RateLimitedDirectoryWrapper(MockDirectoryWrapper(RAMDirectory@b99933 lockFactory=org.apache.lucene.store.SingleInstanceLockFactory@554eef)),segFN=segments_5,generation=5}
   [junit4]   2> 		commit{dir=RateLimitedDirectoryWrapper(MockDirectoryWrapper(RAMDirectory@b99933 lockFactory=org.apache.lucene.store.SingleInstanceLockFactory@554eef)),segFN=segments_6,generation=6}
   [junit4]   2> 693081 T1733 C415 oasc.SolrDeletionPolicy.updateCommits newest commit generation = 6
   [junit4]   2> 693084 T1733 C415 oass.SolrIndexSearcher.<init> Opening Searcher@11e6863[collection1] main
   [junit4]   2> 693087 T1735 oasc.SolrCore.registerSearcher [collection1] Registered new searcher Searcher@11e6863[collection1] main{ExitableDirectoryReader(UninvertingDirectoryReader(Uninverting(_4(5.0.0):C1)))}
   [junit4]   2> 693088 T1733 C415 oasu.DirectUpdateHandler2.commit end_commit_flush
   [junit4]   2> 693089 T1733 C415 oasup.LogUpdateProcessor.finish [collection1] webapp=null path=null params={} {optimize=} 0 37
   [junit4]   2> 693093 T1733 C415 oasc.SolrCore.execute [collection1] webapp=null path=null params={q=tv_text:keyword&qt=standard&hl=true&hl.fragsize=0&start=0&hl.fl=t_text&rows=200} hits=1 status=0 QTime=3 
   [junit4]   2> 693096 T1733 C415 oasc.SolrCore.execute [collection1] webapp=null path=null params={q=tv_text:keyword&hl.alternateField=foo_t&qt=standard&hl=true&hl.fragsize=0&start=0&hl.fl=t_text&rows=200} hits=1 status=0 QTime=1 
   [junit4]   2> 693098 T1733 C415 oasc.SolrCore.execute [collection1] webapp=null path=null params={q=tv_text:keyword&hl.alternateField=t_text&qt=standard&hl=true&hl.fragsize=0&start=0&hl.fl=t_text&hl.maxAlternateFieldLength=15&rows=200} hits=1 status=0 QTime=0 
   [junit4]   2> 693100 T1733 C415 oasc.SolrCore.execute [collection1] webapp=null path=null params={q=tv_text:keyword&hl.alternateField=NonExistingField&qt=standard&hl=true&hl.fragsize=0&start=0&hl.fl=t_text&hl.maxAlternateFieldLength=15&rows=200} hits=1 status=0 QTime=1 
   [junit4]   2> 693102 T1733 C415 oass.SolrIndexSearcher.<init> Opening Searcher@c78066[collection1] realtime
   [junit4]   2> 693103 T1733 C415 oasup.LogUpdateProcessor.finish [collection1] webapp=null path=null params={} {deleteByQuery=*:* (-1486030583994777600)} 0 2
   [junit4]   2> 693103 T1733 oas.SolrTestCaseJ4.tearDown ###Ending testAlternateSummary
   [junit4]   2> 693106 T1733 oas.SolrTestCaseJ4.setUp ###Starting testDefaultFieldPrefixWildcardHighlight
   [junit4]   2> 693107 T1733 C415 oasup.LogUpdateProcessor.finish [collection1] webapp=null path=null params={} {add=[1 (1486030584000020480)]} 0 1
   [junit4]   2> 693107 T1733 C415 oasu.DirectUpdateHandler2.commit start commit{,optimize=false,openSearcher=true,waitSearcher=true,expungeDeletes=false,softCommit=false,prepareCommit=false}
   [junit4]   2> 693109 T1733 C415 oasc.SolrDeletionPolicy.onCommit SolrDeletionPolicy.onCommit: commits: num=2
   [junit4]   2> 		commit{dir=RateLimitedDirectoryWrapper(MockDirectoryWrapper(RAMDirectory@b99933 lockFactory=org.apache.lucene.store.SingleInstanceLockFactory@554eef)),segFN=segments_6,generation=6}
   [junit4]   2> 		commit{dir=RateLimitedDirectoryWrapper(MockDirectoryWrapper(RAMDirectory@b99933 lockFactory=org.apache.lucene.store.SingleInstanceLockFactory@554eef)),segFN=segments_7,generation=7}
   [junit4]   2> 693110 T1733 C415 oasc.SolrDeletionPolicy.updateCommits newest commit generation = 7
   [junit4]   2> 693111 T1733 C415 oass.SolrIndexSearcher.<init> Opening Searcher@10fae05[collection1] main
   [junit4]   2> 693111 T1733 C415 oasu.DirectUpdateHandler2.commit end_commit_flush
   [junit4]   2> 693113 T1735 oasc.SolrCore.registerSearcher [collection1] Registered new searcher Searcher@10fae05[collection1] main{ExitableDirectoryReader(UninvertingDirectoryReader(Uninverting(_5(5.0.0):c1)))}
   [junit4]   2> 693113 T1733 C415 oasup.LogUpdateProcessor.finish [collection1] webapp=null path=null params={} {commit=} 0 6
   [junit4]   2> 693114 T1733 C415 oasu.DirectUpdateHandler2.commit start commit{,optimize=true,openSearcher=true,waitSearcher=true,expungeDeletes=false,softCommit=false,prepareCommit=false}
   [junit4]   2> 693117 T1733 C415 oasc.SolrDeletionPolicy.onCommit SolrDeletionPolicy.onCommit: commits: num=2
   [junit4]   2> 		commit{dir=RateLimitedDirectoryWrapper(MockDirectoryWrapper(RAMDirectory@b99933 lockFactory=org.apache.lucene.store.SingleInstanceLockFactory@554eef)),segFN=segments_7,generation=7}
   [junit4]   2> 		commit{dir=RateLimitedDirectoryWrapper(MockDirectoryWrapper(RAMDirectory@b99933 lockFactory=org.apache.lucene.store.SingleInstanceLockFactory@554eef)),segFN=segments_8,generation=8}
   [junit4]   2> 693117 T1733 C415 oasc.SolrDeletionPolicy.updateCommits newest commit generation = 8
   [junit4]   2> 693119 T1733 C415 oass.SolrIndexSearcher.<init> Opening Searcher@175be6d[collection1] main
   [junit4]   2> 693119 T1733 C415 oasu.DirectUpdateHandler2.commit end_commit_flush
   [junit4]   2> 693120 T1735 oasc.SolrCore.registerSearcher [collection1] Registered new searcher Searcher@175be6d[collection1] main{ExitableDirectoryReader(UninvertingDirectoryReader(Uninverting(_6(5.0.0):C1)))}
   [junit4]   2> 693121 T1733 C415 oasup.LogUpdateProcessor.finish [collection1] webapp=null path=null params={} {optimize=} 0 7
   [junit4]   2> 693123 T1733 C415 oasc.SolrCore.execute [collection1] webapp=null path=null params={q=lon*&df=t_text&qt=standard&hl=true&hl.usePhraseHighlighter=true&start=0&hl.fl=&rows=200&hl.highlightMultiTerm=true} hits=1 status=0 QTime=1 
   [junit4]   2> 693125 T1733 C415 oass.SolrIndexSearcher.<init> Opening Searcher@155eb02[collection1] realtime
   [junit4]   2> 693126 T1733 C415 oasup.LogUpdateProcessor.finish [collection1] webapp=null path=null params={} {deleteByQuery=*:* (-1486030584018894848)} 0 2
   [junit4]   2> 693127 T1733 oas.SolrTestCaseJ4.tearDown ###Ending testDefaultFieldPrefixWildcardHighlight
   [junit4]   2> 693131 T1733 oas.SolrTestCaseJ4.setUp ###Starting testVariableFragsize
   [junit4]   2> 693133 T1733 C415 oasup.LogUpdateProcessor.finish [collection1] webapp=null path=null params={} {add=[1 (1486030584027283456)]} 0 2
   [junit4]   2> 693134 T1733 C415 oasu.DirectUpdateHandler2.commit start commit{,optimize=false,openSearcher=true,waitSearcher=true,expungeDeletes=false,softCommit=false,prepareCommit=false}
   [junit4]   2> 693137 T1733 C415 oasc.SolrDeletionPolicy.onCommit SolrDeletionPolicy.onCommit: commits: num=2
   [junit4]   2> 		commit{dir=RateLimitedDirectoryWrapper(MockDirectoryWrapper(RAMDirectory@b99933 lockFactory=org.apache.lucene.store.SingleInstanceLockFactory@554eef)),segFN=segments_8,generation=8}
   [junit4]   2> 		commit{dir=RateLimitedDirectoryWrapper(MockDirectoryWrapper(RAMDirectory@b99933 lockFactory=org.apache.lucene.store.SingleInstanceLockFactory@554eef)),segFN=segments_9,generation=9}
   [junit4]   2> 693138 T1733 C415 oasc.SolrDeletionPolicy.updateCommits newest commit generation = 9
   [junit4]   2> 693140 T1733 C415 oass.SolrIndexSearcher.<init> Opening Searcher@2414ba[collection1] main
   [junit4]   2> 693140 T1733 C415 oasu.DirectUpdateHandler2.commit end_commit_flush
   [junit4]   2> 693141 T1735 oasc.SolrCore.registerSearcher [collection1] Registered new searcher Searcher@2414ba[collection1] main{ExitableDirectoryReader(UninvertingDirectoryReader(Uninverting(_7(5.0.0):c1)))}
   [junit4]   2> 693142 T1733 C415 oasup.LogUpdateProcessor.finish [collection1] webapp=null path=null params={} {commit=} 0 8
   [junit4]   2> 693143 T1733 C415 oasu.DirectUpdateHandler2.commit start commit{,optimize=true,openSearcher=true,waitSearcher=true,expungeDeletes=false,softCommit=false,prepareCommit=false}
   [junit4]   2> 693146 T1733 C415 oasc.SolrDeletionPolicy.onCommit SolrDeletionPolicy.onCommit: commits: num=2
   [junit4]   2> 		commit{dir=RateLimitedDirectoryWrapper(MockDirectoryWrapper(RAMDirectory@b99933 lockFactory=org.apache.lucene.store.SingleInstanceLockFactory@554eef)),segFN=segments_9,generation=9}
   [junit4]   2> 		commit{dir=RateLimitedDirectoryWrapper(MockDirectoryWrapper(RAMDirectory@b99933 lockFactory=org.apache.lucene.store.SingleInstanceLockFactory@554eef)),segFN=segments_a,generation=10}
   [junit4]   2> 693147 T1733 C415 oasc.SolrDeletionPolicy.updateCommits newest commit generation = 10
   [junit4]   2> 693148 T1733 C415 oass.SolrIndexSearcher.<init> Opening Searcher@109c4b1[collection1] main
   [junit4]   2> 693150 T1735 oasc.SolrCore.registerSearcher [collection1] Registered new searcher Searcher@109c4b1[collection1] main{ExitableDirectoryReader(UninvertingDirectoryReader(Uninverting(_8(5.0.0):C1)))}
   [junit4]   2> 693152 T1733 C415 oasu.DirectUpdateHandler2.commit end_commit_flush
   [junit4]   2> 693152 T1733 C415 oasup.LogUpdateProcessor.finish [collection1] webapp=null path=null params={} {optimize=} 0 9
   [junit4]   2> 693286 T1733 C415 oasc.SolrCore.execute [collection1] webapp=null path=null params={q=tv_text:long&qt=standard&hl=true&start=0&hl.fl=tv_text&rows=200} hits=1 status=0 QTime=133 
   [junit4]   2> 693287 T1733 oas.SolrTestCaseJ4.assertQ ERROR REQUEST FAILED: xpath=//lst[@name='1']/arr[@name='tv_text']/str[.='a <em>long</em> days night this should be a piece of text which']
   [junit4]   2> 		xml response was: <?xml version="1.0" encoding="UTF-8"?>
   [junit4]   2> 	<response>
   [junit4]   2> 	<lst name="responseHeader"><int name="status">0</int><int name="QTime">133</int></lst><result name="response" numFound="1" start="0"><doc><arr name="tv_text"><str>a long days night this should be a piece of text which is is is is is is is is is is is is is is is is is is is is is is is is isis is is is is is is is is is is is is is is is is is is is is is is is is is is is is is is is is is is is is is is is is is is is is is is is is is is is is is is is is is is is is is is is is is is is is is is is is is is sufficiently lengthly to produce multiple fragments which are not concatenated at all</str></arr><int name="id">1</int><arr name="range_facet_l"><long>1</long></arr><long name="_version_">1486030584027283456</long><arr name="multiDefault"><str>muLti-Default</str></arr><int name="intDefault">42</int><date name="timestamp">2014-11-28T15:40:01.38Z</date></doc></result><lst name="highlighting"><lst name="1"/></lst>

[...truncated too long message...]

ceptor.exclusiveUnregisterMBean(DefaultMBeanServerInterceptor.java:430)
   [junit4]   2> 	at com.sun.jmx.interceptor.DefaultMBeanServerInterceptor.unregisterMBean(DefaultMBeanServerInterceptor.java:415)
   [junit4]   2> 	at com.sun.jmx.mbeanserver.JmxMBeanServer.unregisterMBean(JmxMBeanServer.java:546)
   [junit4]   2> 	at org.apache.solr.core.JmxMonitoredMap.clear(JmxMonitoredMap.java:124)
   [junit4]   2> 	at org.apache.solr.core.SolrCore.close(SolrCore.java:1124)
   [junit4]   2> 	at org.apache.solr.core.SolrCores.close(SolrCores.java:117)
   [junit4]   2> 	at org.apache.solr.core.CoreContainer.shutdown(CoreContainer.java:365)
   [junit4]   2> 	at org.apache.solr.util.TestHarness.close(TestHarness.java:337)
   [junit4]   2> 	at org.apache.solr.SolrTestCaseJ4.deleteCore(SolrTestCaseJ4.java:640)
   [junit4]   2> 	at org.apache.solr.SolrTestCaseJ4.afterClass(SolrTestCaseJ4.java:185)
   [junit4]   2> 	at sun.reflect.GeneratedMethodAccessor28.invoke(Unknown Source)
   [junit4]   2> 	at sun.reflect.DelegatingMethodAccessorImpl.invoke(DelegatingMethodAccessorImpl.java:43)
   [junit4]   2> 	at java.lang.reflect.Method.invoke(Method.java:498)
   [junit4]   2> 	at com.carrotsearch.randomizedtesting.RandomizedRunner.invoke(RandomizedRunner.java:1618)
   [junit4]   2> 	at com.carrotsearch.randomizedtesting.RandomizedRunner$5.evaluate(RandomizedRunner.java:790)
   [junit4]   2> 	at com.carrotsearch.randomizedtesting.rules.StatementAdapter.evaluate(StatementAdapter.java:36)
   [junit4]   2> 	at com.carrotsearch.randomizedtesting.rules.SystemPropertiesRestoreRule$1.evaluate(SystemPropertiesRestoreRule.java:53)
   [junit4]   2> 	at org.apache.lucene.util.AbstractBeforeAfterRule$1.evaluate(AbstractBeforeAfterRule.java:46)
   [junit4]   2> 	at org.apache.lucene.util.TestRuleStoreClassName$1.evaluate(TestRuleStoreClassName.java:42)
   [junit4]   2> 	at com.carrotsearch.randomizedtesting.rules.SystemPropertiesInvariantRule$1.evaluate(SystemPropertiesInvariantRule.java:55)
   [junit4]   2> 	at com.carrotsearch.randomizedtesting.rules.NoShadowingOrOverridesOnMethodsRule$1.evaluate(NoShadowingOrOverridesOnMethodsRule.java:39)
   [junit4]   2> 	at com.carrotsearch.randomizedtesting.rules.NoShadowingOrOverridesOnMethodsRule$1.evaluate(NoShadowingOrOverridesOnMethodsRule.java:39)
   [junit4]   2> 	at com.carrotsearch.randomizedtesting.rules.StatementAdapter.evaluate(StatementAdapter.java:36)
   [junit4]   2> 	at com.carrotsearch.randomizedtesting.rules.StatementAdapter.evaluate(StatementAdapter.java:36)
   [junit4]   2> 	at com.carrotsearch.randomizedtesting.rules.StatementAdapter.evaluate(StatementAdapter.java:36)
   [junit4]   2> 	at org.apache.lucene.util.TestRuleAssertionsRequired$1.evaluate(TestRuleAssertionsRequired.java:54)
   [junit4]   2> 	at org.apache.lucene.util.TestRuleMarkFailure$1.evaluate(TestRuleMarkFailure.java:48)
   [junit4]   2> 	at org.apache.lucene.util.TestRuleIgnoreAfterMaxFailures$1.evaluate(TestRuleIgnoreAfterMaxFailures.java:65)
   [junit4]   2> 	at org.apache.lucene.util.TestRuleIgnoreTestSuites$1.evaluate(TestRuleIgnoreTestSuites.java:55)
   [junit4]   2> 	at com.carrotsearch.randomizedtesting.rules.StatementAdapter.evaluate(StatementAdapter.java:36)
   [junit4]   2> 	at com.carrotsearch.randomizedtesting.ThreadLeakControl$StatementRunner.run(ThreadLeakControl.java:365)
   [junit4]   2> 	at java.lang.Thread.run(Thread.java:745)
   [junit4]   2> 
   [junit4]   2> 694920 T1733 oasc.CachingDirectoryFactory.close Closing MockDirectoryFactory - 2 directories currently being tracked
   [junit4]   2> 694920 T1733 oasc.CachingDirectoryFactory.closeCacheValue looking to close /mnt/ssd/jenkins/workspace/Lucene-Solr-5.x-Linux/solr/build/solr-core/test/J0/temp/solr.highlight.HighlighterTest-49ED0023EC0905BB-001/init-core-data-001/index [CachedDir<<refCount=0;path=/mnt/ssd/jenkins/workspace/Lucene-Solr-5.x-Linux/solr/build/solr-core/test/J0/temp/solr.highlight.HighlighterTest-49ED0023EC0905BB-001/init-core-data-001/index;done=false>>]
   [junit4]   2> 694921 T1733 oasc.CachingDirectoryFactory.close Closing directory: /mnt/ssd/jenkins/workspace/Lucene-Solr-5.x-Linux/solr/build/solr-core/test/J0/temp/solr.highlight.HighlighterTest-49ED0023EC0905BB-001/init-core-data-001/index
   [junit4]   2> 694921 T1733 oasc.CachingDirectoryFactory.closeCacheValue looking to close /mnt/ssd/jenkins/workspace/Lucene-Solr-5.x-Linux/solr/build/solr-core/test/J0/temp/solr.highlight.HighlighterTest-49ED0023EC0905BB-001/init-core-data-001 [CachedDir<<refCount=0;path=/mnt/ssd/jenkins/workspace/Lucene-Solr-5.x-Linux/solr/build/solr-core/test/J0/temp/solr.highlight.HighlighterTest-49ED0023EC0905BB-001/init-core-data-001;done=false>>]
   [junit4]   2> 694921 T1733 oasc.CachingDirectoryFactory.close Closing directory: /mnt/ssd/jenkins/workspace/Lucene-Solr-5.x-Linux/solr/build/solr-core/test/J0/temp/solr.highlight.HighlighterTest-49ED0023EC0905BB-001/init-core-data-001
   [junit4]   2> NOTE: leaving temporary files on disk at: /mnt/ssd/jenkins/workspace/Lucene-Solr-5.x-Linux/solr/build/solr-core/test/J0/temp/solr.highlight.HighlighterTest-49ED0023EC0905BB-001
   [junit4]   2> NOTE: test params are: codec=Asserting(Lucene50): {subword_offsets=FST50, multiDefault=PostingsFormat(name=Direct), intDefault=TestBloomFilteredLucenePostings(BloomFilteringPostingsFormat(Lucene50(blocksize=128))), title=PostingsFormat(name=Direct), tv_no_off_text=TestBloomFilteredLucenePostings(BloomFilteringPostingsFormat(Lucene50(blocksize=128))), range_facet_l=TestBloomFilteredLucenePostings(BloomFilteringPostingsFormat(Lucene50(blocksize=128))), foo_sI=FST50, tv_text=TestBloomFilteredLucenePostings(BloomFilteringPostingsFormat(Lucene50(blocksize=128))), cat=TestBloomFilteredLucenePostings(BloomFilteringPostingsFormat(Lucene50(blocksize=128))), t_text1=PostingsFormat(name=Memory doPackFST= true), id=PostingsFormat(name=Memory doPackFST= true), text=FST50, t_text2=TestBloomFilteredLucenePostings(BloomFilteringPostingsFormat(Lucene50(blocksize=128))), timestamp=TestBloomFilteredLucenePostings(BloomFilteringPostingsFormat(Lucene50(blocksize=128))), weight=PostingsFormat(name=Direct), foo_t=PostingsFormat(name=Memory doPackFST= true), foo_s=TestBloomFilteredLucenePostings(BloomFilteringPostingsFormat(Lucene50(blocksize=128))), title_lettertok=PostingsFormat(name=Memory doPackFST= true), tv_mv_text=TestBloomFilteredLucenePostings(BloomFilteringPostingsFormat(Lucene50(blocksize=128))), title_stringNoNorms=TestBloomFilteredLucenePostings(BloomFilteringPostingsFormat(Lucene50(blocksize=128))), textgap=PostingsFormat(name=Memory doPackFST= true), _version_=TestBloomFilteredLucenePostings(BloomFilteringPostingsFormat(Lucene50(blocksize=128))), title_stemmed=PostingsFormat(name=Direct), subword=TestBloomFilteredLucenePostings(BloomFilteringPostingsFormat(Lucene50(blocksize=128))), t_text=PostingsFormat(name=Direct)}, docValues:{timestamp=DocValuesFormat(name=Lucene50)}, sim=RandomSimilarityProvider(queryNorm=false,coord=no): {}, locale=de_LU, timezone=PLT
   [junit4]   2> NOTE: Linux 3.13.0-39-generic i386/Oracle Corporation 1.9.0-ea (32-bit)/cpus=8,threads=1,free=372478424,total=536870912
   [junit4]   2> NOTE: All tests run in this JVM: [XsltUpdateRequestHandlerTest, TestStressReorder, EchoParamsTest, TestStressVersions, TestSolrJ, TestRemoteStreaming, TestSolrConfigHandler, ExternalFileFieldSortTest, TestWordDelimiterFilterFactory, PeerSyncTest, CursorPagingTest, ReturnFieldsTest, BlockCacheTest, RequiredFieldsTest, BasicDistributedZkTest, TestDynamicFieldCollectionResource, DisMaxRequestHandlerTest, TestCollationFieldDocValues, TestHashPartitioner, FieldMutatingUpdateProcessorTest, ShowFileRequestHandlerTest, TestInitQParser, UUIDUpdateProcessorFallbackTest, TestNonDefinedSimilarityFactory, HdfsBasicDistributedZk2Test, TestJmxIntegration, SuggesterWFSTTest, UnloadDistributedZkTest, PathHierarchyTokenizerFactoryTest, TestUniqueKeyFieldResource, SimpleCollectionCreateDeleteTest, TestSolrConfigHandlerConcurrent, TestComplexPhraseQParserPlugin, DocumentAnalysisRequestHandlerTest, BadCopyFieldTest, TestFastWriter, TestSurroundQueryParser, TestPartialUpdateDeduplication, SuggesterTest, DistributedFacetPivotLongTailTest, StatelessScriptUpdateProcessorFactoryTest, MinimalSchemaTest, DateRangeFieldTest, TestRestManager, ExitableDirectoryReaderTest, BlockDirectoryTest, SolrCmdDistributorTest, TestLuceneMatchVersion, MBeansHandlerTest, ConnectionManagerTest, DistributedFacetPivotWhiteBoxTest, DistributedSpellCheckComponentTest, HighlighterTest]
   [junit4] Completed on J0 in 4.47s, 31 tests, 9 errors <<< FAILURES!

[...truncated 1073 lines...]
BUILD FAILED
/mnt/ssd/jenkins/workspace/Lucene-Solr-5.x-Linux/build.xml:525: The following error occurred while executing this line:
/mnt/ssd/jenkins/workspace/Lucene-Solr-5.x-Linux/build.xml:473: The following error occurred while executing this line:
/mnt/ssd/jenkins/workspace/Lucene-Solr-5.x-Linux/build.xml:61: The following error occurred while executing this line:
/mnt/ssd/jenkins/workspace/Lucene-Solr-5.x-Linux/extra-targets.xml:39: The following error occurred while executing this line:
/mnt/ssd/jenkins/workspace/Lucene-Solr-5.x-Linux/solr/build.xml:189: The following error occurred while executing this line:
/mnt/ssd/jenkins/workspace/Lucene-Solr-5.x-Linux/solr/common-build.xml:508: The following error occurred while executing this line:
/mnt/ssd/jenkins/workspace/Lucene-Solr-5.x-Linux/lucene/common-build.xml:1363: The following error occurred while executing this line:
/mnt/ssd/jenkins/workspace/Lucene-Solr-5.x-Linux/lucene/common-build.xml:970: There were test failures: 450 suites, 1841 tests, 9 errors, 31 ignored (22 assumptions)

Total time: 106 minutes 2 seconds
Build step 'Invoke Ant' marked build as failure
[description-setter] Description set: Java: 32bit/jdk1.9.0-ea-b34 -server -XX:+UseG1GC (asserts: false)
Archiving artifacts
Recording test results
Email was triggered for: Failure - Any
Sending email for trigger: Failure - Any



Mime
View raw message