lucene-dev mailing list archives

Site index · List index
Message view « Date » · « Thread »
Top « Date » · « Thread »
From Apache Jenkins Server <jenk...@builds.apache.org>
Subject [JENKINS] Lucene-Solr-NightlyTests-5.x - Build # 665 - Still Failing
Date Sun, 02 Nov 2014 17:09:37 GMT
Build: https://builds.apache.org/job/Lucene-Solr-NightlyTests-5.x/665/

1 tests failed.
REGRESSION:  org.apache.solr.cloud.CollectionsAPIDistributedZkTest.testDistribSearch

Error Message:
Error CREATEing SolrCore 'halfcollection_shard1_replica1': Unable to create core [halfcollection_shard1_replica1] Caused by: Could not get shard id for core: halfcollection_shard1_replica1

Stack Trace:
org.apache.solr.client.solrj.impl.HttpSolrServer$RemoteSolrException: Error CREATEing SolrCore 'halfcollection_shard1_replica1': Unable to create core [halfcollection_shard1_replica1] Caused by: Could not get shard id for core: halfcollection_shard1_replica1
	at __randomizedtesting.SeedInfo.seed([6CFAFC4E7B581D4D:ED1C72560C077D71]:0)
	at org.apache.solr.client.solrj.impl.HttpSolrServer.executeMethod(HttpSolrServer.java:569)
	at org.apache.solr.client.solrj.impl.HttpSolrServer.request(HttpSolrServer.java:215)
	at org.apache.solr.client.solrj.impl.HttpSolrServer.request(HttpSolrServer.java:211)
	at org.apache.solr.cloud.CollectionsAPIDistributedZkTest.testErrorHandling(CollectionsAPIDistributedZkTest.java:583)
	at org.apache.solr.cloud.CollectionsAPIDistributedZkTest.doTest(CollectionsAPIDistributedZkTest.java:205)
	at org.apache.solr.BaseDistributedSearchTestCase.testDistribSearch(BaseDistributedSearchTestCase.java:869)
	at sun.reflect.NativeMethodAccessorImpl.invoke0(Native Method)
	at sun.reflect.NativeMethodAccessorImpl.invoke(NativeMethodAccessorImpl.java:57)
	at sun.reflect.DelegatingMethodAccessorImpl.invoke(DelegatingMethodAccessorImpl.java:43)
	at java.lang.reflect.Method.invoke(Method.java:606)
	at com.carrotsearch.randomizedtesting.RandomizedRunner.invoke(RandomizedRunner.java:1618)
	at com.carrotsearch.randomizedtesting.RandomizedRunner$6.evaluate(RandomizedRunner.java:827)
	at com.carrotsearch.randomizedtesting.RandomizedRunner$7.evaluate(RandomizedRunner.java:863)
	at com.carrotsearch.randomizedtesting.RandomizedRunner$8.evaluate(RandomizedRunner.java:877)
	at com.carrotsearch.randomizedtesting.rules.SystemPropertiesRestoreRule$1.evaluate(SystemPropertiesRestoreRule.java:53)
	at org.apache.lucene.util.TestRuleSetupTeardownChained$1.evaluate(TestRuleSetupTeardownChained.java:50)
	at org.apache.lucene.util.AbstractBeforeAfterRule$1.evaluate(AbstractBeforeAfterRule.java:46)
	at com.carrotsearch.randomizedtesting.rules.SystemPropertiesInvariantRule$1.evaluate(SystemPropertiesInvariantRule.java:55)
	at org.apache.lucene.util.TestRuleThreadAndTestName$1.evaluate(TestRuleThreadAndTestName.java:49)
	at org.apache.lucene.util.TestRuleIgnoreAfterMaxFailures$1.evaluate(TestRuleIgnoreAfterMaxFailures.java:65)
	at org.apache.lucene.util.TestRuleMarkFailure$1.evaluate(TestRuleMarkFailure.java:48)
	at com.carrotsearch.randomizedtesting.rules.StatementAdapter.evaluate(StatementAdapter.java:36)
	at com.carrotsearch.randomizedtesting.ThreadLeakControl$StatementRunner.run(ThreadLeakControl.java:365)
	at com.carrotsearch.randomizedtesting.ThreadLeakControl.forkTimeoutingTask(ThreadLeakControl.java:798)
	at com.carrotsearch.randomizedtesting.ThreadLeakControl$3.evaluate(ThreadLeakControl.java:458)
	at com.carrotsearch.randomizedtesting.RandomizedRunner.runSingleTest(RandomizedRunner.java:836)
	at com.carrotsearch.randomizedtesting.RandomizedRunner$3.evaluate(RandomizedRunner.java:738)
	at com.carrotsearch.randomizedtesting.RandomizedRunner$4.evaluate(RandomizedRunner.java:772)
	at com.carrotsearch.randomizedtesting.RandomizedRunner$5.evaluate(RandomizedRunner.java:783)
	at com.carrotsearch.randomizedtesting.rules.StatementAdapter.evaluate(StatementAdapter.java:36)
	at com.carrotsearch.randomizedtesting.rules.SystemPropertiesRestoreRule$1.evaluate(SystemPropertiesRestoreRule.java:53)
	at org.apache.lucene.util.AbstractBeforeAfterRule$1.evaluate(AbstractBeforeAfterRule.java:46)
	at org.apache.lucene.util.TestRuleStoreClassName$1.evaluate(TestRuleStoreClassName.java:42)
	at com.carrotsearch.randomizedtesting.rules.SystemPropertiesInvariantRule$1.evaluate(SystemPropertiesInvariantRule.java:55)
	at com.carrotsearch.randomizedtesting.rules.NoShadowingOrOverridesOnMethodsRule$1.evaluate(NoShadowingOrOverridesOnMethodsRule.java:39)
	at com.carrotsearch.randomizedtesting.rules.NoShadowingOrOverridesOnMethodsRule$1.evaluate(NoShadowingOrOverridesOnMethodsRule.java:39)
	at com.carrotsearch.randomizedtesting.rules.StatementAdapter.evaluate(StatementAdapter.java:36)
	at com.carrotsearch.randomizedtesting.rules.StatementAdapter.evaluate(StatementAdapter.java:36)
	at com.carrotsearch.randomizedtesting.rules.StatementAdapter.evaluate(StatementAdapter.java:36)
	at org.apache.lucene.util.TestRuleAssertionsRequired$1.evaluate(TestRuleAssertionsRequired.java:54)
	at org.apache.lucene.util.TestRuleMarkFailure$1.evaluate(TestRuleMarkFailure.java:48)
	at org.apache.lucene.util.TestRuleIgnoreAfterMaxFailures$1.evaluate(TestRuleIgnoreAfterMaxFailures.java:65)
	at org.apache.lucene.util.TestRuleIgnoreTestSuites$1.evaluate(TestRuleIgnoreTestSuites.java:55)
	at com.carrotsearch.randomizedtesting.rules.StatementAdapter.evaluate(StatementAdapter.java:36)
	at com.carrotsearch.randomizedtesting.ThreadLeakControl$StatementRunner.run(ThreadLeakControl.java:365)
	at java.lang.Thread.run(Thread.java:745)




Build Log:
[...truncated 13112 lines...]
   [junit4] Suite: org.apache.solr.cloud.CollectionsAPIDistributedZkTest
   [junit4]   2> Creating dataDir: /usr/home/jenkins/jenkins-slave/workspace/Lucene-Solr-NightlyTests-5.x/solr/build/solr-core/test/J3/temp/solr.cloud.CollectionsAPIDistributedZkTest-6CFAFC4E7B581D4D-001/init-core-data-001
   [junit4]   2> 2581891 T7843 oas.SolrTestCaseJ4.buildSSLConfig Randomized ssl (true) and clientAuth (false)
   [junit4]   2> 2581892 T7843 oas.BaseDistributedSearchTestCase.initHostContext Setting hostContext system property: /
   [junit4]   2> 2581897 T7843 oas.SolrTestCaseJ4.setUp ###Starting testDistribSearch
   [junit4]   2> 2581898 T7843 oasc.ZkTestServer.run STARTING ZK TEST SERVER
   [junit4]   1> client port:0.0.0.0/0.0.0.0:0
   [junit4]   2> 2581899 T7844 oasc.ZkTestServer$ZKServerMain.runFromConfig Starting server
   [junit4]   2> 2581999 T7843 oasc.ZkTestServer.run start zk server on port:31689
   [junit4]   2> 2582000 T7843 oascc.SolrZkClient.createZkCredentialsToAddAutomatically Using default ZkCredentialsProvider
   [junit4]   2> 2582000 T7843 oascc.ConnectionManager.waitForConnected Waiting for client to connect to ZooKeeper
   [junit4]   2> 2582003 T7850 oascc.ConnectionManager.process Watcher org.apache.solr.common.cloud.ConnectionManager@40ea041d name:ZooKeeperConnection Watcher:127.0.0.1:31689 got event WatchedEvent state:SyncConnected type:None path:null path:null type:None
   [junit4]   2> 2582004 T7843 oascc.ConnectionManager.waitForConnected Client is connected to ZooKeeper
   [junit4]   2> 2582004 T7843 oascc.SolrZkClient.createZkACLProvider Using default ZkACLProvider
   [junit4]   2> 2582004 T7843 oascc.SolrZkClient.makePath makePath: /solr
   [junit4]   2> 2582006 T7843 oascc.SolrZkClient.createZkCredentialsToAddAutomatically Using default ZkCredentialsProvider
   [junit4]   2> 2582008 T7843 oascc.ConnectionManager.waitForConnected Waiting for client to connect to ZooKeeper
   [junit4]   2> 2582008 T7852 oascc.ConnectionManager.process Watcher org.apache.solr.common.cloud.ConnectionManager@3296f5b1 name:ZooKeeperConnection Watcher:127.0.0.1:31689/solr got event WatchedEvent state:SyncConnected type:None path:null path:null type:None
   [junit4]   2> 2582009 T7843 oascc.ConnectionManager.waitForConnected Client is connected to ZooKeeper
   [junit4]   2> 2582009 T7843 oascc.SolrZkClient.createZkACLProvider Using default ZkACLProvider
   [junit4]   2> 2582009 T7843 oascc.SolrZkClient.makePath makePath: /collections/collection1
   [junit4]   2> 2582011 T7843 oascc.SolrZkClient.makePath makePath: /collections/collection1/shards
   [junit4]   2> 2582012 T7843 oascc.SolrZkClient.makePath makePath: /collections/control_collection
   [junit4]   2> 2582013 T7843 oascc.SolrZkClient.makePath makePath: /collections/control_collection/shards
   [junit4]   2> 2582015 T7843 oasc.AbstractZkTestCase.putConfig put /usr/home/jenkins/jenkins-slave/workspace/Lucene-Solr-NightlyTests-5.x/solr/core/src/test-files/solr/collection1/conf/solrconfig-tlog.xml to /configs/conf1/solrconfig.xml
   [junit4]   2> 2582016 T7843 oascc.SolrZkClient.makePath makePath: /configs/conf1/solrconfig.xml
   [junit4]   2> 2582018 T7843 oasc.AbstractZkTestCase.putConfig put /usr/home/jenkins/jenkins-slave/workspace/Lucene-Solr-NightlyTests-5.x/solr/core/src/test-files/solr/collection1/conf/schema.xml to /configs/conf1/schema.xml
   [junit4]   2> 2582019 T7843 oascc.SolrZkClient.makePath makePath: /configs/conf1/schema.xml
   [junit4]   2> 2582120 T7843 oasc.AbstractZkTestCase.putConfig put /usr/home/jenkins/jenkins-slave/workspace/Lucene-Solr-NightlyTests-5.x/solr/core/src/test-files/solr/collection1/conf/solrconfig.snippet.randomindexconfig.xml to /configs/conf1/solrconfig.snippet.randomindexconfig.xml
   [junit4]   2> 2582121 T7843 oascc.SolrZkClient.makePath makePath: /configs/conf1/solrconfig.snippet.randomindexconfig.xml
   [junit4]   2> 2582123 T7843 oasc.AbstractZkTestCase.putConfig put /usr/home/jenkins/jenkins-slave/workspace/Lucene-Solr-NightlyTests-5.x/solr/core/src/test-files/solr/collection1/conf/stopwords.txt to /configs/conf1/stopwords.txt
   [junit4]   2> 2582124 T7843 oascc.SolrZkClient.makePath makePath: /configs/conf1/stopwords.txt
   [junit4]   2> 2582125 T7843 oasc.AbstractZkTestCase.putConfig put /usr/home/jenkins/jenkins-slave/workspace/Lucene-Solr-NightlyTests-5.x/solr/core/src/test-files/solr/collection1/conf/protwords.txt to /configs/conf1/protwords.txt
   [junit4]   2> 2582126 T7843 oascc.SolrZkClient.makePath makePath: /configs/conf1/protwords.txt
   [junit4]   2> 2582128 T7843 oasc.AbstractZkTestCase.putConfig put /usr/home/jenkins/jenkins-slave/workspace/Lucene-Solr-NightlyTests-5.x/solr/core/src/test-files/solr/collection1/conf/currency.xml to /configs/conf1/currency.xml
   [junit4]   2> 2582128 T7843 oascc.SolrZkClient.makePath makePath: /configs/conf1/currency.xml
   [junit4]   2> 2582130 T7843 oasc.AbstractZkTestCase.putConfig put /usr/home/jenkins/jenkins-slave/workspace/Lucene-Solr-NightlyTests-5.x/solr/core/src/test-files/solr/collection1/conf/enumsConfig.xml to /configs/conf1/enumsConfig.xml
   [junit4]   2> 2582131 T7843 oascc.SolrZkClient.makePath makePath: /configs/conf1/enumsConfig.xml
   [junit4]   2> 2582132 T7843 oasc.AbstractZkTestCase.putConfig put /usr/home/jenkins/jenkins-slave/workspace/Lucene-Solr-NightlyTests-5.x/solr/core/src/test-files/solr/collection1/conf/open-exchange-rates.json to /configs/conf1/open-exchange-rates.json
   [junit4]   2> 2582133 T7843 oascc.SolrZkClient.makePath makePath: /configs/conf1/open-exchange-rates.json
   [junit4]   2> 2582134 T7843 oasc.AbstractZkTestCase.putConfig put /usr/home/jenkins/jenkins-slave/workspace/Lucene-Solr-NightlyTests-5.x/solr/core/src/test-files/solr/collection1/conf/mapping-ISOLatin1Accent.txt to /configs/conf1/mapping-ISOLatin1Accent.txt
   [junit4]   2> 2582135 T7843 oascc.SolrZkClient.makePath makePath: /configs/conf1/mapping-ISOLatin1Accent.txt
   [junit4]   2> 2582137 T7843 oasc.AbstractZkTestCase.putConfig put /usr/home/jenkins/jenkins-slave/workspace/Lucene-Solr-NightlyTests-5.x/solr/core/src/test-files/solr/collection1/conf/old_synonyms.txt to /configs/conf1/old_synonyms.txt
   [junit4]   2> 2582138 T7843 oascc.SolrZkClient.makePath makePath: /configs/conf1/old_synonyms.txt
   [junit4]   2> 2582139 T7843 oasc.AbstractZkTestCase.putConfig put /usr/home/jenkins/jenkins-slave/workspace/Lucene-Solr-NightlyTests-5.x/solr/core/src/test-files/solr/collection1/conf/synonyms.txt to /configs/conf1/synonyms.txt
   [junit4]   2> 2582140 T7843 oascc.SolrZkClient.makePath makePath: /configs/conf1/synonyms.txt
   [junit4]   2> 2582142 T7843 oascc.SolrZkClient.createZkCredentialsToAddAutomatically Using default ZkCredentialsProvider
   [junit4]   2> 2582143 T7843 oascc.ConnectionManager.waitForConnected Waiting for client to connect to ZooKeeper
   [junit4]   2> 2582144 T7854 oascc.ConnectionManager.process Watcher org.apache.solr.common.cloud.ConnectionManager@6017f1b7 name:ZooKeeperConnection Watcher:127.0.0.1:31689/solr got event WatchedEvent state:SyncConnected type:None path:null path:null type:None
   [junit4]   2> 2582144 T7843 oascc.ConnectionManager.waitForConnected Client is connected to ZooKeeper
   [junit4]   2> 2582145 T7843 oascc.SolrZkClient.createZkACLProvider Using default ZkACLProvider
   [junit4]   2> Using old style solr.xml
   [junit4]   2> 2582146 T7843 oascc.SolrZkClient.createZkCredentialsToAddAutomatically Using default ZkCredentialsProvider
   [junit4]   2> 2582147 T7843 oascc.ConnectionManager.waitForConnected Waiting for client to connect to ZooKeeper
   [junit4]   2> 2582148 T7856 oascc.ConnectionManager.process Watcher org.apache.solr.common.cloud.ConnectionManager@23304b50 name:ZooKeeperConnection Watcher:127.0.0.1:31689 got event WatchedEvent state:SyncConnected type:None path:null path:null type:None
   [junit4]   2> 2582148 T7843 oascc.ConnectionManager.waitForConnected Client is connected to ZooKeeper
   [junit4]   2> 2582148 T7843 oascc.SolrZkClient.createZkACLProvider Using default ZkACLProvider
   [junit4]   2> 2582149 T7843 oascc.SolrZkClient.makePath makePath: /solr
   [junit4]   2> 2582150 T7843 oascc.SolrZkClient.createZkCredentialsToAddAutomatically Using default ZkCredentialsProvider
   [junit4]   2> 2582151 T7843 oascc.ConnectionManager.waitForConnected Waiting for client to connect to ZooKeeper
   [junit4]   2> 2582152 T7858 oascc.ConnectionManager.process Watcher org.apache.solr.common.cloud.ConnectionManager@7303f31f name:ZooKeeperConnection Watcher:127.0.0.1:31689/solr got event WatchedEvent state:SyncConnected type:None path:null path:null type:None
   [junit4]   2> 2582152 T7843 oascc.ConnectionManager.waitForConnected Client is connected to ZooKeeper
   [junit4]   2> 2582152 T7843 oascc.SolrZkClient.createZkACLProvider Using default ZkACLProvider
   [junit4]   2> 2582153 T7843 oasc.AbstractZkTestCase.putConfig put /usr/home/jenkins/jenkins-slave/workspace/Lucene-Solr-NightlyTests-5.x/solr/core/src/test-files/solr/collection1/conf/solrconfig-tlog.xml to /configs/conf2/solrconfig.xml
   [junit4]   2> 2582153 T7843 oascc.SolrZkClient.makePath makePath: /configs/conf2/solrconfig.xml
   [junit4]   2> 2582156 T7843 oasc.AbstractZkTestCase.putConfig put /usr/home/jenkins/jenkins-slave/workspace/Lucene-Solr-NightlyTests-5.x/solr/core/src/test-files/solr/collection1/conf/schema.xml to /configs/conf2/schema.xml
   [junit4]   2> 2582156 T7843 oascc.SolrZkClient.makePath makePath: /configs/conf2/schema.xml
   [junit4]   2> 2582257 T7843 oasc.AbstractZkTestCase.putConfig put /usr/home/jenkins/jenkins-slave/workspace/Lucene-Solr-NightlyTests-5.x/solr/core/src/test-files/solr/collection1/conf/solrconfig.snippet.randomindexconfig.xml to /configs/conf2/solrconfig.snippet.randomindexconfig.xml
   [junit4]   2> 2582258 T7843 oascc.SolrZkClient.makePath makePath: /configs/conf2/solrconfig.snippet.randomindexconfig.xml
   [junit4]   2> 2582259 T7843 oasc.AbstractZkTestCase.putConfig put /usr/home/jenkins/jenkins-slave/workspace/Lucene-Solr-NightlyTests-5.x/solr/core/src/test-files/solr/collection1/conf/stopwords.txt to /configs/conf2/stopwords.txt
   [junit4]   2> 2582260 T7843 oascc.SolrZkClient.makePath makePath: /configs/conf2/stopwords.txt
   [junit4]   2> 2582262 T7843 oasc.AbstractZkTestCase.putConfig put /usr/home/jenkins/jenkins-slave/workspace/Lucene-Solr-NightlyTests-5.x/solr/core/src/test-files/solr/collection1/conf/protwords.txt to /configs/conf2/protwords.txt
   [junit4]   2> 2582262 T7843 oascc.SolrZkClient.makePath makePath: /configs/conf2/protwords.txt
   [junit4]   2> 2582264 T7843 oasc.AbstractZkTestCase.putConfig put /usr/home/jenkins/jenkins-slave/workspace/Lucene-Solr-NightlyTests-5.x/solr/core/src/test-files/solr/collection1/conf/currency.xml to /configs/conf2/currency.xml
   [junit4]   2> 2582264 T7843 oascc.SolrZkClient.makePath makePath: /configs/conf2/currency.xml
   [junit4]   2> 2582266 T7843 oasc.AbstractZkTestCase.putConfig put /usr/home/jenkins/jenkins-slave/workspace/Lucene-Solr-NightlyTests-5.x/solr/core/src/test-files/solr/collection1/conf/open-exchange-rates.json to /configs/conf2/open-exchange-rates.json
   [junit4]   2> 2582266 T7843 oascc.SolrZkClient.makePath makePath: /configs/conf2/open-exchange-rates.json
   [junit4]   2> 2582268 T7843 oasc.AbstractZkTestCase.putConfig put /usr/home/jenkins/jenkins-slave/workspace/Lucene-Solr-NightlyTests-5.x/solr/core/src/test-files/solr/collection1/conf/mapping-ISOLatin1Accent.txt to /configs/conf2/mapping-ISOLatin1Accent.txt
   [junit4]   2> 2582268 T7843 oascc.SolrZkClient.makePath makePath: /configs/conf2/mapping-ISOLatin1Accent.txt
   [junit4]   2> 2582270 T7843 oasc.AbstractZkTestCase.putConfig put /usr/home/jenkins/jenkins-slave/workspace/Lucene-Solr-NightlyTests-5.x/solr/core/src/test-files/solr/collection1/conf/old_synonyms.txt to /configs/conf2/old_synonyms.txt
   [junit4]   2> 2582270 T7843 oascc.SolrZkClient.makePath makePath: /configs/conf2/old_synonyms.txt
   [junit4]   2> 2582272 T7843 oasc.AbstractZkTestCase.putConfig put /usr/home/jenkins/jenkins-slave/workspace/Lucene-Solr-NightlyTests-5.x/solr/core/src/test-files/solr/collection1/conf/synonyms.txt to /configs/conf2/synonyms.txt
   [junit4]   2> 2582272 T7843 oascc.SolrZkClient.makePath makePath: /configs/conf2/synonyms.txt
   [junit4]   2> 2582274 T7843 oasc.AbstractZkTestCase.putConfig put /usr/home/jenkins/jenkins-slave/workspace/Lucene-Solr-NightlyTests-5.x/solr/core/src/test-files/solr/collection1/conf/elevate.xml to /configs/conf2/elevate.xml
   [junit4]   2> 2582275 T7843 oascc.SolrZkClient.makePath makePath: /configs/conf2/elevate.xml
   [junit4]   2> 2583422 T7843 oejs.Server.doStart jetty-8.1.10.v20130312
   [junit4]   2> 2583426 T7843 oejus.SslContextFactory.doStart Enabled Protocols [SSLv2Hello, SSLv3, TLSv1, TLSv1.1, TLSv1.2] of [SSLv2Hello, SSLv3, TLSv1, TLSv1.1, TLSv1.2]
   [junit4]   2> 2583429 T7843 oejs.AbstractConnector.doStart Started SslSocketConnector@127.0.0.1:?????
   [junit4]   2> 2583431 T7843 oass.SolrDispatchFilter.init SolrDispatchFilter.init()
   [junit4]   2> 2583432 T7843 oasc.SolrResourceLoader.locateSolrHome JNDI not configured for solr (NoInitialContextEx)
   [junit4]   2> 2583432 T7843 oasc.SolrResourceLoader.locateSolrHome using system property solr.solr.home: ../../../../../../../../../../../usr/home/jenkins/jenkins-slave/workspace/Lucene-Solr-NightlyTests-5.x/solr/build/solr-core/test/J3/temp/solr.cloud.CollectionsAPIDistributedZkTest-6CFAFC4E7B581D4D-001/tempDir-002
   [junit4]   2> 2583432 T7843 oasc.SolrResourceLoader.<init> new SolrResourceLoader for directory: '../../../../../../../../../../../usr/home/jenkins/jenkins-slave/workspace/Lucene-Solr-NightlyTests-5.x/solr/build/solr-core/test/J3/temp/solr.cloud.CollectionsAPIDistributedZkTest-6CFAFC4E7B581D4D-001/tempDir-002/'
   [junit4]   2> 2583697 T7843 oasc.ConfigSolr.fromFile Loading container configuration from /usr/home/jenkins/jenkins-slave/workspace/Lucene-Solr-NightlyTests-5.x/solr/build/solr-core/test/J3/../../../../../../../../../../../usr/home/jenkins/jenkins-slave/workspace/Lucene-Solr-NightlyTests-5.x/solr/build/solr-core/test/J3/temp/solr.cloud.CollectionsAPIDistributedZkTest-6CFAFC4E7B581D4D-001/tempDir-002/solr.xml
   [junit4]   2> 2583753 T7843 oasc.CoreContainer.<init> New CoreContainer 1069957240
   [junit4]   2> 2583753 T7843 oasc.CoreContainer.load Loading cores into CoreContainer [instanceDir=../../../../../../../../../../../usr/home/jenkins/jenkins-slave/workspace/Lucene-Solr-NightlyTests-5.x/solr/build/solr-core/test/J3/temp/solr.cloud.CollectionsAPIDistributedZkTest-6CFAFC4E7B581D4D-001/tempDir-002/]
   [junit4]   2> 2583754 T7843 oashc.HttpShardHandlerFactory.getParameter Setting socketTimeout to: 120000
   [junit4]   2> 2583755 T7843 oashc.HttpShardHandlerFactory.getParameter Setting urlScheme to: null
   [junit4]   2> 2583755 T7843 oashc.HttpShardHandlerFactory.getParameter Setting connTimeout to: 15000
   [junit4]   2> 2583755 T7843 oashc.HttpShardHandlerFactory.getParameter Setting maxConnectionsPerHost to: 20
   [junit4]   2> 2583755 T7843 oashc.HttpShardHandlerFactory.getParameter Setting maxConnections to: 10000
   [junit4]   2> 2583755 T7843 oashc.HttpShardHandlerFactory.getParameter Setting corePoolSize to: 0
   [junit4]   2> 2583756 T7843 oashc.HttpShardHandlerFactory.getParameter Setting maximumPoolSize to: 2147483647
   [junit4]   2> 2583756 T7843 oashc.HttpShardHandlerFactory.getParameter Setting maxThreadIdleTime to: 5
   [junit4]   2> 2583756 T7843 oashc.HttpShardHandlerFactory.getParameter Setting sizeOfQueue to: -1
   [junit4]   2> 2583756 T7843 oashc.HttpShardHandlerFactory.getParameter Setting fairnessPolicy to: false
   [junit4]   2> 2583758 T7843 oasu.UpdateShardHandler.<init> Creating UpdateShardHandler HTTP client with params: socketTimeout=3400000&connTimeout=45000&retry=false
   [junit4]   2> 2583760 T7843 oasl.LogWatcher.createWatcher SLF4J impl is org.slf4j.impl.Log4jLoggerFactory
   [junit4]   2> 2583760 T7843 oasl.LogWatcher.newRegisteredLogWatcher Registering Log Listener [Log4j (org.slf4j.impl.Log4jLoggerFactory)]
   [junit4]   2> 2583760 T7843 oasc.CoreContainer.load Host Name: 127.0.0.1
   [junit4]   2> 2583761 T7843 oasc.ZkContainer.initZooKeeper Zookeeper client=127.0.0.1:31689/solr
   [junit4]   2> 2583761 T7843 oasc.ZkController.checkChrootPath zkHost includes chroot
   [junit4]   2> 2583761 T7843 oascc.SolrZkClient.createZkCredentialsToAddAutomatically Using default ZkCredentialsProvider
   [junit4]   2> 2583762 T7843 oascc.ConnectionManager.waitForConnected Waiting for client to connect to ZooKeeper
   [junit4]   2> 2583764 T7869 oascc.ConnectionManager.process Watcher org.apache.solr.common.cloud.ConnectionManager@73b49c82 name:ZooKeeperConnection Watcher:127.0.0.1:31689 got event WatchedEvent state:SyncConnected type:None path:null path:null type:None
   [junit4]   2> 2583765 T7843 oascc.ConnectionManager.waitForConnected Client is connected to ZooKeeper
   [junit4]   2> 2583765 T7843 oascc.SolrZkClient.createZkACLProvider Using default ZkACLProvider
   [junit4]   2> 2583767 T7843 oascc.ConnectionManager.waitForConnected Waiting for client to connect to ZooKeeper
   [junit4]   2> 2583768 T7871 oascc.ConnectionManager.process Watcher org.apache.solr.common.cloud.ConnectionManager@7b0000c7 name:ZooKeeperConnection Watcher:127.0.0.1:31689/solr got event WatchedEvent state:SyncConnected type:None path:null path:null type:None
   [junit4]   2> 2583768 T7843 oascc.ConnectionManager.waitForConnected Client is connected to ZooKeeper
   [junit4]   2> 2583769 T7843 oascc.SolrZkClient.makePath makePath: /overseer/queue
   [junit4]   2> 2583771 T7843 oascc.SolrZkClient.makePath makePath: /overseer/collection-queue-work
   [junit4]   2> 2583772 T7843 oascc.SolrZkClient.makePath makePath: /overseer/collection-map-running
   [junit4]   2> 2583774 T7843 oascc.SolrZkClient.makePath makePath: /overseer/collection-map-completed
   [junit4]   2> 2583775 T7843 oascc.SolrZkClient.makePath makePath: /overseer/collection-map-failure
   [junit4]   2> 2583777 T7843 oascc.SolrZkClient.makePath makePath: /live_nodes
   [junit4]   2> 2583778 T7843 oasc.ZkController.createEphemeralLiveNode Register node as live in ZooKeeper:/live_nodes/127.0.0.1:31695_
   [junit4]   2> 2583779 T7843 oascc.SolrZkClient.makePath makePath: /live_nodes/127.0.0.1:31695_
   [junit4]   2> 2583780 T7843 oascc.SolrZkClient.makePath makePath: /overseer_elect
   [junit4]   2> 2583781 T7843 oascc.SolrZkClient.makePath makePath: /overseer_elect/election
   [junit4]   2> 2583782 T7843 oasc.Overseer.close Overseer (id=null) closing
   [junit4]   2> 2583784 T7843 oasc.OverseerElectionContext.runLeaderProcess I am going to be the leader 127.0.0.1:31695_
   [junit4]   2> 2583784 T7843 oascc.SolrZkClient.makePath makePath: /overseer_elect/leader
   [junit4]   2> 2583785 T7843 oasc.Overseer.start Overseer (id=92729847167123462-127.0.0.1:31695_-n_0000000000) starting
   [junit4]   2> 2583787 T7843 oascc.SolrZkClient.makePath makePath: /overseer/queue-work
   [junit4]   2> 2583792 T7843 oasc.OverseerAutoReplicaFailoverThread.<init> Starting OverseerAutoReplicaFailoverThread autoReplicaFailoverWorkLoopDelay=10000 autoReplicaFailoverWaitAfterExpiration=30000 autoReplicaFailoverBadNodeExpiration=60000
   [junit4]   2> 2583792 T7873 oasc.OverseerCollectionProcessor.run Process current queue of collection creations
   [junit4]   2> 2583793 T7843 oascc.SolrZkClient.makePath makePath: /clusterstate.json
   [junit4]   2> 2583794 T7843 oascc.SolrZkClient.makePath makePath: /aliases.json
   [junit4]   2> 2583795 T7843 oascc.ZkStateReader.createClusterStateWatchersAndUpdate Updating cluster state from ZooKeeper... 
   [junit4]   2> 2583797 T7872 oasc.Overseer$ClusterStateUpdater.run Starting to work on the main queue
   [junit4]   2> 2583801 T7843 oass.SolrDispatchFilter.init user.dir=/usr/home/jenkins/jenkins-slave/workspace/Lucene-Solr-NightlyTests-5.x/solr/build/solr-core/test/J3
   [junit4]   2> 2583801 T7843 oass.SolrDispatchFilter.init SolrDispatchFilter.init() done
   [junit4]   2> 2583806 T7843 oascc.SolrZkClient.createZkCredentialsToAddAutomatically Using default ZkCredentialsProvider
   [junit4]   2> 2583807 T7843 oascc.ConnectionManager.waitForConnected Waiting for client to connect to ZooKeeper
   [junit4]   2> 2583808 T7877 oascc.ConnectionManager.process Watcher org.apache.solr.common.cloud.ConnectionManager@6f80e7e7 name:ZooKeeperConnection Watcher:127.0.0.1:31689/solr got event WatchedEvent state:SyncConnected type:None path:null path:null type:None
   [junit4]   2> 2583809 T7843 oascc.ConnectionManager.waitForConnected Client is connected to ZooKeeper
   [junit4]   2> 2583809 T7843 oascc.SolrZkClient.createZkACLProvider Using default ZkACLProvider
   [junit4]   2> 2583810 T7843 oascc.ZkStateReader.createClusterStateWatchersAndUpdate Updating cluster state from ZooKeeper... 
   [junit4]   2> 2583811 T7843 oasc.ChaosMonkey.monkeyLog monkey: init - expire sessions:false cause connection loss:false
   [junit4]   2> 2583812 T7843 oasc.AbstractFullDistribZkTestBase.createJettys Creating collection1 with stateFormat=2
   [junit4]   2> 2583812 T7843 oascc.SolrZkClient.createZkCredentialsToAddAutomatically Using default ZkCredentialsProvider
   [junit4]   2> 2583813 T7843 oascc.ConnectionManager.waitForConnected Waiting for client to connect to ZooKeeper
   [junit4]   2> 2583814 T7879 oascc.ConnectionManager.process Watcher org.apache.solr.common.cloud.ConnectionManager@dd7e104 name:ZooKeeperConnection Watcher:127.0.0.1:31689/solr got event WatchedEvent state:SyncConnected type:None path:null path:null type:None
   [junit4]   2> 2583814 T7843 oascc.ConnectionManager.waitForConnected Client is connected to ZooKeeper
   [junit4]   2> 2583814 T7843 oascc.SolrZkClient.createZkACLProvider Using default ZkACLProvider
   [junit4]   2> 2583816 T7880 oasc.DistributedQueue$LatchWatcher.process NodeChildrenChanged fired on path /overseer/queue state SyncConnected
   [junit4]   2> 2583818 T7872 oasc.Overseer$ClusterStateUpdater.buildCollection building a new collection: collection1
   [junit4]   2> 2583818 T7872 oasc.Overseer$ClusterStateUpdater.createCollection Create collection collection1 with shards [shard1, shard2]
   [junit4]   2> 2583818 T7872 oasc.Overseer$ClusterStateUpdater.createCollection state version collection1 2
   [junit4]   2> 2583820 T7872 oasc.Overseer$ClusterStateUpdater.updateZkStates going to create_collection /collections/collection1/state.json
   [junit4]   2> 2583821 T7880 oascc.ZkStateReader$2.process A cluster state change: WatchedEvent state:SyncConnected type:NodeDataChanged path:/clusterstate.json, has occurred - updating... (live nodes size: 1)
   [junit4]   2> 2583821 T7881 oascc.ZkStateReader$2.process A cluster state change: WatchedEvent state:SyncConnected type:NodeDataChanged path:/clusterstate.json, has occurred - updating... (live nodes size: 1)
   [junit4]   2> 2584953 T7843 oasc.AbstractFullDistribZkTestBase.createJettys create jetty 1
   [junit4]   2> 2584954 T7843 oejs.Server.doStart jetty-8.1.10.v20130312
   [junit4]   2> 2584959 T7843 oejus.SslContextFactory.doStart Enabled Protocols [SSLv2Hello, SSLv3, TLSv1, TLSv1.1, TLSv1.2] of [SSLv2Hello, SSLv3, TLSv1, TLSv1.1, TLSv1.2]
   [junit4]   2> 2584960 T7843 oejs.AbstractConnector.doStart Started SslSocketConnector@127.0.0.1:?????
   [junit4]   2> 2584962 T7843 oass.SolrDispatchFilter.init SolrDispatchFilter.init()
   [junit4]   2> 2584963 T7843 oasc.SolrResourceLoader.locateSolrHome JNDI not configured for solr (NoInitialContextEx)
   [junit4]   2> 2584963 T7843 oasc.SolrResourceLoader.locateSolrHome using system property solr.solr.home: ../../../../../../../../../../../usr/home/jenkins/jenkins-slave/workspace/Lucene-Solr-NightlyTests-5.x/solr/build/solr-core/test/J3/temp/solr.cloud.CollectionsAPIDistributedZkTest-6CFAFC4E7B581D4D-001/tempDir-003
   [junit4]   2> 2584963 T7843 oasc.SolrResourceLoader.<init> new SolrResourceLoader for directory: '../../../../../../../../../../../usr/home/jenkins/jenkins-slave/workspace/Lucene-Solr-NightlyTests-5.x/solr/build/solr-core/test/J3/temp/solr.cloud.CollectionsAPIDistributedZkTest-6CFAFC4E7B581D4D-001/tempDir-003/'
   [junit4]   2> 2584992 T7843 oasc.ConfigSolr.fromFile Loading container configuration from /usr/home/jenkins/jenkins-slave/workspace/Lucene-Solr-NightlyTests-5.x/solr/build/solr-core/test/J3/../../../../../../../../../../../usr/home/jenkins/jenkins-slave/workspace/Lucene-Solr-NightlyTests-5.x/solr/build/solr-core/test/J3/temp/solr.cloud.CollectionsAPIDistributedZkTest-6CFAFC4E7B581D4D-001/tempDir-003/solr.xml
   [junit4]   2> 2585044 T7843 oasc.CoreContainer.<init> New CoreContainer 704938551
   [junit4]   2> 2585044 T7843 oasc.CoreContainer.load Loading cores into CoreContainer [instanceDir=../../../../../../../../../../../usr/home/jenkins/jenkins-slave/workspace/Lucene-Solr-NightlyTests-5.x/solr/build/solr-core/test/J3/temp/solr.cloud.CollectionsAPIDistributedZkTest-6CFAFC4E7B581D4D-001/tempDir-003/]
   [junit4]   2> 2585045 T7843 oashc.HttpShardHandlerFactory.getParameter Setting socketTimeout to: 120000
   [junit4]   2> 2585045 T7843 oashc.HttpShardHandlerFactory.getParameter Setting urlScheme to: null
   [junit4]   2> 2585046 T7843 oashc.HttpShardHandlerFactory.getParameter Setting connTimeout to: 15000
   [junit4]   2> 2585046 T7843 oashc.HttpShardHandlerFactory.getParameter Setting maxConnectionsPerHost to: 20
   [junit4]   2> 2585046 T7843 oashc.HttpShardHandlerFactory.getParameter Setting maxConnections to: 10000
   [junit4]   2> 2585046 T7843 oashc.HttpShardHandlerFactory.getParameter Setting corePoolSize to: 0
   [junit4]   2> 2585046 T7843 oashc.HttpShardHandlerFactory.getParameter Setting maximumPoolSize to: 2147483647
   [junit4]   2> 2585047 T7843 oashc.HttpShardHandlerFactory.getParameter Setting maxThreadIdleTime to: 5
   [junit4]   2> 2585047 T7843 oashc.HttpShardHandlerFactory.getParameter Setting sizeOfQueue to: -1
   [junit4]   2> 2585047 T7843 oashc.HttpShardHandlerFactory.getParameter Setting fairnessPolicy to: false
   [junit4]   2> 2585049 T7843 oasu.UpdateShardHandler.<init> Creating UpdateShardHandler HTTP client with params: socketTimeout=3400000&connTimeout=45000&retry=false
   [junit4]   2> 2585051 T7843 oasl.LogWatcher.createWatcher SLF4J impl is org.slf4j.impl.Log4jLoggerFactory
   [junit4]   2> 2585051 T7843 oasl.LogWatcher.newRegisteredLogWatcher Registering Log Listener [Log4j (org.slf4j.impl.Log4jLoggerFactory)]
   [junit4]   2> 2585051 T7843 oasc.CoreContainer.load Host Name: 127.0.0.1
   [junit4]   2> 2585051 T7843 oasc.ZkContainer.initZooKeeper Zookeeper client=127.0.0.1:31689/solr
   [junit4]   2> 2585052 T7843 oasc.ZkController.checkChrootPath zkHost includes chroot
   [junit4]   2> 2585052 T7843 oascc.SolrZkClient.createZkCredentialsToAddAutomatically Using default ZkCredentialsProvider
   [junit4]   2> 2585053 T7843 oascc.ConnectionManager.waitForConnected Waiting for client to connect to ZooKeeper
   [junit4]   2> 2585054 T7892 oascc.ConnectionManager.process Watcher org.apache.solr.common.cloud.ConnectionManager@2e492812 name:ZooKeeperConnection Watcher:127.0.0.1:31689 got event WatchedEvent state:SyncConnected type:None path:null path:null type:None
   [junit4]   2> 2585054 T7843 oascc.ConnectionManager.waitForConnected Client is connected to ZooKeeper
   [junit4]   2> 2585055 T7843 oascc.SolrZkClient.createZkACLProvider Using default ZkACLProvider
   [junit4]   2> 2585057 T7843 oascc.ConnectionManager.waitForConnected Waiting for client to connect to ZooKeeper
   [junit4]   2> 2585058 T7894 oascc.ConnectionManager.process Watcher org.apache.solr.common.cloud.ConnectionManager@4007e19b name:ZooKeeperConnection Watcher:127.0.0.1:31689/solr got event WatchedEvent state:SyncConnected type:None path:null path:null type:None
   [junit4]   2> 2585058 T7843 oascc.ConnectionManager.waitForConnected Client is connected to ZooKeeper
   [junit4]   2> 2585062 T7843 oascc.ZkStateReader.createClusterStateWatchersAndUpdate Updating cluster state from ZooKeeper... 
   [junit4]   2> 2586066 T7843 oasc.ZkController.createEphemeralLiveNode Register node as live in ZooKeeper:/live_nodes/127.0.0.1:31704_
   [junit4]   2> 2586067 T7843 oascc.SolrZkClient.makePath makePath: /live_nodes/127.0.0.1:31704_
   [junit4]   2> 2586070 T7843 oasc.Overseer.close Overseer (id=null) closing
   [junit4]   2> 2586075 T7843 oass.SolrDispatchFilter.init user.dir=/usr/home/jenkins/jenkins-slave/workspace/Lucene-Solr-NightlyTests-5.x/solr/build/solr-core/test/J3
   [junit4]   2> 2586075 T7843 oass.SolrDispatchFilter.init SolrDispatchFilter.init() done
   [junit4]   2> 2587295 T7843 oasc.AbstractFullDistribZkTestBase.createJettys create jetty 2
   [junit4]   2> 2587296 T7843 oejs.Server.doStart jetty-8.1.10.v20130312
   [junit4]   2> 2587300 T7843 oejus.SslContextFactory.doStart Enabled Protocols [SSLv2Hello, SSLv3, TLSv1, TLSv1.1, TLSv1.2] of [SSLv2Hello, SSLv3, TLSv1, TLSv1.1, TLSv1.2]
   [junit4]   2> 2587301 T7843 oejs.AbstractConnector.doStart Started SslSocketConnector@127.0.0.1:?????
   [junit4]   2> 2587303 T7843 oass.SolrDispatchFilter.init SolrDispatchFilter.init()
   [junit4]   2> 2587304 T7843 oasc.SolrResourceLoader.locateSolrHome JNDI not configured for solr (NoInitialContextEx)
   [junit4]   2> 2587304 T7843 oasc.SolrResourceLoader.locateSolrHome using system property solr.solr.home: /usr/home/jenkins/jenkins-slave/workspace/Lucene-Solr-NightlyTests-5.x/solr/build/solr-core/test/J3/temp/solr.cloud.CollectionsAPIDistributedZkTest-6CFAFC4E7B581D4D-001/tempDir-004
   [junit4]   2> 2587304 T7843 oasc.SolrResourceLoader.<init> new SolrResourceLoader for directory: '/usr/home/jenkins/jenkins-slave/workspace/Lucene-Solr-NightlyTests-5.x/solr/build/solr-core/test/J3/temp/solr.cloud.CollectionsAPIDistributedZkTest-6CFAFC4E7B581D4D-001/tempDir-004/'
   [junit4]   2> 2587333 T7843 oasc.ConfigSolr.fromFile Loading container configuration from /usr/home/jenkins/jenkins-slave/workspace/Lucene-Solr-NightlyTests-5.x/solr/build/solr-core/test/J3/temp/solr.cloud.CollectionsAPIDistributedZkTest-6CFAFC4E7B581D4D-001/tempDir-004/solr.xml
   [junit4]   2> 2587386 T7843 oasc.CoreContainer.<init> New CoreContainer 739187808
   [junit4]   2> 2587386 T7843 oasc.CoreContainer.load Loading cores into CoreContainer [instanceDir=/usr/home/jenkins/jenkins-slave/workspace/Lucene-Solr-NightlyTests-5.x/solr/build/solr-core/test/J3/temp/solr.cloud.CollectionsAPIDistributedZkTest-6CFAFC4E7B581D4D-001/tempDir-004/]
   [junit4]   2> 2587387 T7843 oashc.HttpShardHandlerFactory.getParameter Setting socketTimeout to: 120000
   [junit4]   2> 2587387 T7843 oashc.HttpShardHandlerFactory.getParameter Setting urlScheme to: null
   [junit4]   2> 2587387 T7843 oashc.HttpShardHandlerFactory.getParameter Setting connTimeout to: 15000
   [junit4]   2> 2587388 T7843 oashc.HttpShardHandlerFactory.getParameter Setting maxConnectionsPerHost to: 20
   [junit4]   2> 2587388 T7843 oashc.HttpShardHandlerFactory.getParameter Setting maxConnections to: 10000
   [junit4]   2> 2587388 T7843 oashc.HttpShardHandlerFactory.getParameter Setting corePoolSize to: 0
   [junit4]   2> 2587388 T7843 oashc.HttpShardHandlerFactory.getParameter Setting maximumPoolSize to: 2147483647
   [junit4]   2> 2587389 T7843 oashc.HttpShardHandlerFactory.getParameter Setting maxThreadIdleTime to: 5
   [junit4]   2> 2587389 T7843 oashc.HttpShardHandlerFactory.getParameter Setting sizeOfQueue to: -1
   [junit4]   2> 2587389 T7843 oashc.HttpShardHandlerFactory.getParameter Setting fairnessPolicy to: false
   [junit4]   2> 2587391 T7843 oasu.UpdateShardHandler.<init> Creating UpdateShardHandler HTTP client with params: socketTimeout=3400000&connTimeout=45000&retry=false
   [junit4]   2> 2587393 T7843 oasl.LogWatcher.createWatcher SLF4J impl is org.slf4j.impl.Log4jLoggerFactory
   [junit4]   2> 2587393 T7843 oasl.LogWatcher.newRegisteredLogWatcher Registering Log Listener [Log4j (org.slf4j.impl.Log4jLoggerFactory)]
   [junit4]   2> 2587393 T7843 oasc.CoreContainer.load Host Name: 127.0.0.1
   [junit4]   2> 2587393 T7843 oasc.ZkContainer.initZooKeeper Zookeeper client=127.0.0.1:31689/solr
   [junit4]   2> 2587393 T7843 oasc.ZkController.checkChrootPath zkHost includes chroot
   [junit4]   2> 2587394 T7843 oascc.SolrZkClient.createZkCredentialsToAddAutomatically Using default ZkCredentialsProvider
   [junit4]   2> 2587394 T7843 oascc.ConnectionManager.waitForConnected Waiting for client to connect to ZooKeeper
   [junit4]   2> 2587396 T7907 oascc.ConnectionManager.process Watcher org.apache.solr.common.cloud.ConnectionManager@32ce2cc6 name:ZooKeeperConnection Watcher:127.0.0.1:31689 got event WatchedEvent state:SyncConnected type:None path:null path:null type:None
   [junit4]   2> 2587397 T7843 oascc.ConnectionManager.waitForConnected Client is connected to ZooKeeper
   [junit4]   2> 2587397 T7843 oascc.SolrZkClient.createZkACLProvider Using default ZkACLProvider
   [junit4]   2> 2587399 T7843 oascc.ConnectionManager.waitForConnected Waiting for client to connect to ZooKeeper
   [junit4]   2> 2587400 T7909 oascc.ConnectionManager.process Watcher org.apache.solr.common.cloud.ConnectionManager@4ca31e12 name:ZooKeeperConnection Watcher:127.0.0.1:31689/solr got event WatchedEvent state:SyncConnected type:None path:null path:null type:None
   [junit4]   2> 2587400 T7843 oascc.ConnectionManager.waitForConnected Client is connected to ZooKeeper
   [junit4]   2> 2587404 T7843 oascc.ZkStateReader.createClusterStateWatchersAndUpdate Updating cluster state from ZooKeeper... 
   [junit4]   2> 2588408 T7843 oasc.ZkController.createEphemeralLiveNode Register node as live in ZooKeeper:/live_nodes/127.0.0.1:31710_
   [junit4]   2> 2588409 T7843 oascc.SolrZkClient.makePath makePath: /live_nodes/127.0.0.1:31710_
   [junit4]   2> 2588412 T7843 oasc.Overseer.close Overseer (id=null) closing
   [junit4]   2> 2588417 T7843 oass.SolrDispatchFilter.init user.dir=/usr/home/jenkins/jenkins-slave/workspace/Lucene-Solr-NightlyTests-5.x/solr/build/solr-core/test/J3
   [junit4]   2> 2588417 T7843 oass.SolrDispatchFilter.init SolrDispatchFilter.init() done
   [junit4]   2> 2589562 T7843 oasc.AbstractFullDistribZkTestBase.createJettys create jetty 3
   [junit4]   2> 2589562 T7843 oejs.Server.doStart jetty-8.1.10.v20130312
   [junit4]   2> 2589568 T7843 oejus.SslContextFactory.doStart Enabled Protocols [SSLv2Hello, SSLv3, TLSv1, TLSv1.1, TLSv1.2] of [SSLv2Hello, SSLv3, TLSv1, TLSv1.1, TLSv1.2]
   [junit4]   2> 2589569 T7843 oejs.AbstractConnector.doStart Started SslSocketConnector@127.0.0.1:?????
   [junit4]   2> 2589571 T7843 oass.SolrDispatchFilter.init SolrDispatchFilter.init()
   [junit4]   2> 2589572 T7843 oasc.SolrResourceLoader.locateSolrHome JNDI not configured for solr (NoInitialContextEx)
   [junit4]   2> 2589572 T7843 oasc.SolrResourceLoader.locateSolrHome using system property solr.solr.home: /usr/home/jenkins/jenkins-slave/workspace/Lucene-Solr-NightlyTests-5.x/solr/build/solr-core/test/J3/temp/solr.cloud.CollectionsAPIDistributedZkTest-6CFAFC4E7B581D4D-001/tempDir-005
   [junit4]   2> 2589572 T7843 oasc.SolrResourceLoader.<init> new SolrResourceLoader for directory: '/usr/home/jenkins/jenkins-slave/workspace/Lucene-Solr-NightlyTests-5.x/solr/build/solr-core/test/J3/temp/solr.cloud.CollectionsAPIDistributedZkTest-6CFAFC4E7B581D4D-001/tempDir-005/'
   [junit4]   2> 2589601 T7843 oasc.ConfigSolr.fromFile Loading container configuration from /usr/home/jenkins/jenkins-slave/workspace/Lucene-Solr-NightlyTests-5.x/solr/build/solr-core/test/J3/temp/solr.cloud.CollectionsAPIDistributedZkTest-6CFAFC4E7B581D4D-001/tempDir-005/solr.xml
   [junit4]   2> 2589653 T7843 oasc.CoreContainer.<init> New CoreContainer 2115939908
   [junit4]   2> 2589653 T7843 oasc.CoreContainer.load Loading cores into CoreContainer [instanceDir=/usr/home/jenkins/jenkins-slave/workspace/Lucene-Solr-NightlyTests-5.x/solr/build/solr-core/test/J3/temp/solr.cloud.CollectionsAPIDistributedZkTest-6CFAFC4E7B581D4D-001/tempDir-005/]
   [junit4]   2> 2589654 T7843 oashc.HttpShardHandlerFactory.getParameter Setting socketTimeout to: 120000
   [junit4]   2> 2589654 T7843 oashc.HttpShardHandlerFactory.getParameter Setting urlScheme to: null
   [junit4]   2> 2589654 T7843 oashc.HttpShardHandlerFactory.getParameter Setting connTimeout to: 15000
   [junit4]   2> 2589655 T7843 oashc.HttpShardHandlerFactory.getParameter Setting maxConnectionsPerHost to: 20
   [junit4]   2> 2589655 T7843 oashc.HttpShardHandlerFactory.getParameter Setting maxConnections to: 10000
   [junit4]   2> 2589655 T7843 oashc.HttpShardHandlerFactory.getParameter Setting corePoolSize to: 0
   [junit4]   2> 2589655 T7843 oashc.HttpShardHandlerFactory.getParameter Setting maximumPoolSize to: 2147483647
   [junit4]   2> 2589655 T7843 oashc.HttpShardHandlerFactory.getParameter Setting maxThreadIdleTime to: 5
   [junit4]   2> 2589656 T7843 oashc.HttpShardHandlerFactory.getParameter Setting sizeOfQueue to: -1
   [junit4]   2> 2589656 T7843 oashc.HttpShardHandlerFactory.getParameter Setting fairnessPolicy to: false
   [junit4]   2> 2589658 T7843 oasu.UpdateShardHandler.<init> Creating UpdateShardHandler HTTP client with params: socketTimeout=3400000&connTimeout=45000&retry=false
   [junit4]   2> 2589678 T7843 oasl.LogWatcher.createWatcher SLF4J impl is org.slf4j.impl.Log4jLoggerFactory
   [junit4]   2> 2589679 T7843 oasl.LogWatcher.newRegisteredLogWatcher Registering Log Listener [Log4j (org.slf4j.impl.Log4jLoggerFactory)]
   [junit4]   2> 2589679 T7843 oasc.CoreContainer.load Host Name: 127.0.0.1
   [junit4]   2> 2589680 T7843 oasc.ZkContainer.initZooKeeper Zookeeper client=127.0.0.1:31689/solr
   [junit4]   2> 2589680 T7843 oasc.ZkController.checkChrootPath zkHost includes chroot
   [junit4]   2> 2589680 T7843 oascc.SolrZkClient.createZkCredentialsToAddAutomatically Using default ZkCredentialsProvider
   [junit4]   2> 2589681 T7843 oascc.ConnectionManager.waitForConnected Waiting for client to connect to ZooKeeper
   [junit4]   2> 2589683 T7922 oascc.ConnectionManager.process Watcher org.apache.solr.common.cloud.ConnectionManager@732595c5 name:ZooKeeperConnection Watcher:127.0.0.1:31689 got event WatchedEvent state:SyncConnected type:None path:null path:null type:None
   [junit4]   2> 2589684 T7843 oascc.ConnectionManager.waitForConnected Client is connected to ZooKeeper
   [junit4]   2> 2589684 T7843 oascc.SolrZkClient.createZkACLProvider Using default ZkACLProvider
   [junit4]   2> 2589686 T7843 oascc.ConnectionManager.waitForConnected Waiting for client to connect to ZooKeeper
   [junit4]   2> 2589687 T7924 oascc.ConnectionManager.process Watcher org.apache.solr.common.cloud.ConnectionManager@2f8c620e name:ZooKeeperConnection Watcher:127.0.0.1:31689/solr got event WatchedEvent state:SyncConnected type:None path:null path:null type:None
   [junit4]   2> 2589687 T7843 oascc.ConnectionManager.waitForConnected Client is connected to ZooKeeper
   [junit4]   2> 2589691 T7843 oascc.ZkStateReader.createClusterStateWatchersAndUpdate Updating cluster state from ZooKeeper... 
   [junit4]   2> 2590695 T7843 oasc.ZkController.createEphemeralLiveNode Register node as live in ZooKeeper:/live_nodes/127.0.0.1:31716_
   [junit4]   2> 2590696 T7843 oascc.SolrZkClient.makePath makePath: /live_nodes/127.0.0.1:31716_
   [junit4]   2> 2590699 T7843 oasc.Overseer.close Overseer (id=null) closing
   [junit4]   2> 2590704 T7843 oass.SolrDispatchFilter.init user.dir=/usr/home/jenkins/jenkins-slave/workspace/Lucene-Solr-NightlyTests-5.x/solr/build/solr-core/test/J3
   [junit4]   2> 2590704 T7843 oass.SolrDispatchFilter.init SolrDispatchFilter.init() done
   [junit4]   2> 2591863 T7843 oasc.AbstractFullDistribZkTestBase.createJettys create jetty 4
   [junit4]   2> 2591864 T7843 oejs.Server.doStart jetty-8.1.10.v20130312
   [junit4]   2> 2591867 T7843 oejus.SslContextFactory.doStart Enabled Protocols [SSLv2Hello, SSLv3, TLSv1, TLSv1.1, TLSv1.2] of [SSLv2Hello, SSLv3, TLSv1, TLSv1.1, TLSv1.2]
   [junit4]   2> 2591869 T7843 oejs.AbstractConnector.doStart Started SslSocketConnector@127.0.0.1:?????
   [junit4]   2> 2591871 T7843 oass.SolrDispatchFilter.init SolrDispatchFilter.init()
   [junit4]   2> 2591871 T7843 oasc.SolrResourceLoader.locateSolrHome JNDI not configured for solr (NoInitialContextEx)
   [junit4]   2> 2591872 T7843 oasc.SolrResourceLoader.locateSolrHome using system property solr.solr.home: /usr/home/jenkins/jenkins-slave/workspace/Lucene-Solr-NightlyTests-5.x/solr/build/solr-core/test/J3/temp/solr.cloud.CollectionsAPIDistributedZkTest-6CFAFC4E7B581D4D-001/tempDir-006
   [junit4]   2> 2591872 T7843 oasc.SolrResourceLoader.<init> new SolrResourceLoader for directory: '/usr/home/jenkins/jenkins-slave/workspace/Lucene-Solr-NightlyTests-5.x/solr/build/solr-core/test/J3/temp/solr.cloud.CollectionsAPIDistributedZkTest-6CFAFC4E7B581D4D-001/tempDir-006/'
   [junit4]   2> 2591901 T7843 oasc.ConfigSolr.fromFile Loading container configuration from /usr/home/jenkins/jenkins-slave/workspace/Lucene-Solr-NightlyTests-5.x/solr/build/solr-core/test/J3/temp/solr.cloud.CollectionsAPIDistributedZkTest-6CFAFC4E7B581D4D-001/tempDir-006/solr.xml
   [junit4]   2> 2591953 T7843 oasc.CoreContainer.<init> New CoreContainer 1058545640
   [junit4]   2> 2591953 T7843 oasc.CoreContainer.load Loading cores into CoreContainer [instanceDir=/usr/home/jenkins/jenkins-slave/workspace/Lucene-Solr-NightlyTests-5.x/solr/build/solr-core/test/J3/temp/solr.cloud.CollectionsAPIDistributedZkTest-6CFAFC4E7B581D4D-001/tempDir-006/]
   [junit4]   2> 2591954 T7843 oashc.HttpShardHandlerFactory.getParameter Setting socketTimeout to: 120000
   [junit4]   2> 2591954 T7843 oashc.HttpShardHandlerFactory.getParameter Setting urlScheme to: null
   [junit4]   2> 2591954 T7843 oashc.HttpShardHandlerFactory.getParameter Setting connTimeout to: 15000
   [junit4]   2> 2591955 T7843 oashc.HttpShardHandlerFactory.getParameter Setting maxConnectionsPerHost to: 20
   [junit4]   2> 2591955 T7843 oashc.HttpShardHandlerFactory.getParameter Setting maxConnections to: 10000
   [junit4]   2> 2591955 T7843 oashc.HttpShardHandlerFactory.getParameter Setting corePoolSize to: 0
   [junit4]   2> 2591955 T7843 oashc.HttpShardHandlerFactory.getParameter Setting maximumPoolSize to: 2147483647
   [junit4]   2> 2591956 T7843 oashc.HttpShardHandlerFactory.getParameter Setting maxThreadIdleTime to: 5
   [junit4]   2> 2591956 T7843 oashc.HttpShardHandlerFactory.getParameter Setting sizeOfQueue to: -1
   [junit4]   2> 2591956 T7843 oashc.HttpShardHandlerFactory.getParameter Setting fairnessPolicy to: false
   [junit4]   2> 2591958 T7843 oasu.UpdateShardHandler.<init> Creating UpdateShardHandler HTTP client with params: socketTimeout=3400000&connTimeout=45000&retry=false
   [junit4]   2> 2591959 T7843 oasl.LogWatcher.createWatcher SLF4J impl is org.slf4j.impl.Log4jLoggerFactory
   [junit4]   2> 2591960 T7843 oasl.LogWatcher.newRegisteredLogWatcher Registering Log Listener [Log4j (org.slf4j.impl.Log4jLoggerFactory)]
   [junit4]   2> 2591960 T7843 oasc.CoreContainer.load Host Name: 127.0.0.1
   [junit4]   2> 2591960 T7843 oasc.ZkContainer.initZooKeeper Zookeeper client=127.0.0.1:31689/solr
   [junit4]   2> 2591960 T7843 oasc.ZkController.checkChrootPath zkHost includes chroot
   [junit4]   2> 2591961 T7843 oascc.SolrZkClient.createZkCredentialsToAddAutomatically Using default ZkCredentialsProvider
   [junit4]   2> 2591961 T7843 oascc.ConnectionManager.waitForConnected Waiting for client to connect to ZooKeeper
   [junit4]   2> 2591963 T7937 oascc.ConnectionManager.process Watcher org.apache.solr.common.cloud.ConnectionManager@26145e74 name:ZooKeeperConnection Watcher:127.0.0.1:31689 got event WatchedEvent state:SyncConnected type:None path:null path:null type:None
   [junit4]   2> 2591964 T7843 oascc.ConnectionManager.waitForConnected Client is connected to ZooKeeper
   [junit4]   2> 2591964 T7843 oascc.SolrZkClient.createZkACLProvider Using default ZkACLProvider
   [junit4]   2> 2591965 T7843 oascc.ConnectionManager.waitForConnected Waiting for client to connect to ZooKeeper
   [junit4]   2> 2591966 T7939 oascc.ConnectionManager.process Watcher org.apache.solr.common.cloud.ConnectionManager@6ea60c8c name:ZooKeeperConnection Watcher:127.0.0.1:31689/solr got event WatchedEvent state:SyncConnected type:None path:null path:null type:None
   [junit4]   2> 2591966 T7843 oascc.ConnectionManager.waitForConnected Client is connected to ZooKeeper
   [junit4]   2> 2591970 T7843 oascc.ZkStateReader.createClusterStateWatchersAndUpdate Updating cluster state from ZooKeeper... 
   [junit4]   2> 2592974 T7843 oasc.ZkController.createEphemeralLiveNode Register node as live in ZooKeeper:/live_nodes/127.0.0.1:31724_
   [junit4]   2> 2592975 T7843 oascc.SolrZkClient.makePath makePath: /live_nodes/127.0.0.1:31724_
   [junit4]   2> 2592978 T7843 oasc.Overseer.close Overseer (id=null) closing
   [junit4]   2> 2592983 T7843 oass.SolrDispatchFilter.init user.dir=/usr/home/jenkins/jenkins-slave/workspace/Lucene-Solr-NightlyTests-5.x/solr/build/solr-core/test/J3
   [junit4]   2> 2592983 T7843 oass.SolrDispatchFilter.init SolrDispatchFilter.init() done
   [junit4]   2> 2593128 T7885 oasha.CollectionsHandler.handleCreateAction Creating Collection : numShards=2&name=solrj_collection&wt=javabin&router.field=myOwnField&collection.configName=conf1&action=CREATE&version=2&replicationFactor=2
   [junit4]   2> 2593129 T7880 oasc.DistributedQueue$LatchWatcher.process NodeChildrenChanged fired on path /overseer/collection-queue-work state SyncConnected
   [junit4]   2> 2593130 T7873 oasc.OverseerCollectionProcessor.run Overseer Collection Processor: Get the message id:/overseer/collection-queue-work/qn-0000000000 message:{
   [junit4]   2> 	  "operation":"create",
   [junit4]   2> 	  "fromApi":"true",
   [junit4]   2> 	  "name":"solrj_collection",
   [junit4]   2> 	  "replicationFactor":"2",
   [junit4]   2> 	  "collection.configName":"conf1",
   [junit4]   2> 	  "numShards":"2",
   [junit4]   2> 	  "router.field":"myOwnField"}
   [junit4]   2> 2593131 T7943 oasc.OverseerCollectionProcessor.processMessage WARN OverseerCollectionProcessor.processMessage : create , {
   [junit4]   2> 	  "operation":"create",
   [junit4]   2> 	  "fromApi":"true",
   [junit4]   2> 	  "name":"solrj_collection",
   [junit4]   2> 	  "replicationFactor":"2",
   [junit4]   2> 	  "collection.configName":"conf1",
   [junit4]   2> 	  "numShards":"2",
   [junit4]   2> 	  "router.field":"myOwnField"}
   [junit4]   2> 2593132 T7943 oasc.OverseerCollectionProcessor.createConfNode creating collections conf node /collections/solrj_collection 
   [junit4]   2> 2593133 T7943 oascc.SolrZkClient.makePath makePath: /collections/solrj_collection
   [junit4]   2> 2593135 T7880 oasc.DistributedQueue$LatchWatcher.process NodeChildrenChanged fired on path /overseer/queue state SyncConnected
   [junit4]   2> 2593137 T7872 oasc.Overseer$ClusterStateUpdater.buildCollection building a new collection: solrj_collection
   [junit4]   2> 2593137 T7872 oasc.Overseer$ClusterStateUpdater.createCollection Create collection solrj_collection with shards [shard1, shard2]
   [junit4]   2> 2593138 T7872 oasc.Overseer$ClusterStateUpdater.createCollection state version solrj_collection 1
   [junit4]   2> 2593140 T7880 oascc.ZkStateReader$2.process A cluster state change: WatchedEvent state:SyncConnected type:NodeDataChanged path:/clusterstate.json, has occurred - updating... (live nodes size: 5)
   [junit4]   2> 2593140 T7910 oascc.ZkStateReader$2.process A cluster state change: WatchedEvent state:SyncConnected type:NodeDataChanged path:/clusterstate.json, has occurred - updating... (live nodes size: 5)
   [junit4]   2> 2593140 T7895 oascc.ZkStateReader$2.process A cluster state change: WatchedEvent state:SyncConnected type:NodeDataChanged path:/clusterstate.json, has occurred - updating... (live nodes size: 5)
   [junit4]   2> 2593140 T7925 oascc.ZkStateReader$2.process A cluster state change: WatchedEvent state:SyncConnected type:NodeDataChanged path:/clusterstate.json, has occurred - updating... (live nodes size: 5)
   [junit4]   2> 2593140 T7940 oascc.ZkStateReader$2.process A cluster state change: WatchedEvent state:SyncConnected type:NodeDataChanged path:/clusterstate.json, has occurred - updating... (live nodes size: 5)
   [junit4]   2> 2593140 T7881 oascc.ZkStateReader$2.process A cluster state change: WatchedEvent state:SyncConnected type:NodeDataChanged path:/clusterstate.json, has occurred - updating... (live nodes size: 5)
   [junit4]   2> 2593235 T7943 oasc.OverseerCollectionProcessor.createCollection Creating SolrCores for new collection solrj_collection, shardNames [shard1, shard2] , replicationFactor : 2
   [junit4]   2> 2593236 T7943 oasc.OverseerCollectionProcessor.createCollection Creating shard solrj_collection_shard1_replica1 as part of slice shard1 of collection solrj_collection on 127.0.0.1:31695_
   [junit4]   2> 2593237 T7943 oasc.OverseerCollectionProcessor.createCollection Creating shard solrj_collection_shard1_replica2 as part of slice shard1 of collection solrj_collection on 127.0.0.1:31710_
   [junit4]   2> 2593238 T7943 oasc.OverseerCollectionProcessor.createCollection Creating shard solrj_collection_shard2_replica1 as part of slice shard2 of collection solrj_collection on 127.0.0.1:31724_
   [junit4]   2> 2593239 T7943 oasc.OverseerCollectionProcessor.createCollection Creating shard solrj_collection_shard2_replica2 as part of slice shard2 of collection solrj_collection on 127.0.0.1:31704_
   [junit4]   2> 2593366 T7864 oasha.CoreAdminHandler.handleCreateAction core create command numShards=2&shard=shard1&name=solrj_collection_shard1_replica1&collection=solrj_collection&wt=javabin&collection.configName=conf1&action=CREATE&version=2&qt=/admin/cores
   [junit4]   2> 2593366 T7899 oasha.CoreAdminHandler.handleCreateAction core create command numShards=2&shard=shard1&name=solrj_collection_shard1_replica2&collection=solrj_collection&wt=javabin&collection.configName=conf1&action=CREATE&version=2&qt=/admin/cores
   [junit4]   2> 2593366 T7929 oasha.CoreAdminHandler.handleCreateAction core create command numShards=2&shard=shard2&name=solrj_collection_shard2_replica1&collection=solrj_collection&wt=javabin&collection.configName=conf1&action=CREATE&version=2&qt=/admin/cores
   [junit4]   2> 2593367 T7884 oasha.CoreAdminHandler.handleCreateAction core create command numShards=2&shard=shard2&name=solrj_collection_shard2_replica2&collection=solrj_collection&wt=javabin&collection.configName=conf1&action=CREATE&version=2&qt=/admin/cores
   [junit4]   2> 2593369 T7899 oasc.ZkController.publish publishing core=solrj_collection_shard1_replica2 state=down collection=solrj_collection
   [junit4]   2> 2593369 T7864 oasc.ZkController.publish publishing core=solrj_collection_shard1_replica1 state=down collection=solrj_collection
   [junit4]   2> 2593370 T7929 oasc.ZkController.publish publishing core=solrj_collection_shard2_replica1 state=down collection=solrj_collection
   [junit4]   2> 2593370 T7899 oasc.ZkController.waitForCoreNodeName look for our core node name
   [junit4]   2> 2593370 T7864 oasc.ZkController.waitForCoreNodeName look for our core node name
   [junit4]   2> 2593370 T7880 oasc.DistributedQueue$LatchWatcher.process NodeChildrenChanged fired on path /overseer/queue state SyncConnected
   [junit4]   2> 2593371 T7884 oasc.ZkController.publish publishing core=solrj_collection_shard2_replica2 state=down collection=solrj_collection
   [junit4]   2> 2593371 T7929 oasc.ZkController.waitForCoreNodeName look for our core node name
   [junit4]   2> 2593372 T7884 oasc.ZkController.waitForCoreNodeName look for our core node name
   [junit4]   2> 2593373 T7872 oasc.Overseer$ClusterStateUpdater.updateState Update state numShards=2 message={
   [junit4]   2> 	  "numShards":"2",
   [junit4]   2> 	  "shard":"shard1",
   [junit4]   2> 	  "collection":"solrj_collection",
   [junit4]   2> 	  "roles":null,
   [junit4]   2> 	  "operation":"state",
   [junit4]   2> 	  "core":"solrj_collection_shard1_replica2",
   [junit4]   2> 	  "state":"down",
   [junit4]   2> 	  "node_name":"127.0.0.1:31710_",
   [junit4]   2> 	  "base_url":"https://127.0.0.1:31710"}
   [junit4]   2> 2593375 T7872 oasc.Overseer$ClusterStateUpdater.updateState Update state numShards=2 message={
   [junit4]   2> 	  "numShards":"2",
   [junit4]   2> 	  "shard":"shard1",
   [junit4]   2> 	  "collection":"solrj_collection",
   [junit4]   2> 	  "roles":null,
   [junit4]   2> 	  "operation":"state",
   [junit4]   2> 	  "core":"solrj_collection_shard1_replica1",
   [junit4]   2> 	  "state":"down",
   [junit4]   2> 	  "node_name":"127.0.0.1:31695_",
   [junit4]   2> 	  "base_url":"https://127.0.0.1:31695"}
   [junit4]   2> 2593377 T7880 oasc.DistributedQueue$LatchWatcher.process NodeChildrenChanged fired on path /overseer/queue state SyncConnected
   [junit4]   2> 2593377 T7872 oasc.Overseer$ClusterStateUpdater.updateState Update state numShards=2 message={
   [junit4]   2> 	  "numShards":"2",
   [junit4]   2> 	  "shard":"shard2",
   [junit4]   2> 	  "collection":"solrj_collection",
   [junit4]   2> 	  "roles":null,
   [junit4]   2> 	  "operation":"state",
   [junit4]   2> 	  "core":"solrj_collection_shard2_replica1",
   [junit4]   2> 	  "state":"down",
   [junit4]   2> 	  "node_name":"127.0.0.1:31724_",
   [junit4]   2> 	  "base_url":"https://127.0.0.1:31724"}
   [junit4]   2> 2593379 T7872 oasc.Overseer$ClusterStateUpdater.updateState Update state numShards=2 message={
   [junit4]   2> 	  "numShards":"2",
   [junit4]   2> 	  "shard":"shard2",
   [junit4]   2> 	  "collection":"solrj_collection",
   [junit4]   2> 	  "roles":null,
   [junit4]   2> 	  "operation":"state",
   [junit4]   2> 	  "core":"solrj_collection_shard2_replica2",
   [junit4]   2> 	  "state":"down",
   [junit4]   2> 	  "node_name":"127.0.0.1:31704_",
   [junit4]   2> 	  "base_url":"https://127.0.0.1:31704"}
   [junit4]   2> 2593380 T7880 oasc.DistributedQueue$LatchWatcher.process NodeChildrenChanged fired on path /overseer/queue state SyncConnected
   [junit4]   2> 2593381 T7940 oascc.ZkStateReader$2.process A cluster state change: WatchedEvent state:SyncConnected type:NodeDataChanged path:/clusterstate.json, has occurred - updating... (live nodes size: 5)
   [junit4]   2> 2593381 T7881 oascc.ZkStateReader$2.process A cluster state change: WatchedEvent state:SyncConnected type:NodeDataChanged path:/clusterstate.json, has occurred - updating... (live nodes size: 5)
   [junit4]   2> 2593381 T7895 oascc.ZkStateReader$2.process A cluster state change: WatchedEvent state:SyncConnected type:NodeDataChanged path:/clusterstate.json, has occurred - updating... (live nodes size: 5)
   [junit4]   2> 2593381 T7925 oascc.ZkStateReader$2.process A cluster state change: WatchedEvent state:SyncConnected type:NodeDataChanged path:/clusterstate.json, has occurred - updating... (live nodes size: 5)
   [junit4]   2> 2593381 T7910 oascc.ZkStateReader$2.process A cluster state change: WatchedEvent state:SyncConnected type:NodeDataChanged path:/clusterstate.json, has occurred - updating... (live nodes size: 5)
   [junit4]   2> 2593381 T7880 oascc.ZkStateReader$2.process A cluster state change: WatchedEvent state:SyncConnected type:NodeDataChanged path:/clusterstate.json, has occurred - updating... (live nodes size: 5)
   [junit4]   2> 2594371 T7899 oasc.ZkController.waitForShardId waiting to find shard id in clusterstate for solrj_collection_shard1_replica2
   [junit4]   2> 2594371 T7864 oasc.ZkController.waitForShardId waiting to find shard id in clusterstate for solrj_collection_shard1_replica1
   [junit4]   2> 2594372 T7899 oasc.ZkController.createCollectionZkNode Check for collection zkNode:solrj_collection
   [junit4]   2> 2594372 T7884 oasc.ZkController.waitForShardId waiting to find shard id in clusterstate for solrj_collection_shard2_replica2
   [junit4]   2> 2594373 T7899 oasc.ZkController.createCollectionZkNode Collection zkNode exists
   [junit4]   2> 2594372 T7929 oasc.ZkController.waitForShardId waiting to find shard id in clusterstate for solrj_collection_shard2_replica1
   [junit4]   2> 2594372 T7864 oasc.ZkController.createCollectionZkNode Check for collection zkNode:solrj_collection
   [junit4]   2> 2594374 T7929 oasc.ZkController.createCollectionZkNode Check for collection zkNode:solrj_collection
   [junit4]   2> 2594373 T7899 oascc.ZkStateReader.readConfigName Load collection config from:/collections/solrj_collection
   [junit4]   2> 2594374 T7929 oasc.ZkController.createCollectionZkNode Collection zkNode exists
   [junit4]   2> 2594373 T7884 oasc.ZkController.createCollectionZkNode Check for collection zkNode:solrj_collection
   [junit4]   2> 2594375 T7899 oascc.ZkStateReader.readConfigName path=/collections/solrj_collection configName=conf1 specified config exists in ZooKeeper
   [junit4]   2> 2594375 T7884 oasc.ZkController.createCollectionZkNode Collection zkNode exists
   [junit4]   2> 2594375 T7929 oascc.ZkStateReader.readConfigName Load collection config from:/collections/solrj_collection
   [junit4]   2> 2594374 T7864 oasc.ZkController.createCollectionZkNode Collection zkNode exists
   [junit4]   2> 2594376 T7884 oascc.ZkStateReader.readConfigName Load collection config from:/collections/solrj_collection
   [junit4]   2> 2594375 T7899 oasc.SolrResourceLoader.<init> new SolrResourceLoader for directory: '/usr/home/jenkins/jenkins-slave/workspace/Lucene-Solr-NightlyTests-5.x/solr/build/solr-core/test/J3/temp/solr.cloud.CollectionsAPIDistributedZkTest-6CFAFC4E7B581D4D-001/tempDir-004/solrj_collection_shard1_replica2/'
   [junit4]   2> 2594377 T7929 oascc.ZkStateReader.readConfigName path=/collections/solrj_collection configName=conf1 specified config exists in ZooKeeper
   [junit4]   2> 2594376 T7864 oascc.ZkStateReader.readConfigName Load collection config from:/collections/solrj_collection
   [junit4]   2> 2594377 T7929 oasc.SolrResourceLoader.<init> new SolrResourceLoader for directory: '/usr/home/jenkins/jenkins-slave/workspace/Lucene-Solr-NightlyTests-5.x/solr/build/solr-core/test/J3/temp/solr.cloud.CollectionsAPIDistributedZkTest-6CFAFC4E7B581D4D-001/tempDir-006/solrj_collection_shard2_replica1/'
   [junit4]   2> 2594377 T7884 oascc.ZkStateReader.readConfigName path=/collections/solrj_collection configName=conf1 specified config exists in ZooKeeper
   [junit4]   2> 2594378 T7864 oascc.ZkStateReader.readConfigName path=/collections/solrj_collection configName=conf1 specified config exists in ZooKeeper
   [junit4]   2> 2594378 T7884 oasc.SolrResourceLoader.<init> new SolrResourceLoader for directory: '../../../../../../../../../../../usr/home/jenkins/jenkins-slave/workspace/Lucene-Solr-NightlyTests-5.x/solr/build/solr-core/test/J3/temp/solr.cloud.CollectionsAPIDistributedZkTest-6CFAFC4E7B581D4D-001/tempDir-003/solrj_collection_shard2_replica2/'
   [junit4]   2> 2594379 T7864 oasc.SolrResourceLoader.<init> new SolrResourceLoader for directory: '../../../../../../../../../../../usr/home/jenkins/jenkins-slave/workspace/Lucene-Solr-NightlyTests-5.x/solr/build/solr-core/test/J3/temp/solr.cloud.CollectionsAPIDistributedZkTest-6CFAFC4E7B581D4D-001/tempDir-002/solrj_collection_shard1_replica1/'
   [junit4]   2> 2594454 T7899 oasc.SolrConfig.<init> Using Lucene MatchVersion: 5.0.0
   [junit4]   2> 2594458 T7929 oasc.SolrConfig.<init> Using Lucene MatchVersion: 5.0.0
   [junit4]   2> 2594463 T7884 oasc.SolrConfig.<init> Using Lucene MatchVersion: 5.0.0
   [junit4]   2> 2594468 T7864 oasc.SolrConfig.<init> Using Lucene MatchVersion: 5.0.0
   [junit4]   2> 2594514 T7899 oasc.SolrConfig.<init> Loaded SolrConfig: solrconfig.xml
   [junit4]   2> 2594514 T7929 oasc.SolrConfig.<init> Loaded SolrConfig: solrconfig.xml
   [junit4]   2> 2594519 T7884 oasc.SolrConfig.<init> Loaded SolrConfig: solrconfig.xml
   [junit4]   2> 2594524 T7864 oasc.SolrConfig.<init> Loaded SolrConfig: solrconfig.xml
   [junit4]   2> 2594525 T7864 oass.IndexSchema.readSchema Reading Solr Schema from /configs/conf1/schema.xml
   [junit4]   2> 2594538 T7864 oass.IndexSchema.readSchema [solrj_collection_shard1_replica1] Schema name=test
   [junit4]   2> 2594616 T7929 oass.IndexSchema.readSchema Reading Solr Schema from /configs/conf1/schema.xml
   [junit4]   2> 2594616 T7899 oass.IndexSchema.readSchema Reading Solr Schema from /configs/conf1/schema.xml
   [junit4]   2> 2594620 T7884 oass.IndexSchema.readSchema Reading Solr Schema from /configs/conf1/schema.xml
   [junit4]   2> 2594632 T7929 oass.IndexSchema.readSchema [solrj_collection_shard2_replica1] Schema name=test
   [junit4]   2> 2594632 T7899 oass.IndexSchema.readSchema [solrj_collection_shard1_replica2] Schema name=test
   [junit4]   2> 2594634 T7884 oass.IndexSchema.readSchema [solrj_collection_shard2_replica2] Schema name=test
   [junit4]   2> 2594968 T7864 oass.OpenExchangeRatesOrgProvider.init Initialized with rates=open-exchange-rates.json, refreshInterval=1440.
   [junit4]   2> 2594980 T7864 oass.IndexSchema.readSchema default search field in schema is text
   [junit4]   2> 2594983 T7864 oass.IndexSchema.readSchema unique key field: id
   [junit4]   2> 2594993 T7864 oass.FileExchangeRateProvider.reload Reloading exchange rates from file currency.xml
   [junit4]   2> 2594998 T7864 oass.FileExchangeRateProvider.reload Reloading exchange rates from file currency.xml
   [junit4]   2> 2595003 T7864 oass.OpenExchangeRatesOrgProvider.reload Reloading exchange rates from open-exchange-rates.json
   [junit4]   2> 2595004 T7864 oass.OpenExchangeRatesOrgProvider$OpenExchangeRates.<init> WARN Unknown key IMPORTANT NOTE
   [junit4]   2> 2595006 T7864 oass.OpenExchangeRatesOrgProvider$OpenExchangeRates.<init> WARN Expected key, got STRING
   [junit4]   2> 2595007 T7864 oass.OpenExchangeRatesOrgProvider.reload Reloading exchange rates from open-exchange-rates.json
   [junit4]   2> 2595007 T7864 oass.OpenExchangeRatesOrgProvider$OpenExchangeRates.<init> WARN Unknown key IMPORTANT NOTE
   [junit4]   2> 2595008 T7864 oass.OpenExchangeRatesOrgProvider$OpenExchangeRates.<init> WARN Expected key, got STRING
   [junit4]   2> 2595008 T7864 oasc.CoreContainer.create Creating SolrCore 'solrj_collection_shard1_replica1' using configuration from collection solrj_collection
   [junit4]   2> 2595008 T7864 oasc.SolrCore.initDirectoryFactory org.apache.solr.core.MockDirectoryFactory
   [junit4]   2> 2595009 T7864 oasc.SolrCore.<init> [solrj_collection_shard1_replica1] Opening new SolrCore at ../../../../../../../../../../../usr/home/jenkins/jenkins-slave/workspace/Lucene-Solr-NightlyTests-5.x/solr/build/solr-core/test/J3/temp/solr.cloud.CollectionsAPIDistributedZkTest-6CFAFC4E7B581D4D-001/tempDir-002/solrj_collection_shard1_replica1/, dataDir=/usr/home/jenkins/jenkins-slave/workspace/Lucene-Solr-NightlyTests-5.x/solr/build/solr-core/test/J3/../../../../../../../../../../../usr/home/jenkins/jenkins-slave/workspace/Lucene-Solr-NightlyTests-5.x/solr/build/solr-core/test/J3/temp/solr.cloud.CollectionsAPIDistributedZkTest-6CFAFC4E7B581D4D-001/tempDir-002/solrj_collection_shard1_replica1/data/
   [junit4]   2> 2595009 T7864 oasc.JmxMonitoredMap.<init> JMX monitoring is enabled. Adding Solr mbeans to JMX Server: com.sun.jmx.mbeanserver.JmxMBeanServer@3d5693f
   [junit4]   2> 2595010 T7864 oasc.CachingDirectoryFactory.get return new directory for /usr/home/jenkins/jenkins-slave/workspace/Lucene-Solr-NightlyTests-5.x/solr/build/solr-core/test/J3/../../../../../../../../../../../usr/home/jenkins/jenkins-slave/workspace/Lucene-Solr-NightlyTests-5.x/solr/build/solr-core/test/J3/temp/solr.cloud.CollectionsAPIDistributedZkTest-6CFAFC4E7B581D4D-001/tempDir-002/solrj_collection_shard1_replica1/data
   [junit4]   2> 2595011 T7864 oasc.SolrCore.getNewIndexDir New index directory detected: old=null new=/usr/home/jenkins/jenkins-slave/workspace/Lucene-Solr-NightlyTests-5.x/solr/build/solr-core/test/J3/../../../../../../../../../../../usr/home/jenkins/jenkins-slave/workspace/Lucene-Solr-NightlyTests-5.x/solr/build/solr-core/test/J3/temp/solr.cloud.CollectionsAPIDistributedZkTest-6CFAFC4E7B581D4D-001/tempDir-002/solrj_collection_shard1_replica1/data/index/
   [junit4]   2> 2595011 T7864 oasc.SolrCore.initIndex WARN [solrj_collection_shard1_replica1] Solr index directory '/usr/home/jenkins/jenkins-slave/workspace/Lucene-Solr-NightlyTests-5.x/solr/build/solr-core/test/J3/../../../../../../../../../../../usr/home/jenkins/jenkins-slave/workspace/Lucene-Solr-NightlyTests-5.x/solr/build/solr-core/test/J3/temp/solr.cloud.CollectionsAPIDistributedZkTest-6CFAFC4E7B581D4D-001/tempDir-002/solrj_collection_shard1_replica1/data/index' doesn't exist. Creating new index...
   [junit4]   2> 2595012 T7864 oasc.CachingDirectoryFactory.get return new directory for /usr/home/jenkins/jenkins-slave/workspace/Lucene-Solr-NightlyTests-5.x/solr/build/solr-core/test/J3/../../../../../../../../../../../usr/home/jenkins/jenkins-slave/workspace/Lucene-Solr-NightlyTests-5.x/solr/build/solr-core/test/J3/temp/solr.cloud.CollectionsAPIDistributedZkTest-6CFAFC4E7B581D4D-001/tempDir-002/solrj_collection_shard1_replica1/data/index
   [junit4]   2> 2595012 T7864 oasu.RandomMergePolicy.<init> RandomMergePolicy wrapping class org.apache.lucene.index.LogDocMergePolicy: [LogDocMergePolicy: minMergeSize=1000, mergeFactor=46, maxMergeSize=9223372036854775807, maxMergeSizeForForcedMerge=9223372036854775807, calibrateSizeByDeletes=false, maxMergeDocs=2147483647, maxCFSSegmentSizeMB=8.796093022207999E12, noCFSRatio=1.0]
   [junit4]   2> 2595013 T7864 oasc.SolrDeletionPolicy.onCommit SolrDeletionPolicy.onCommit: commits: num=1
   [junit4]   2> 		commit{dir=MockDirectoryWrapper(RateLimitedDirectoryWrapper(RAMDirectory(id=lucene-2c413925))),segFN=segments_1,generation=1}
   [junit4]   2> 2595014 T7864 oasc.SolrDeletionPolicy.updateCommits newest commit generation = 1
   [junit4]   2> 2595027 T7864 oasup.UpdateRequestProcessorChain.init creating updateRequestProcessorChain "nodistrib"
   [junit4]   2> 2595027 T7864 oasup.UpdateRequestProcessorChain.init creating updateRequestProcessorChain "dedupe"
   [junit4]   2> 2595028 T7864 oasup.UpdateRequestProcessorChain.init inserting DistributedUpdateProcessorFactory into updateRequestProcessorChain "dedupe"
   [junit4]   2> 2595028 T7864 oasup.UpdateRequestProcessorChain.init creating updateRequestProcessorChain "stored_sig"
   [junit4]   2> 2595028 T7864 oasup.UpdateRequestProcessorChain.init inserting DistributedUpdateProcessorFactory into updateRequestProcessorChain "stored_sig"
   [junit4]   2> 2595029 T7864 oasup.UpdateRequestProcessorChain.init creating updateRequestProcessorChain "distrib-dup-test-chain-explicit"
   [junit4]   2> 2595029 T7864 oasup.UpdateRequestProcessorChain.init creating updateRequestProcessorChain "distrib-dup-test-chain-implicit"
   [junit4]   2> 2595030 T7864 oasup.UpdateRequestProcessorChain.init inserting DistributedUpdateProcessorFactory into updateRequestProcessorChain "distrib-dup-test-chain-implicit"
   [junit4]   2> 2595030 T7864 oasc.SolrCore.loadUpdateProcessorChains no updateRequestProcessorChain defined as default, creating implicit default
   [junit4]   2> 2595031 T7864 oasc.RequestHandlers.initHandlersFromConfig created /update/json: org.apache.solr.handler.UpdateRequestHandler
   [junit4]   2> 2595032 T7864 oasc.RequestHandlers.initHandlersFromConfig created /update/json/docs: org.apache.solr.handler.UpdateRequestHandler
   [junit4]   2> 2595032 T7864 oasc.RequestHandlers.initHandlersFromConfig created /update/csv: org.apache.solr.handler.UpdateRequestHandler
   [junit4]   2> 2595033 T7864 oasc.RequestHandlers.initHandlersFromConfig created standard: solr.StandardRequestHandler
   [junit4]   2> 2595034 T7864 oasc.RequestHandlers.initHandlersFromConfig created /get: solr.RealTimeGetHandler
   [junit4]   2> 2595034 T7864 oasc.RequestHandlers.initHandlersFromConfig adding lazy requestHandler: solr.ReplicationHandler
   [junit4]   2> 2595035 T7864 oasc.RequestHandlers.initHandlersFromConfig created /replication: solr.ReplicationHandler
   [junit4]   2> 2595035 T7864 oasc.RequestHandlers.initHandlersFromConfig created /update: solr.UpdateRequestHandler
   [junit4]   2> 2595036 T7864 oasc.RequestHandlers.initHandlersFromConfig created /admin/: org.apache.solr.handler.admin.AdminHandlers
   [junit4]   2> 2595036 T7864 oasc.RequestHandlers.initHandlersFromConfig created /admin/file: solr.admin.ShowFileRequestHandler
   [junit4]   2> 2595037 T7864 oasc.RequestHandlers.initHandlersFromConfig created /admin/fileedit: solr.admin.EditFileRequestHandler
   [junit4]   2> 2595060 T7864 oashl.XMLLoader.init xsltCacheLifetimeSeconds=60
   [junit4]   2> 2595063 T7864 oashl.XMLLoader.init xsltCacheLifetimeSeconds=60
   [junit4]   2> 2595065 T7864 oashl.XMLLoader.init xsltCacheLifetimeSeconds=60
   [junit4]   2> 2595068 T7864 oashl.XMLLoader.init xsltCacheLifetimeSeconds=60
   [junit4]   2> 2595069 T7899 oass.OpenExchangeRatesOrgProvider.init Initialized with rates=open-exchange-rates.json, refreshInterval=1440.
   [junit4]   2> 2595071 T7884 oass.OpenExchangeRatesOrgProvider.init Initialized with rates=open-exchange-rates.json, refreshInterval=1440.
   [junit4]   2> 2595071 T7929 oass.OpenExchangeRatesOrgProvider.init Initialized with rates=open-exchange-rates.json, refreshInterval=1440.
   [junit4]   2> 2595075 T7864 oasu.CommitTracker.<init> Hard AutoCommit: disabled
   [junit4]   2> 2595076 T7864 oasu.CommitTracker.<init> Soft AutoCommit: disabled
   [junit4]   2> 2595076 T7899 oass.IndexSchema.readSchema default search field in schema is text
   [junit4]   2> 2595076 T7864 oasu.RandomMergePolicy.<init> RandomMergePolicy wrapping class org.apache.lucene.index.LogDocMergePolicy: [LogDocMergePolicy: minMergeSize=1000, mergeFactor=38, maxMergeSize=9223372036854775807, maxMergeSizeForForcedMerge=9223372036854775807, calibrateSizeByDeletes=false, maxMergeDocs=2147483647, maxCFSSegmentSizeMB=8.796093022207999E12, noCFSRatio=1.0]
   [junit4]   2> 2595077 T7864 oasc.SolrDeletionPolicy.onInit SolrDeletionPolicy.onInit: commits: num=1
   [junit4]   2> 		commit{dir=MockDirectoryWrapper(RateLimitedDirectoryWrapper(RAMDirectory(id=lucene-2c413925))),segFN=segments_1,generation=1}
   [junit4]   2> 2595078 T7864 oasc.SolrDeletionPolicy.updateCommits newest commit generation = 1
   [junit4]   2> 2595078 T7884 oass.IndexSchema.readSchema default search field in schema is text
   [junit4]   2> 2595078 T7864 oass.SolrIndexSearcher.<init> Opening Searcher@7badb491[solrj_collection_shard1_replica1] main
   [junit4]   2> 2595079 T7929 oass.IndexSchema.readSchema default search field in schema is text
   [junit4]   2> 2595079 T7864 oascc.ZkStateReader.readConfigName Load collection config from:/collections/solrj_collection
   [junit4]   2> 2595080 T7899 oass.IndexSchema.readSchema unique key field: id
   [junit4]   2> 2595080 T7864 oascc.ZkStateReader.readConfigName path=/collections/solrj_collection configName=conf1 specified config exists in ZooKeeper
   [junit4]   2> 2595080 T7864 oasr.ManagedResourceStorage.newStorageIO Setting up ZooKeeper-based storage for the RestManager with znodeBase: /configs/conf1
   [junit4]   2> 2595081 T7864 oasr.ManagedResourceStorage$ZooKeeperStorageIO.configure Configured ZooKeeperStorageIO with znodeBase: /configs/conf1
   [junit4]   2> 2595081 T7864 oasr.RestManager.init Initializing RestManager with initArgs: {}
   [junit4]   2> 2595081 T7884 oass.IndexSchema.readSchema unique key field: id
   [junit4]   2> 2595081 T7864 oasr.ManagedResourceStorage.load Reading _rest_managed.json using ZooKeeperStorageIO:path=/configs/conf1
   [junit4]   2> 2595082 T7929 oass.IndexSchema.readSchema unique key field: id
   [junit4]   2> 2595082 T7864 oasr.ManagedResourceStorage$ZooKeeperStorageIO.openInputStream No data found for znode /configs/conf1/_rest_managed.json
   [junit4]   2> 2595083 T7864 oasr.ManagedResourceStorage.load Loaded null at path _rest_managed.json using ZooKeeperStorageIO:path=/configs/conf1
   [junit4]   2> 2595083 T7864 oascc.SolrZkClient.makePath makePath: /configs/conf1/_rest_managed.json
   [junit4]   2> 2595085 T7864 oasr.ManagedResourceStorage$ZooKeeperStorageIO$1.close Wrote 38 bytes to new znode /configs/conf1/_rest_managed.json
   [junit4]   2> 2595086 T7864 oasr.ManagedResourceStorage$JsonStorage.store Saved JSON object to path _rest_managed.json using ZooKeeperStorageIO:path=/configs/conf1
   [junit4]   2> 2595086 T7864 oasr.RestManager.init Initializing 0 registered ManagedResources
   [junit4]   2> 2595090 T7952 oasc.SolrCore.registerSearcher [solrj_collection_shard1_replica1] Registered new searcher Searcher@7badb491[solrj_collection_shard1_replica1] main{ExitableDirectoryReader(UninvertingDirectoryReader())}
   [junit4]   2> 2595091 T7899 oass.FileExchangeRateProvider.reload Reloading exchange rates from file currency.xml
   [junit4]   2> 2595093 T7884 oass.FileExchangeRateProvider.reload Reloading exchange rates from file currency.xml
   [junit4]   2> 2595093 T7929 oass.FileExchangeRateProvider.reload Reloading exchange rates from file currency.xml
   [junit4]   2> 2595093 T7864 oasc.CoreContainer.registerCore registering core: solrj_collection_shard1_replica1
   [junit4]   2> 2595094 T7864 oasc.ZkController.register Register replica - core:solrj_collection_shard1_replica1 address:https://127.0.0.1:31695 collection:solrj_collection shard:shard1
   [junit4]   2> 2595095 T7864 oascc.SolrZkClient.makePath makePath: /collections/solrj_collection/leader_elect/shard1/election
   [junit4]   2> 2595096 T7899 oass.FileExchangeRateProvider.reload Reloading exchange rates from file currency.xml
   [junit4]   2> 2595097 T7929 oass.FileExchangeRateProvider.reload Reloading exchange rates from file currency.xml
   [junit4]   2> 2595097 T7884 oass.FileExchangeRateProvider.reload Reloading exchange rates from file currency.xml
   [junit4]   2> 2595099 T7864 oasc.ShardLeaderElectionContext.runLeaderProcess Running the leader process for shard shard1
   [junit4]   2> 2595100 T7880 oasc.DistributedQueue$LatchWatcher.process NodeChildrenChanged fired on path /overseer/queue state SyncConnected
   [junit4]   2> 2595101 T7864 oasc.ShardLeaderElectionContext.waitForReplicasToComeUp Waiting until we see more replicas up for shard shard1: total=2 found=1 timeoutin=0ms
   [junit4]   2> 2595101 T7864 oasc.ShardLeaderElectionContext.waitForReplicasToComeUp Was waiting for replicas to come up, but they are taking too long - assuming they won't come back till later
   [junit4]   2> 2595101 T7899 oass.OpenExchangeRatesOrgProvider.reload Reloading exchange rates from open-exchange-rates.json
   [junit4]   2> 2595101 T7864 oasc.ShardLeaderElectionContext.runLeaderProcess I may be the new leader - try and sync
   [junit4]   2> ASYNC  NEW_CORE C674 name=solrj_collection_shard1_replica1 org.apache.solr.core.SolrCore@7f80f2a3 url=https://127.0.0.1:31695/solrj_collection_shard1_replica1 node=127.0.0.1:31695_ C674_STATE=coll:solrj_collection core:solrj_collection_shard1_replica1 props:{core=solrj_collection_shard1_replica1, state=down, node_name=127.0.0.1:31695_, base_url=https://127.0.0.1:31695}
   [junit4]   2> 2595102 T7864 C674 P31695 oasc.SyncStrategy.sync Sync replicas to https://127.0.0.1:31695/solrj_collection_shard1_replica1/
   [junit4]   2> 2595102 T7899 oass.OpenExchangeRatesOrgProvider$OpenExchangeRates.<init> WARN Unknown key IMPORTANT NOTE
   [junit4]   2> 2595102 T7884 oass.OpenExchangeRatesOrgProvider.reload Reloading exchange rates from open-exchange-rates.json
   [junit4]   2> 2595102 T7929 oass.OpenExchangeRatesOrgProvider.reload Reloading exchange rates from open-exchange-rates.json
   [junit4]   2> 2595103 T7899 oass.OpenExchangeRatesOrgProvider$OpenExchangeRates.<init> WARN Expected key, got STRING
   [junit4]   2> 2595104 T7884 oass.OpenExchangeRatesOrgProvider$OpenExchangeRates.<init> WARN Unknown key IMPORTANT NOTE
   [junit4]   2> 2595103 T7864 C674 P31695 oasu.PeerSync.sync PeerSync: core=solrj_collection_shard1_replica1 url=https://127.0.0.1:31695 START replicas=[https://127.0.0.1:31710/solrj_collection_shard1_replica2/] nUpdates=100
   [junit4]   2> 2595104 T7880 oascc.ZkStateReader$2.process A cluster state change: WatchedEvent state:SyncConnected type:NodeDataChanged path:/clusterstate.json, has occurred - updating... (live nodes size: 5)
   [junit4]   2> 2595105 T7925 oascc.ZkStateReader$2.process A cluster state change: WatchedEvent state:SyncConnected type:NodeDataChanged path:/clusterstate.json, has occurred - updating... (live nodes size: 5)
   [junit4]   2> 2595104 T7940 oascc.ZkStateReader$2.process A cluster state change: WatchedEvent state:SyncConnected type:NodeDataChanged path:/clusterstate.json, has occurred - updating... (live nodes size: 5)
   [junit4]   2> 2595104 T7910 oascc.ZkStateReader$2.process A cluster state change: WatchedEvent state:SyncConnected type:NodeDataChanged path:/clusterstate.json, has occurred - updating... (live nodes size: 5)
   [junit4]   2> 2595105 T7895 oascc.ZkStateReader$2.process A cluster state change: WatchedEvent state:SyncConnected type:NodeDataChanged path:/clusterstate.json, has occurred - updating... (live nodes size: 5)
   [junit4]   2> 2595104 T7881 oascc.ZkStateReader$2.process A cluster state change: WatchedEvent state:SyncConnected type:NodeDataChanged path:/clusterstate.json, has occurred - updating... (live nodes size: 5)
   [junit4]   2> 2595104 T7884 oass.OpenExchangeRatesOrgProvider$OpenExchangeRates.<init> WARN Expected key, got STRING
   [junit4]   2> 2595104 T7929 oass.OpenExchangeRatesOrgProvider$OpenExchangeRates.<init> WARN Unknown key IMPORTANT NOTE
   [junit4]   2> 2595104 T7899 oass.OpenExchangeRatesOrgProvider.reload Reloading exchange rates from open-exchange-rates.json
   [junit4]   2> 2595108 T7929 oass.OpenExchangeRatesOrgProvider$OpenExchangeRates.<init> WARN Expected key, got STRING
   [junit4]   2> 2595108 T7884 oass.OpenExchangeRatesOrgProvider.reload Reloading exchange rates from open-exchange-rates.json
   [junit4]   2> 2595105 T7864 C674 P31695 oasu.PeerSync.sync PeerSync: core=solrj_collection_shard1_replica1 url=https://127.0.0.1:31695 DONE.  We have no versions.  sync failed.
   [junit4]   2> 2595110 T7884 oass.OpenExchangeRatesOrgProvider$OpenExchangeRates.<init> WARN Unknown key IMPORTANT NOTE
   [junit4]   2> 2595110 T7864 C674 P31695 oasc.SyncStrategy.syncReplicas Leader's attempt to sync with shard failed, moving to the next candidate
   [junit4]   2> 2595109 T7899 oass.OpenExchangeRatesOrgProvider$OpenExchangeRates.<init> WARN Unknown key IMPORTANT NOTE
   [junit4]   2> 2595111 T7899 oass.OpenExchangeRatesOrgProvider$OpenExchangeRates.<init> WARN Expected key, got STRING
   [junit4]   2> 2595109 T7929 oass.OpenExchangeRatesOrgProvider.reload Reloading exchange rates from open-exchange-rates.json
   [junit4]   2> 2595111 T7899 oasc.CoreContainer.create Creating SolrCore 'solrj_collection_shard1_replica2' using configuration from collection solrj_collection
   [junit4]   2> 2595111 T7864 oasc.ShardLeaderElectionContext.runLeaderProcess We failed sync, but we have no versions - we can't sync in that case - we were active before, so become leader anyway
   [junit4]   2> 2595110 T7884 oass.OpenExchangeRatesOrgProvider$OpenExchangeRates.<init> WARN Expected key, got STRING
   [junit4]   2> 2595112 T7864 oasc.ShardLeaderElectionContext.runLeaderProcess I am the new leader: https://127.0.0.1:31695/solrj_collection_shard1_replica1/ shard1
   [junit4]   2> 2595112 T7929 oass.OpenExchangeRatesOrgProvider$OpenExchangeRates.<init> WARN Unknown key IMPORTANT NOTE
   [junit4]   2> 2595113 T7929 oass.OpenExchangeRatesOrgProvider$OpenExchangeRates.<init> WARN Expected key, got STRING
   [junit4]   2> 2595112 T7899 oasc.SolrCore.initDirectoryFactory org.apache.solr.core.MockDirectoryFactory
   [junit4]   2> 2595114 T7929 oasc.CoreContainer.create Creating SolrCore 'solrj_collection_shard2_replica1' using configuration from collection solrj_collection
   [junit4]   2> 2595113 T7864 oascc.SolrZkClient.makePath makePath: /collections/solrj_collection/leaders/shard1
   [junit4]   2> 2595113 T7884 oasc.CoreContainer.create Creating SolrCore 'solrj_collection_shard2_replica2' using configuration from collection solrj_collection
   [junit4]   2> 2595114 T7929 oasc.SolrCore.initDirectoryFactory org.apache.solr.core.MockDirectoryFactory
   [junit4]   2> 2595114 T7899 oasc.SolrCore.<init> [solrj_collection_shard1_replica2] Opening new SolrCore at /usr/home/jenkins/jenkins-slave/workspace/Lucene-Solr-NightlyTests-5.x/solr/build/solr-core/test/J3/temp/solr.cloud.CollectionsAPIDistributedZkTest-6CFAFC4E7B581D4D-001/tempDir-004/solrj_collection_shard1_replica2/, dataDir=/usr/home/jenkins/jenkins-slave/workspace/Lucene-Solr-NightlyTests-5.x/solr/build/solr-core/test/J3/temp/solr.cloud.CollectionsAPIDistributedZkTest-6CFAFC4E7B581D4D-001/tempDir-004/solrj_collection_shard1_replica2/data/
   [junit4]   2> 2595115 T7929 oasc.SolrCore.<init> [solrj_collection_shard2_replica1] Opening new SolrCore at /usr/home/jenkins/jenkins-slave/workspace/Lucene-Solr-NightlyTests-5.x/solr/build/solr-core/test/J3/temp/solr.cloud.CollectionsAPIDistributedZkTest-6CFAFC4E7B581D4D-001/tempDir-006/solrj_collection_shard2_replica1/, dataDir=/usr/home/jenkins/jenkins-slave/workspace/Lucene-Solr-NightlyTests-5.x/solr/build/solr-core/test/J3/temp/solr.cloud.CollectionsAPIDistributedZkTest-6CFAFC4E7B581D4D-001/tempDir-006/solrj_collection_shard2_replica1/data/
   [junit4]   2> 2595115 T7884 oasc.SolrCore.initDirectoryFactory org.apache.solr.core.MockDirectoryFactory
   [junit4]   2> 2595116 T7929 oasc.JmxMonitoredMap.<init> JMX monitoring is enabled. Adding Solr mbeans to JMX Server: com.sun.jmx.mbeanserver.JmxMBeanServer@3d5693f
   [junit4]   2> 2595116 T7899 oasc.JmxMonitoredMap.<init> JMX monitoring is enabled. Adding Solr mbeans to JMX Server: com.sun.jmx.mbeanserver.JmxMBeanServer@3d5693f
   [junit4]   2> 2595116 T7884 oasc.SolrCore.<init> [solrj_collection_shard2_replica2] Opening new SolrCore at ../../../../../../../../../../../usr/home/jenkins/jenkins-slave/workspace/Lucene-Solr-NightlyTests-5.x/solr/build/solr-core/test/J3/temp/solr.cloud.CollectionsAPIDistributedZkTest-6CFAFC4E7B581D4D-001/tempDir-003/solrj_collection_shard2_replica2/, dataDir=/usr/home/jenkins/jenkins-slave/workspace/Lucene-Solr-NightlyTests-5.x/solr/build/solr-core/test/J3/../../../../../../../../../../../usr/home/jenkins/jenkins-slave/workspace/Lucene-Solr-NightlyTests-5.x/solr/build/solr-core/test/J3/temp/solr.cloud.CollectionsAPIDistributedZkTest-6CFAFC4E7B581D4D-001/tempDir-003/solrj_collection_shard2_replica2/data/
   [junit4]   2> 2595117 T7884 oasc.JmxMonitoredMap.<init> JMX monitoring is enabled. Adding Solr mbeans to JMX Server: com.sun.jmx.mbeanserver.JmxMBeanServer@3d5693f
   [junit4]   2> 2595118 T7899 oasc.CachingDirectoryFactory.get return new directory for /usr/home/jenkins/jenkins-slave/workspace/Lucene-Solr-NightlyTests-5.x/solr/build/solr-core/test/J3/temp/solr.cloud.CollectionsAPIDistributedZkTest-6CFAFC4E7B581D4D-001/tempDir-004/solrj_collection_shard1_replica2/data
   [junit4]   2> 2595118 T7880 oasc.DistributedQueue$LatchWatcher.process NodeChildrenChanged fired on path /overseer/queue state SyncConnected
   [junit4]   2> 2595117 T7929 oasc.CachingDirectoryFactory.get return new directory for /usr/home/jenkins/jenkins-slave/workspace/Lucene-Solr-NightlyTests-5.x/solr/build/solr-core/test/J3/temp/solr.cloud.CollectionsAPIDistributedZkTest-6CFAFC4E7B581D4D-001/tempDir-006/solrj_collection_shard2_replica1/data
   [junit4]   2> 2595118 T7884 oasc.CachingDirectoryFactory.get return new directory for /usr/home/jenkins/jenkins-slave/workspace/Lucene-Solr-NightlyTests-5.x/solr/build/solr-core/test/J3/../../../../../../../../../../../usr/home/jenkins/jenkins-slave/workspace/Lucene-Solr-NightlyTests-5.x/solr/build/solr-core/test/J3/temp/solr.cloud.CollectionsAPIDistributedZkTest-6CFAFC4E7B581D4D-001/tempDir-003/solrj_collection_shard2_replica2/data
   [junit4]   2> 2595118 T7899 oasc.SolrCore.getNewIndexDir New index directory detected: old=null new=/usr/home/jenkins/jenkins-slave/workspace/Lucene-Solr-NightlyTests-5.x/solr/build/solr-core/test/J3/temp/solr.cloud.CollectionsAPIDistributedZkTest-6CFAFC4E7B581D4D-001/tempDir-004/solrj_collection_shard1_replica2/data/index/
   [junit4]   2> 2595119 T7884 oasc.SolrCore.getNewIndexDir New index directory detected: old=null new=/usr/home/jenkins/jenkins-slave/workspace/Lucene-Solr-NightlyTests-5.x/solr/build/solr-core/test/J3/../../../../../../../../../../../usr/home/jenkins/jenkins-slave/workspace/Lucene-Solr-NightlyTests-5.x/solr/build/solr-core/test/J3/temp/solr.c

[...truncated too long message...]

onsAPIDistributedZkTest-6CFAFC4E7B581D4D-001/tempDir-006/solr.xml
   [junit4]   2> 3517256 T8736 oass.SolrDispatchFilter.handleAdminRequest [admin] webapp=null path=/admin/cores params={numShards=6&shard=shard5&name=awholynewstresscollection_collection1_3_shard5_replica1&collection=awholynewstresscollection_collection1_3&wt=javabin&collection.configName=conf1&action=CREATE&version=2&qt=/admin/cores} status=0 QTime=784542 
   [junit4]   2> 3517256 T8736 oasc.SolrException.log ERROR null:org.eclipse.jetty.io.EofException
   [junit4]   2> 		at org.eclipse.jetty.server.HttpOutput.write(HttpOutput.java:142)
   [junit4]   2> 		at org.eclipse.jetty.server.HttpOutput.write(HttpOutput.java:107)
   [junit4]   2> 		at org.apache.solr.common.util.FastOutputStream.flush(FastOutputStream.java:214)
   [junit4]   2> 		at org.apache.solr.common.util.FastOutputStream.flushBuffer(FastOutputStream.java:207)
   [junit4]   2> 		at org.apache.solr.common.util.JavaBinCodec.marshal(JavaBinCodec.java:98)
   [junit4]   2> 		at org.apache.solr.response.BinaryResponseWriter.write(BinaryResponseWriter.java:52)
   [junit4]   2> 		at org.apache.solr.response.QueryResponseWriterUtil.writeQueryResponse(QueryResponseWriterUtil.java:50)
   [junit4]   2> 		at org.apache.solr.servlet.SolrDispatchFilter.writeResponse(SolrDispatchFilter.java:763)
   [junit4]   2> 		at org.apache.solr.servlet.SolrDispatchFilter.handleAdminRequest(SolrDispatchFilter.java:743)
   [junit4]   2> 		at org.apache.solr.servlet.SolrDispatchFilter.doFilter(SolrDispatchFilter.java:253)
   [junit4]   2> 		at org.apache.solr.servlet.SolrDispatchFilter.doFilter(SolrDispatchFilter.java:202)
   [junit4]   2> 		at org.eclipse.jetty.servlet.ServletHandler$CachedChain.doFilter(ServletHandler.java:1419)
   [junit4]   2> 		at org.apache.solr.client.solrj.embedded.JettySolrRunner$DebugFilter.doFilter(JettySolrRunner.java:137)
   [junit4]   2> 		at org.eclipse.jetty.servlet.ServletHandler$CachedChain.doFilter(ServletHandler.java:1419)
   [junit4]   2> 		at org.eclipse.jetty.servlet.ServletHandler.doHandle(ServletHandler.java:455)
   [junit4]   2> 		at org.eclipse.jetty.server.session.SessionHandler.doHandle(SessionHandler.java:229)
   [junit4]   2> 		at org.eclipse.jetty.server.handler.ScopedHandler.handle(ScopedHandler.java:137)
   [junit4]   2> 		at org.eclipse.jetty.server.handler.GzipHandler.handle(GzipHandler.java:301)
   [junit4]   2> 		at org.eclipse.jetty.server.handler.ContextHandler.doHandle(ContextHandler.java:1077)
   [junit4]   2> 		at org.eclipse.jetty.servlet.ServletHandler.doScope(ServletHandler.java:384)
   [junit4]   2> 		at org.eclipse.jetty.server.session.SessionHandler.doScope(SessionHandler.java:193)
   [junit4]   2> 		at org.eclipse.jetty.server.handler.ContextHandler.doScope(ContextHandler.java:1009)
   [junit4]   2> 		at org.eclipse.jetty.server.handler.ScopedHandler.handle(ScopedHandler.java:135)
   [junit4]   2> 		at org.eclipse.jetty.server.handler.HandlerWrapper.handle(HandlerWrapper.java:116)
   [junit4]   2> 		at org.eclipse.jetty.server.Server.handle(Server.java:368)
   [junit4]   2> 		at org.eclipse.jetty.server.AbstractHttpConnection.handleRequest(AbstractHttpConnection.java:489)
   [junit4]   2> 		at org.eclipse.jetty.server.BlockingHttpConnection.handleRequest(BlockingHttpConnection.java:53)
   [junit4]   2> 		at org.eclipse.jetty.server.AbstractHttpConnection.content(AbstractHttpConnection.java:953)
   [junit4]   2> 		at org.eclipse.jetty.server.AbstractHttpConnection$RequestHandler.content(AbstractHttpConnection.java:1014)
   [junit4]   2> 		at org.eclipse.jetty.http.HttpParser.parseNext(HttpParser.java:861)
   [junit4]   2> 		at org.eclipse.jetty.http.HttpParser.parseAvailable(HttpParser.java:240)
   [junit4]   2> 		at org.eclipse.jetty.server.BlockingHttpConnection.handle(BlockingHttpConnection.java:72)
   [junit4]   2> 		at org.eclipse.jetty.server.bio.SocketConnector$ConnectorEndPoint.run(SocketConnector.java:264)
   [junit4]   2> 		at org.eclipse.jetty.server.ssl.SslSocketConnector$SslConnectorEndPoint.run(SslSocketConnector.java:670)
   [junit4]   2> 		at org.eclipse.jetty.util.thread.QueuedThreadPool.runJob(QueuedThreadPool.java:608)
   [junit4]   2> 		at org.eclipse.jetty.util.thread.QueuedThreadPool$3.run(QueuedThreadPool.java:543)
   [junit4]   2> 		at java.lang.Thread.run(Thread.java:745)
   [junit4]   2> 	
   [junit4]   2> 3518717 T7843 oas.SolrTestCaseJ4.tearDown ###Ending testDistribSearch
   [junit4]   2> 3518721 T7843 oasc.ZkTestServer.send4LetterWord connecting to 127.0.0.1:31689 31689
   [junit4]   2> 3519451 T8330 oasc.ZkTestServer.send4LetterWord connecting to 127.0.0.1:31689 31689
   [junit4]   2> NOTE: download the large Jenkins line-docs file by running 'ant get-jenkins-line-docs' in the lucene directory.
   [junit4]   2> NOTE: reproduce with: ant test  -Dtestcase=CollectionsAPIDistributedZkTest -Dtests.method=testDistribSearch -Dtests.seed=6CFAFC4E7B581D4D -Dtests.multiplier=2 -Dtests.nightly=true -Dtests.slow=true -Dtests.linedocsfile=/home/jenkins/lucene-data/enwiki.random.lines.txt -Dtests.locale=th_TH_TH_#u-nu-thai -Dtests.timezone=Europe/Kiev -Dtests.asserts=true -Dtests.file.encoding=UTF-8
   [junit4] ERROR    938s J3 | CollectionsAPIDistributedZkTest.testDistribSearch <<<
   [junit4]    > Throwable #1: org.apache.solr.client.solrj.impl.HttpSolrServer$RemoteSolrException: Error CREATEing SolrCore 'halfcollection_shard1_replica1': Unable to create core [halfcollection_shard1_replica1] Caused by: Could not get shard id for core: halfcollection_shard1_replica1
   [junit4]    > 	at __randomizedtesting.SeedInfo.seed([6CFAFC4E7B581D4D:ED1C72560C077D71]:0)
   [junit4]    > 	at org.apache.solr.client.solrj.impl.HttpSolrServer.executeMethod(HttpSolrServer.java:569)
   [junit4]    > 	at org.apache.solr.client.solrj.impl.HttpSolrServer.request(HttpSolrServer.java:215)
   [junit4]    > 	at org.apache.solr.client.solrj.impl.HttpSolrServer.request(HttpSolrServer.java:211)
   [junit4]    > 	at org.apache.solr.cloud.CollectionsAPIDistributedZkTest.testErrorHandling(CollectionsAPIDistributedZkTest.java:583)
   [junit4]    > 	at org.apache.solr.cloud.CollectionsAPIDistributedZkTest.doTest(CollectionsAPIDistributedZkTest.java:205)
   [junit4]    > 	at org.apache.solr.BaseDistributedSearchTestCase.testDistribSearch(BaseDistributedSearchTestCase.java:869)
   [junit4]    > 	at java.lang.Thread.run(Thread.java:745)
   [junit4]   2> 3519476 T7843 oas.SolrTestCaseJ4.deleteCore ###deleteCore
   [junit4]   2> NOTE: leaving temporary files on disk at: /usr/home/jenkins/jenkins-slave/workspace/Lucene-Solr-NightlyTests-5.x/solr/build/solr-core/test/J3/temp/solr.cloud.CollectionsAPIDistributedZkTest-6CFAFC4E7B581D4D-001
   [junit4]   2> NOTE: test params are: codec=CheapBastard, sim=DefaultSimilarity, locale=th_TH_TH_#u-nu-thai, timezone=Europe/Kiev
   [junit4]   2> NOTE: FreeBSD 9.1-RELEASE-p3 amd64/Oracle Corporation 1.7.0_65 (64-bit)/cpus=16,threads=1,free=144929136,total=438829056
   [junit4]   2> NOTE: All tests run in this JVM: [DeleteReplicaTest, BadIndexSchemaTest, UnloadDistributedZkTest, TestSchemaSimilarityResource, RollingRestartTest, TestFreeTextSuggestions, OverriddenZkACLAndCredentialsProvidersTest, TestManagedSchema, LeaderElectionTest, TestManagedResourceStorage, TestSolrQueryParserResource, HdfsBasicDistributedZk2Test, TestOrdValues, TestFieldResource, TermVectorComponentTest, CoreAdminHandlerTest, CoreContainerCoreInitFailuresTest, TestCursorMarkWithoutUniqueKey, FieldMutatingUpdateProcessorTest, ResponseLogComponentTest, TestLRUCache, TestDocSet, TestManagedSchemaFieldResource, TestSort, TestInitQParser, TestCoreDiscovery, LeaderInitiatedRecoveryOnCommitTest, SpellCheckComponentTest, TestSerializedLuceneMatchVersion, TestPHPSerializedResponseWriter, BlockCacheTest, DeleteLastCustomShardedReplicaTest, TimeZoneUtilsTest, TestMergePolicyConfig, AddSchemaFieldsUpdateProcessorFactoryTest, StandardRequestHandlerTest, AsyncMigrateRouteKeyTest, SpellPossibilityIteratorTest, TestIntervalFaceting, RequestHandlersTest, DocValuesMultiTest, TestReplicationHandlerBackup, TriLevelCompositeIdRoutingTest, UniqFieldsUpdateProcessorFactoryTest, SearchHandlerTest, TestDistribDocBasedVersion, TestSolrXml, ZkCLITest, BadCopyFieldTest, CollectionsAPIDistributedZkTest]
   [junit4] Completed on J3 in 937.63s, 1 test, 1 error <<< FAILURES!

[...truncated 48 lines...]
BUILD FAILED
/usr/home/jenkins/jenkins-slave/workspace/Lucene-Solr-NightlyTests-5.x/build.xml:532: The following error occurred while executing this line:
/usr/home/jenkins/jenkins-slave/workspace/Lucene-Solr-NightlyTests-5.x/build.xml:473: The following error occurred while executing this line:
/usr/home/jenkins/jenkins-slave/workspace/Lucene-Solr-NightlyTests-5.x/build.xml:61: The following error occurred while executing this line:
/usr/home/jenkins/jenkins-slave/workspace/Lucene-Solr-NightlyTests-5.x/extra-targets.xml:39: The following error occurred while executing this line:
/usr/home/jenkins/jenkins-slave/workspace/Lucene-Solr-NightlyTests-5.x/solr/build.xml:189: The following error occurred while executing this line:
/usr/home/jenkins/jenkins-slave/workspace/Lucene-Solr-NightlyTests-5.x/solr/common-build.xml:502: The following error occurred while executing this line:
/usr/home/jenkins/jenkins-slave/workspace/Lucene-Solr-NightlyTests-5.x/lucene/common-build.xml:1359: The following error occurred while executing this line:
/usr/home/jenkins/jenkins-slave/workspace/Lucene-Solr-NightlyTests-5.x/lucene/common-build.xml:966: There were test failures: 441 suites, 1804 tests, 1 error, 54 ignored (9 assumptions)

Total time: 229 minutes 35 seconds
Build step 'Invoke Ant' marked build as failure
Archiving artifacts
Sending artifact delta relative to Lucene-Solr-NightlyTests-5.x #654
Archived 5 artifacts
Archive block size is 32768
Received 0 blocks and 657922065 bytes
Compression is 0.0%
Took 1 min 57 sec
Recording test results
Email was triggered for: Failure
Sending email for trigger: Failure



Mime
View raw message