lucene-dev mailing list archives

Site index · List index
Message view « Date » · « Thread »
Top « Date » · « Thread »
From Policeman Jenkins Server <jenk...@thetaphi.de>
Subject [JENKINS] Lucene-Solr-4.10-Linux (64bit/jdk1.9.0-ea-b34) - Build # 73 - Failure!
Date Mon, 10 Nov 2014 16:36:54 GMT
Build: http://jenkins.thetaphi.de/job/Lucene-Solr-4.10-Linux/73/
Java: 64bit/jdk1.9.0-ea-b34 -XX:+UseCompressedOops -XX:+UseSerialGC (asserts: true)

1 tests failed.
REGRESSION:  org.apache.lucene.analysis.core.TestRandomChains.testRandomChains

Error Message:
startOffset must be non-negative, and endOffset must be >= startOffset, startOffset=3,endOffset=2

Stack Trace:
java.lang.IllegalArgumentException: startOffset must be non-negative, and endOffset must be
>= startOffset, startOffset=3,endOffset=2
	at __randomizedtesting.SeedInfo.seed([ED01110BEED54D0B:D0E0386AA9C750CB]:0)
	at org.apache.lucene.analysis.tokenattributes.PackedTokenAttributeImpl.setOffset(PackedTokenAttributeImpl.java:107)
	at org.apache.lucene.analysis.shingle.ShingleFilter.incrementToken(ShingleFilter.java:345)
	at org.apache.lucene.analysis.ValidatingTokenFilter.incrementToken(ValidatingTokenFilter.java:68)
	at org.apache.lucene.analysis.id.IndonesianStemFilter.incrementToken(IndonesianStemFilter.java:56)
	at org.apache.lucene.analysis.ValidatingTokenFilter.incrementToken(ValidatingTokenFilter.java:68)
	at org.apache.lucene.analysis.BaseTokenStreamTestCase.checkAnalysisConsistency(BaseTokenStreamTestCase.java:703)
	at org.apache.lucene.analysis.BaseTokenStreamTestCase.checkRandomData(BaseTokenStreamTestCase.java:614)
	at org.apache.lucene.analysis.BaseTokenStreamTestCase.checkRandomData(BaseTokenStreamTestCase.java:513)
	at org.apache.lucene.analysis.core.TestRandomChains.testRandomChains(TestRandomChains.java:927)
	at sun.reflect.NativeMethodAccessorImpl.invoke0(Native Method)
	at sun.reflect.NativeMethodAccessorImpl.invoke(NativeMethodAccessorImpl.java:62)
	at sun.reflect.DelegatingMethodAccessorImpl.invoke(DelegatingMethodAccessorImpl.java:43)
	at java.lang.reflect.Method.invoke(Method.java:498)
	at com.carrotsearch.randomizedtesting.RandomizedRunner.invoke(RandomizedRunner.java:1618)
	at com.carrotsearch.randomizedtesting.RandomizedRunner$6.evaluate(RandomizedRunner.java:827)
	at com.carrotsearch.randomizedtesting.RandomizedRunner$7.evaluate(RandomizedRunner.java:863)
	at com.carrotsearch.randomizedtesting.RandomizedRunner$8.evaluate(RandomizedRunner.java:877)
	at org.apache.lucene.util.TestRuleSetupTeardownChained$1.evaluate(TestRuleSetupTeardownChained.java:50)
	at org.apache.lucene.util.TestRuleFieldCacheSanity$1.evaluate(TestRuleFieldCacheSanity.java:51)
	at org.apache.lucene.util.AbstractBeforeAfterRule$1.evaluate(AbstractBeforeAfterRule.java:46)
	at com.carrotsearch.randomizedtesting.rules.SystemPropertiesInvariantRule$1.evaluate(SystemPropertiesInvariantRule.java:55)
	at org.apache.lucene.util.TestRuleThreadAndTestName$1.evaluate(TestRuleThreadAndTestName.java:49)
	at org.apache.lucene.util.TestRuleIgnoreAfterMaxFailures$1.evaluate(TestRuleIgnoreAfterMaxFailures.java:65)
	at org.apache.lucene.util.TestRuleMarkFailure$1.evaluate(TestRuleMarkFailure.java:48)
	at com.carrotsearch.randomizedtesting.rules.StatementAdapter.evaluate(StatementAdapter.java:36)
	at com.carrotsearch.randomizedtesting.ThreadLeakControl$StatementRunner.run(ThreadLeakControl.java:365)
	at com.carrotsearch.randomizedtesting.ThreadLeakControl.forkTimeoutingTask(ThreadLeakControl.java:798)
	at com.carrotsearch.randomizedtesting.ThreadLeakControl$3.evaluate(ThreadLeakControl.java:458)
	at com.carrotsearch.randomizedtesting.RandomizedRunner.runSingleTest(RandomizedRunner.java:836)
	at com.carrotsearch.randomizedtesting.RandomizedRunner$3.evaluate(RandomizedRunner.java:738)
	at com.carrotsearch.randomizedtesting.RandomizedRunner$4.evaluate(RandomizedRunner.java:772)
	at com.carrotsearch.randomizedtesting.RandomizedRunner$5.evaluate(RandomizedRunner.java:783)
	at org.apache.lucene.util.AbstractBeforeAfterRule$1.evaluate(AbstractBeforeAfterRule.java:46)
	at org.apache.lucene.util.TestRuleStoreClassName$1.evaluate(TestRuleStoreClassName.java:42)
	at com.carrotsearch.randomizedtesting.rules.SystemPropertiesInvariantRule$1.evaluate(SystemPropertiesInvariantRule.java:55)
	at com.carrotsearch.randomizedtesting.rules.NoShadowingOrOverridesOnMethodsRule$1.evaluate(NoShadowingOrOverridesOnMethodsRule.java:39)
	at com.carrotsearch.randomizedtesting.rules.NoShadowingOrOverridesOnMethodsRule$1.evaluate(NoShadowingOrOverridesOnMethodsRule.java:39)
	at com.carrotsearch.randomizedtesting.rules.StatementAdapter.evaluate(StatementAdapter.java:36)
	at com.carrotsearch.randomizedtesting.rules.StatementAdapter.evaluate(StatementAdapter.java:36)
	at com.carrotsearch.randomizedtesting.rules.StatementAdapter.evaluate(StatementAdapter.java:36)
	at org.apache.lucene.util.TestRuleAssertionsRequired$1.evaluate(TestRuleAssertionsRequired.java:54)
	at org.apache.lucene.util.TestRuleMarkFailure$1.evaluate(TestRuleMarkFailure.java:48)
	at org.apache.lucene.util.TestRuleIgnoreAfterMaxFailures$1.evaluate(TestRuleIgnoreAfterMaxFailures.java:65)
	at org.apache.lucene.util.TestRuleIgnoreTestSuites$1.evaluate(TestRuleIgnoreTestSuites.java:55)
	at com.carrotsearch.randomizedtesting.rules.StatementAdapter.evaluate(StatementAdapter.java:36)
	at com.carrotsearch.randomizedtesting.ThreadLeakControl$StatementRunner.run(ThreadLeakControl.java:365)
	at java.lang.Thread.run(Thread.java:745)




Build Log:
[...truncated 5864 lines...]
   [junit4] Suite: org.apache.lucene.analysis.core.TestRandomChains
   [junit4]   2> TEST FAIL: useCharFilter=false text='A\u016c\uecc6\u046a fejatcikz '
   [junit4]   2> Exception from random analyzer: 
   [junit4]   2> charfilters=
   [junit4]   2> tokenizer=
   [junit4]   2>   org.apache.lucene.analysis.ngram.NGramTokenizer(org.apache.lucene.analysis.core.TestRandomChains$CheckThatYouDidntReadAnythingReaderWrapper@55fd887b,
8, 43)
   [junit4]   2> filters=
   [junit4]   2>   org.apache.lucene.analysis.miscellaneous.WordDelimiterFilter(ValidatingTokenFilter@5db8574c
term=,bytes=[],startOffset=0,endOffset=0,positionIncrement=1,positionLength=1,type=word, [-46,
123, -18, -41, -5, -106, 4, 90, 87, 93, -92, 25, -41, -62, 106, -14, 69, -84, 33, 37, -36,
37, 11, 71, -88, -101, 110, 100, -59, 5, 100, 24, 97, -72, 26, 12, 112, -66, 81, -125, 107,
75, -49, -46, 89, -102, 114, 92, -53, 49, 28, -105, 35, 103, 11, -7, -52, 13, -72, 107, 33,
-41, 113, 99, 45, 116, 108, -123, -9, -82, -71, -44, 113, -87, 68, 118, -52, -10, 32, -13,
110, -10, -119, -37, -89, -8, 87, -32, -50, 96, -36, -83, -20, 81, 84, -123, 35, -5, -74,
1, 15, -44, 77, 72, -73, -39, -31, -7, -3, -16, 89, 92, 68, 84, -85, -31, -54, 9, -29, 119,
54, 106, -63, -128, -91, -70, -122, 36, 34, 46, -14, 37, 29, 61, 118, 9, -98, -34, -42, -6,
61, -62, 113, -94, -104, 21, 101, -117, 19, 72, 97, -49, -33, 12, -95, -49, -113, 122, -73,
33, -127, -83, -108, 46, -24, -75, -124, -69, 28, -55, 74, -120, -31, -48, 118, 21, 105, -57,
2, -89, -86, -1, 37, -121, 122, 15, -10, 18, 50, 116, 86], 1, [dtrmcewp, h, kkvzxx, cntgt,
ctvihzsmh, j, ubpmu, awt])
   [junit4]   2>   org.apache.lucene.analysis.shingle.ShingleFilter(ValidatingTokenFilter@2c71dbcf
term=,bytes=[],startOffset=0,endOffset=0,positionIncrement=1,positionLength=1,type=word, 46)
   [junit4]   2>   org.apache.lucene.analysis.id.IndonesianStemFilter(ValidatingTokenFilter@34ce51dc
term=,bytes=[],startOffset=0,endOffset=0,positionIncrement=1,positionLength=1,type=word,keyword=false)
   [junit4]   2> offsetsAreCorrect=false
   [junit4]   2> NOTE: reproduce with: ant test  -Dtestcase=TestRandomChains -Dtests.method=testRandomChains
-Dtests.seed=ED01110BEED54D0B -Dtests.multiplier=3 -Dtests.slow=true -Dtests.locale=zh_HK
-Dtests.timezone=America/Mendoza -Dtests.asserts=true -Dtests.file.encoding=UTF-8
   [junit4] ERROR   11.6s J1 | TestRandomChains.testRandomChains <<<
   [junit4]    > Throwable #1: java.lang.IllegalArgumentException: startOffset must be
non-negative, and endOffset must be >= startOffset, startOffset=3,endOffset=2
   [junit4]    > 	at __randomizedtesting.SeedInfo.seed([ED01110BEED54D0B:D0E0386AA9C750CB]:0)
   [junit4]    > 	at org.apache.lucene.analysis.tokenattributes.PackedTokenAttributeImpl.setOffset(PackedTokenAttributeImpl.java:107)
   [junit4]    > 	at org.apache.lucene.analysis.shingle.ShingleFilter.incrementToken(ShingleFilter.java:345)
   [junit4]    > 	at org.apache.lucene.analysis.ValidatingTokenFilter.incrementToken(ValidatingTokenFilter.java:68)
   [junit4]    > 	at org.apache.lucene.analysis.id.IndonesianStemFilter.incrementToken(IndonesianStemFilter.java:56)
   [junit4]    > 	at org.apache.lucene.analysis.ValidatingTokenFilter.incrementToken(ValidatingTokenFilter.java:68)
   [junit4]    > 	at org.apache.lucene.analysis.BaseTokenStreamTestCase.checkAnalysisConsistency(BaseTokenStreamTestCase.java:703)
   [junit4]    > 	at org.apache.lucene.analysis.BaseTokenStreamTestCase.checkRandomData(BaseTokenStreamTestCase.java:614)
   [junit4]    > 	at org.apache.lucene.analysis.BaseTokenStreamTestCase.checkRandomData(BaseTokenStreamTestCase.java:513)
   [junit4]    > 	at org.apache.lucene.analysis.core.TestRandomChains.testRandomChains(TestRandomChains.java:927)
   [junit4]    > 	at java.lang.Thread.run(Thread.java:745)
   [junit4]   2> NOTE: test params are: codec=Lucene40, sim=DefaultSimilarity, locale=zh_HK,
timezone=America/Mendoza
   [junit4]   2> NOTE: Linux 3.13.0-39-generic amd64/Oracle Corporation 1.9.0-ea (64-bit)/cpus=8,threads=1,free=43775648,total=127795200
   [junit4]   2> NOTE: All tests run in this JVM: [TestPrefixAwareTokenFilter, TestIrishLowerCaseFilter,
TestSpanishAnalyzer, TestScandinavianNormalizationFilter, TokenRangeSinkTokenizerTest, TestBrazilianStemmer,
TestPersianAnalyzer, TokenTypeSinkTokenizerTest, TestFullStrip, TestHindiAnalyzer, TestHungarianLightStemFilterFactory,
TestTypeTokenFilterFactory, TestPortugueseLightStemFilter, TestCJKWidthFilter, TestMorph,
TestPortugueseMinimalStemFilter, TestCharacterUtils, TestFrenchLightStemFilter, TestCharTokenizers,
TestGermanStemFilterFactory, TestEnglishAnalyzer, TestSpaces, TestFinnishAnalyzer, TestCaseInsensitive,
TestFilesystemResourceLoader, TestTurkishAnalyzer, TestSynonymMap, TestFrenchMinimalStemFilterFactory,
TestSpanishLightStemFilter, TestWordnetSynonymParser, TestGermanMinimalStemFilterFactory,
QueryAutoStopWordAnalyzerTest, TestApostropheFilterFactory, TestTruncateTokenFilterFactory,
TestChineseTokenizerFactory, TestCaseSensitive, DelimitedPayloadTokenFilterTest, TestBulgarianStemFilterFactory,
HTMLStripCharFilterTest, TestRollingCharBuffer, TestSnowball, TestAnalyzers, TestPersianCharFilter,
TestAllAnalyzersHaveFactories, TestKStemmer, TestSnowballPorterFilterFactory, TestSpanishLightStemFilterFactory,
TestCommonGramsQueryFilterFactory, TestSwedishLightStemFilter, TestRandomChains]
   [junit4] Completed on J1 in 28.69s, 2 tests, 1 error <<< FAILURES!

[...truncated 493 lines...]
BUILD FAILED
/mnt/ssd/jenkins/workspace/Lucene-Solr-4.10-Linux/build.xml:474: The following error occurred
while executing this line:
/mnt/ssd/jenkins/workspace/Lucene-Solr-4.10-Linux/build.xml:454: The following error occurred
while executing this line:
/mnt/ssd/jenkins/workspace/Lucene-Solr-4.10-Linux/build.xml:45: The following error occurred
while executing this line:
/mnt/ssd/jenkins/workspace/Lucene-Solr-4.10-Linux/extra-targets.xml:37: The following error
occurred while executing this line:
/mnt/ssd/jenkins/workspace/Lucene-Solr-4.10-Linux/lucene/build.xml:540: The following error
occurred while executing this line:
/mnt/ssd/jenkins/workspace/Lucene-Solr-4.10-Linux/lucene/common-build.xml:2107: The following
error occurred while executing this line:
/mnt/ssd/jenkins/workspace/Lucene-Solr-4.10-Linux/lucene/analysis/build.xml:106: The following
error occurred while executing this line:
/mnt/ssd/jenkins/workspace/Lucene-Solr-4.10-Linux/lucene/analysis/build.xml:38: The following
error occurred while executing this line:
/mnt/ssd/jenkins/workspace/Lucene-Solr-4.10-Linux/lucene/module-build.xml:60: The following
error occurred while executing this line:
/mnt/ssd/jenkins/workspace/Lucene-Solr-4.10-Linux/lucene/common-build.xml:1350: The following
error occurred while executing this line:
/mnt/ssd/jenkins/workspace/Lucene-Solr-4.10-Linux/lucene/common-build.xml:970: There were
test failures: 281 suites, 1470 tests, 1 error, 1 ignored

Total time: 31 minutes 2 seconds
Build step 'Invoke Ant' marked build as failure
[description-setter] Description set: Java: 64bit/jdk1.9.0-ea-b34 -XX:+UseCompressedOops -XX:+UseSerialGC
(asserts: true)
Archiving artifacts
Recording test results
Email was triggered for: Failure - Any
Sending email for trigger: Failure - Any



Mime
View raw message