lucene-dev mailing list archives

Site index · List index
Message view « Date » · « Thread »
Top « Date » · « Thread »
From Policeman Jenkins Server <jenk...@thetaphi.de>
Subject [JENKINS] Lucene-Solr-4.10-Linux (64bit/jdk1.8.0_20) - Build # 41 - Failure!
Date Sun, 02 Nov 2014 03:54:54 GMT
Build: http://jenkins.thetaphi.de/job/Lucene-Solr-4.10-Linux/41/
Java: 64bit/jdk1.8.0_20 -XX:-UseCompressedOops -XX:+UseConcMarkSweepGC (asserts: true)

1 tests failed.
REGRESSION:  org.apache.solr.handler.dataimport.TestFileListEntityProcessor.testNTOT

Error Message:
expected:<1> but was:<0>

Stack Trace:
java.lang.AssertionError: expected:<1> but was:<0>
	at __randomizedtesting.SeedInfo.seed([2EF1D66EF70E022:A88BCCBEF5BD6306]:0)
	at org.junit.Assert.fail(Assert.java:93)
	at org.junit.Assert.failNotEquals(Assert.java:647)
	at org.junit.Assert.assertEquals(Assert.java:128)
	at org.junit.Assert.assertEquals(Assert.java:472)
	at org.junit.Assert.assertEquals(Assert.java:456)
	at org.apache.solr.handler.dataimport.TestFileListEntityProcessor.testNTOT(TestFileListEntityProcessor.java:165)
	at sun.reflect.NativeMethodAccessorImpl.invoke0(Native Method)
	at sun.reflect.NativeMethodAccessorImpl.invoke(NativeMethodAccessorImpl.java:62)
	at sun.reflect.DelegatingMethodAccessorImpl.invoke(DelegatingMethodAccessorImpl.java:43)
	at java.lang.reflect.Method.invoke(Method.java:483)
	at com.carrotsearch.randomizedtesting.RandomizedRunner.invoke(RandomizedRunner.java:1618)
	at com.carrotsearch.randomizedtesting.RandomizedRunner$6.evaluate(RandomizedRunner.java:827)
	at com.carrotsearch.randomizedtesting.RandomizedRunner$7.evaluate(RandomizedRunner.java:863)
	at com.carrotsearch.randomizedtesting.RandomizedRunner$8.evaluate(RandomizedRunner.java:877)
	at com.carrotsearch.randomizedtesting.rules.SystemPropertiesRestoreRule$1.evaluate(SystemPropertiesRestoreRule.java:53)
	at org.apache.lucene.util.TestRuleSetupTeardownChained$1.evaluate(TestRuleSetupTeardownChained.java:50)
	at org.apache.lucene.util.TestRuleFieldCacheSanity$1.evaluate(TestRuleFieldCacheSanity.java:51)
	at org.apache.lucene.util.AbstractBeforeAfterRule$1.evaluate(AbstractBeforeAfterRule.java:46)
	at com.carrotsearch.randomizedtesting.rules.SystemPropertiesInvariantRule$1.evaluate(SystemPropertiesInvariantRule.java:55)
	at org.apache.lucene.util.TestRuleThreadAndTestName$1.evaluate(TestRuleThreadAndTestName.java:49)
	at org.apache.lucene.util.TestRuleIgnoreAfterMaxFailures$1.evaluate(TestRuleIgnoreAfterMaxFailures.java:65)
	at org.apache.lucene.util.TestRuleMarkFailure$1.evaluate(TestRuleMarkFailure.java:48)
	at com.carrotsearch.randomizedtesting.rules.StatementAdapter.evaluate(StatementAdapter.java:36)
	at com.carrotsearch.randomizedtesting.ThreadLeakControl$StatementRunner.run(ThreadLeakControl.java:365)
	at com.carrotsearch.randomizedtesting.ThreadLeakControl.forkTimeoutingTask(ThreadLeakControl.java:798)
	at com.carrotsearch.randomizedtesting.ThreadLeakControl$3.evaluate(ThreadLeakControl.java:458)
	at com.carrotsearch.randomizedtesting.RandomizedRunner.runSingleTest(RandomizedRunner.java:836)
	at com.carrotsearch.randomizedtesting.RandomizedRunner$3.evaluate(RandomizedRunner.java:738)
	at com.carrotsearch.randomizedtesting.RandomizedRunner$4.evaluate(RandomizedRunner.java:772)
	at com.carrotsearch.randomizedtesting.RandomizedRunner$5.evaluate(RandomizedRunner.java:783)
	at com.carrotsearch.randomizedtesting.rules.StatementAdapter.evaluate(StatementAdapter.java:36)
	at com.carrotsearch.randomizedtesting.rules.SystemPropertiesRestoreRule$1.evaluate(SystemPropertiesRestoreRule.java:53)
	at org.apache.lucene.util.AbstractBeforeAfterRule$1.evaluate(AbstractBeforeAfterRule.java:46)
	at org.apache.lucene.util.TestRuleStoreClassName$1.evaluate(TestRuleStoreClassName.java:42)
	at com.carrotsearch.randomizedtesting.rules.SystemPropertiesInvariantRule$1.evaluate(SystemPropertiesInvariantRule.java:55)
	at com.carrotsearch.randomizedtesting.rules.NoShadowingOrOverridesOnMethodsRule$1.evaluate(NoShadowingOrOverridesOnMethodsRule.java:39)
	at com.carrotsearch.randomizedtesting.rules.NoShadowingOrOverridesOnMethodsRule$1.evaluate(NoShadowingOrOverridesOnMethodsRule.java:39)
	at com.carrotsearch.randomizedtesting.rules.StatementAdapter.evaluate(StatementAdapter.java:36)
	at com.carrotsearch.randomizedtesting.rules.StatementAdapter.evaluate(StatementAdapter.java:36)
	at com.carrotsearch.randomizedtesting.rules.StatementAdapter.evaluate(StatementAdapter.java:36)
	at org.apache.lucene.util.TestRuleAssertionsRequired$1.evaluate(TestRuleAssertionsRequired.java:54)
	at org.apache.lucene.util.TestRuleMarkFailure$1.evaluate(TestRuleMarkFailure.java:48)
	at org.apache.lucene.util.TestRuleIgnoreAfterMaxFailures$1.evaluate(TestRuleIgnoreAfterMaxFailures.java:65)
	at org.apache.lucene.util.TestRuleIgnoreTestSuites$1.evaluate(TestRuleIgnoreTestSuites.java:55)
	at com.carrotsearch.randomizedtesting.rules.StatementAdapter.evaluate(StatementAdapter.java:36)
	at com.carrotsearch.randomizedtesting.ThreadLeakControl$StatementRunner.run(ThreadLeakControl.java:365)
	at java.lang.Thread.run(Thread.java:745)




Build Log:
[...truncated 15412 lines...]
   [junit4] Suite: org.apache.solr.handler.dataimport.TestFileListEntityProcessor
   [junit4]   2> Creating dataDir: /mnt/ssd/jenkins/workspace/Lucene-Solr-4.10-Linux/solr/build/contrib/solr-dataimporthandler/test/J0/./solr.handler.dataimport.TestFileListEntityProcessor-2EF1D66EF70E022-001/init-core-data-001
   [junit4]   2> 11502 T48 oas.SolrTestCaseJ4.buildSSLConfig Randomized ssl (false) and
clientAuth (true)
   [junit4]   2> 11507 T48 oas.SolrTestCaseJ4.setUp ###Starting testNTOT
   [junit4]   2> 11518 T48 oashd.AbstractDataImportHandlerTestCase.tearDown Looking for
dataimport.properties at: /mnt/ssd/jenkins/workspace/Lucene-Solr-4.10-Linux/solr/build/contrib/solr-dataimporthandler/test/J0/solr/collection1/conf/dataimport.properties
   [junit4]   2> 11519 T48 oas.SolrTestCaseJ4.tearDown ###Ending testNTOT
   [junit4]   2> NOTE: reproduce with: ant test  -Dtestcase=TestFileListEntityProcessor
-Dtests.method=testNTOT -Dtests.seed=2EF1D66EF70E022 -Dtests.multiplier=3 -Dtests.slow=true
-Dtests.locale=zh -Dtests.timezone=America/Miquelon -Dtests.asserts=true -Dtests.file.encoding=ISO-8859-1
   [junit4] FAILURE 0.07s | TestFileListEntityProcessor.testNTOT <<<
   [junit4]    > Throwable #1: java.lang.AssertionError: expected:<1> but was:<0>
   [junit4]    > 	at __randomizedtesting.SeedInfo.seed([2EF1D66EF70E022:A88BCCBEF5BD6306]:0)
   [junit4]    > 	at org.apache.solr.handler.dataimport.TestFileListEntityProcessor.testNTOT(TestFileListEntityProcessor.java:165)
   [junit4]    > 	at java.lang.Thread.run(Thread.java:745)
   [junit4]   2> 11574 T48 oas.SolrTestCaseJ4.setUp ###Starting testBiggerSmallerFiles
   [junit4]   2> 11576 T48 oashd.AbstractDataImportHandlerTestCase.tearDown Looking for
dataimport.properties at: /mnt/ssd/jenkins/workspace/Lucene-Solr-4.10-Linux/solr/build/contrib/solr-dataimporthandler/test/J0/solr/collection1/conf/dataimport.properties
   [junit4]   2> 11577 T48 oas.SolrTestCaseJ4.tearDown ###Ending testBiggerSmallerFiles
   [junit4]   2> 11581 T48 oas.SolrTestCaseJ4.setUp ###Starting testRECURSION
   [junit4]   2> 11583 T48 oashd.AbstractDataImportHandlerTestCase.tearDown Looking for
dataimport.properties at: /mnt/ssd/jenkins/workspace/Lucene-Solr-4.10-Linux/solr/build/contrib/solr-dataimporthandler/test/J0/solr/collection1/conf/dataimport.properties
   [junit4]   2> 11584 T48 oas.SolrTestCaseJ4.tearDown ###Ending testRECURSION
   [junit4]   2> 11588 T48 oas.SolrTestCaseJ4.setUp ###Starting testSimple
   [junit4]   2> 11590 T48 oashd.AbstractDataImportHandlerTestCase.tearDown Looking for
dataimport.properties at: /mnt/ssd/jenkins/workspace/Lucene-Solr-4.10-Linux/solr/build/contrib/solr-dataimporthandler/test/J0/solr/collection1/conf/dataimport.properties
   [junit4]   2> 11590 T48 oas.SolrTestCaseJ4.tearDown ###Ending testSimple
   [junit4]   2> 11592 T48 oas.SolrTestCaseJ4.deleteCore ###deleteCore
   [junit4]   2> NOTE: leaving temporary files on disk at: /mnt/ssd/jenkins/workspace/Lucene-Solr-4.10-Linux/solr/build/contrib/solr-dataimporthandler/test/J0/./solr.handler.dataimport.TestFileListEntityProcessor-2EF1D66EF70E022-001
   [junit4]   2> NOTE: test params are: codec=Lucene45, sim=RandomSimilarityProvider(queryNorm=false,coord=no):
{}, locale=zh, timezone=America/Miquelon
   [junit4]   2> NOTE: Linux 3.13.0-39-generic amd64/Oracle Corporation 1.8.0_20 (64-bit)/cpus=8,threads=1,free=86977128,total=127729664
   [junit4]   2> NOTE: All tests run in this JVM: [TestVariableResolverEndToEnd, TestSimplePropertiesWriter,
TestNumberFormatTransformer, TestSqlEntityProcessorDelta, TestEphemeralCache, TestTemplateTransformer,
TestDateFormatTransformer, TestFileListEntityProcessor]
   [junit4] Completed in 0.12s, 4 tests, 1 failure <<< FAILURES!

[...truncated 98 lines...]
BUILD FAILED
/mnt/ssd/jenkins/workspace/Lucene-Solr-4.10-Linux/build.xml:474: The following error occurred
while executing this line:
/mnt/ssd/jenkins/workspace/Lucene-Solr-4.10-Linux/build.xml:454: The following error occurred
while executing this line:
/mnt/ssd/jenkins/workspace/Lucene-Solr-4.10-Linux/build.xml:45: The following error occurred
while executing this line:
/mnt/ssd/jenkins/workspace/Lucene-Solr-4.10-Linux/extra-targets.xml:37: The following error
occurred while executing this line:
/mnt/ssd/jenkins/workspace/Lucene-Solr-4.10-Linux/solr/build.xml:209: The following error
occurred while executing this line:
/mnt/ssd/jenkins/workspace/Lucene-Solr-4.10-Linux/solr/common-build.xml:438: The following
error occurred while executing this line:
/mnt/ssd/jenkins/workspace/Lucene-Solr-4.10-Linux/solr/common-build.xml:494: The following
error occurred while executing this line:
/mnt/ssd/jenkins/workspace/Lucene-Solr-4.10-Linux/lucene/common-build.xml:1350: The following
error occurred while executing this line:
/mnt/ssd/jenkins/workspace/Lucene-Solr-4.10-Linux/lucene/common-build.xml:970: There were
test failures: 37 suites, 148 tests, 1 failure, 4 ignored (1 assumption)

Total time: 111 minutes 26 seconds
Build step 'Invoke Ant' marked build as failure
[description-setter] Description set: Java: 64bit/jdk1.8.0_20 -XX:-UseCompressedOops -XX:+UseConcMarkSweepGC
(asserts: true)
Archiving artifacts
Recording test results
Email was triggered for: Failure - Any
Sending email for trigger: Failure - Any



Mime
View raw message