lucene-dev mailing list archives

Site index · List index
Message view « Date » · « Thread »
Top « Date » · « Thread »
From Apache Jenkins Server <jenk...@builds.apache.org>
Subject [JENKINS-MAVEN] Lucene-Solr-Maven-5.x #763: POMs out of sync
Date Fri, 21 Nov 2014 03:41:34 GMT
Build: https://builds.apache.org/job/Lucene-Solr-Maven-5.x/763/

3 tests failed.
FAILED:  org.apache.solr.hadoop.MorphlineMapperTest.org.apache.solr.hadoop.MorphlineMapperTest

Error Message:
null

Stack Trace:
java.lang.AssertionError: null
	at __randomizedtesting.SeedInfo.seed([C0DDD1FB39FEE976]:0)
	at org.apache.lucene.util.TestRuleTemporaryFilesCleanup.before(TestRuleTemporaryFilesCleanup.java:92)
	at com.carrotsearch.randomizedtesting.rules.TestRuleAdapter$1.before(TestRuleAdapter.java:26)
	at com.carrotsearch.randomizedtesting.rules.StatementAdapter.evaluate(StatementAdapter.java:35)
	at com.carrotsearch.randomizedtesting.rules.StatementAdapter.evaluate(StatementAdapter.java:36)
	at org.apache.lucene.util.TestRuleAssertionsRequired$1.evaluate(TestRuleAssertionsRequired.java:54)
	at org.apache.lucene.util.TestRuleMarkFailure$1.evaluate(TestRuleMarkFailure.java:48)
	at org.apache.lucene.util.TestRuleIgnoreAfterMaxFailures$1.evaluate(TestRuleIgnoreAfterMaxFailures.java:65)
	at org.apache.lucene.util.TestRuleIgnoreTestSuites$1.evaluate(TestRuleIgnoreTestSuites.java:55)
	at com.carrotsearch.randomizedtesting.rules.StatementAdapter.evaluate(StatementAdapter.java:36)
	at com.carrotsearch.randomizedtesting.ThreadLeakControl$StatementRunner.run(ThreadLeakControl.java:365)
	at java.lang.Thread.run(Thread.java:745)


FAILED:  org.apache.solr.hadoop.MorphlineBasicMiniMRTest.testPathParts

Error Message:
Test abandoned because suite timeout was reached.

Stack Trace:
java.lang.Exception: Test abandoned because suite timeout was reached.
	at __randomizedtesting.SeedInfo.seed([65795FD50E02A01B]:0)


FAILED:  org.apache.solr.hadoop.MorphlineBasicMiniMRTest.org.apache.solr.hadoop.MorphlineBasicMiniMRTest

Error Message:
Suite timeout exceeded (>= 7200000 msec).

Stack Trace:
java.lang.Exception: Suite timeout exceeded (>= 7200000 msec).
	at __randomizedtesting.SeedInfo.seed([65795FD50E02A01B]:0)




Build Log:
[...truncated 53922 lines...]
BUILD FAILED
/usr/home/jenkins/jenkins-slave/workspace/Lucene-Solr-Maven-5.x/build.xml:548: The following
error occurred while executing this line:
/usr/home/jenkins/jenkins-slave/workspace/Lucene-Solr-Maven-5.x/build.xml:200: The following
error occurred while executing this line:
: Java returned: 1

Total time: 405 minutes 19 seconds
Build step 'Invoke Ant' marked build as failure
Recording test results
Email was triggered for: Failure
Sending email for trigger: Failure



Mime
View raw message