lucene-dev mailing list archives

Site index · List index
Message view « Date » · « Thread »
Top « Date » · « Thread »
From Policeman Jenkins Server <jenk...@thetaphi.de>
Subject [JENKINS] Lucene-Solr-5.x-Windows (32bit/jdk1.8.0_40-ea-b09) - Build # 4306 - Still Failing!
Date Sun, 02 Nov 2014 18:14:31 GMT
Build: http://jenkins.thetaphi.de/job/Lucene-Solr-5.x-Windows/4306/
Java: 32bit/jdk1.8.0_40-ea-b09 -server -XX:+UseSerialGC (asserts: false)

1 tests failed.
REGRESSION:  org.apache.solr.TestDistributedSearch.testDistribSearch

Error Message:
Timeout occured while waiting response from server at: https://127.0.0.1:65279/aa/g

Stack Trace:
org.apache.solr.client.solrj.SolrServerException: Timeout occured while waiting response from server at: https://127.0.0.1:65279/aa/g
	at __randomizedtesting.SeedInfo.seed([363C8186B2D84C41:B7DA0F9EC5872C7D]:0)
	at org.apache.solr.client.solrj.impl.HttpSolrServer.executeMethod(HttpSolrServer.java:581)
	at org.apache.solr.client.solrj.impl.HttpSolrServer.request(HttpSolrServer.java:215)
	at org.apache.solr.client.solrj.impl.HttpSolrServer.request(HttpSolrServer.java:211)
	at org.apache.solr.client.solrj.request.AbstractUpdateRequest.process(AbstractUpdateRequest.java:124)
	at org.apache.solr.client.solrj.SolrServer.add(SolrServer.java:116)
	at org.apache.solr.client.solrj.SolrServer.add(SolrServer.java:102)
	at org.apache.solr.BaseDistributedSearchTestCase.indexDoc(BaseDistributedSearchTestCase.java:438)
	at org.apache.solr.BaseDistributedSearchTestCase.indexr(BaseDistributedSearchTestCase.java:420)
	at org.apache.solr.TestDistributedSearch.doTest(TestDistributedSearch.java:120)
	at org.apache.solr.BaseDistributedSearchTestCase.testDistribSearch(BaseDistributedSearchTestCase.java:875)
	at sun.reflect.GeneratedMethodAccessor73.invoke(Unknown Source)
	at sun.reflect.DelegatingMethodAccessorImpl.invoke(DelegatingMethodAccessorImpl.java:43)
	at java.lang.reflect.Method.invoke(Method.java:497)
	at com.carrotsearch.randomizedtesting.RandomizedRunner.invoke(RandomizedRunner.java:1618)
	at com.carrotsearch.randomizedtesting.RandomizedRunner$6.evaluate(RandomizedRunner.java:827)
	at com.carrotsearch.randomizedtesting.RandomizedRunner$7.evaluate(RandomizedRunner.java:863)
	at com.carrotsearch.randomizedtesting.RandomizedRunner$8.evaluate(RandomizedRunner.java:877)
	at com.carrotsearch.randomizedtesting.rules.SystemPropertiesRestoreRule$1.evaluate(SystemPropertiesRestoreRule.java:53)
	at org.apache.lucene.util.TestRuleSetupTeardownChained$1.evaluate(TestRuleSetupTeardownChained.java:50)
	at org.apache.lucene.util.AbstractBeforeAfterRule$1.evaluate(AbstractBeforeAfterRule.java:46)
	at com.carrotsearch.randomizedtesting.rules.SystemPropertiesInvariantRule$1.evaluate(SystemPropertiesInvariantRule.java:55)
	at org.apache.lucene.util.TestRuleThreadAndTestName$1.evaluate(TestRuleThreadAndTestName.java:49)
	at org.apache.lucene.util.TestRuleIgnoreAfterMaxFailures$1.evaluate(TestRuleIgnoreAfterMaxFailures.java:65)
	at org.apache.lucene.util.TestRuleMarkFailure$1.evaluate(TestRuleMarkFailure.java:48)
	at com.carrotsearch.randomizedtesting.rules.StatementAdapter.evaluate(StatementAdapter.java:36)
	at com.carrotsearch.randomizedtesting.ThreadLeakControl$StatementRunner.run(ThreadLeakControl.java:365)
	at com.carrotsearch.randomizedtesting.ThreadLeakControl.forkTimeoutingTask(ThreadLeakControl.java:798)
	at com.carrotsearch.randomizedtesting.ThreadLeakControl$3.evaluate(ThreadLeakControl.java:458)
	at com.carrotsearch.randomizedtesting.RandomizedRunner.runSingleTest(RandomizedRunner.java:836)
	at com.carrotsearch.randomizedtesting.RandomizedRunner$3.evaluate(RandomizedRunner.java:738)
	at com.carrotsearch.randomizedtesting.RandomizedRunner$4.evaluate(RandomizedRunner.java:772)
	at com.carrotsearch.randomizedtesting.RandomizedRunner$5.evaluate(RandomizedRunner.java:783)
	at com.carrotsearch.randomizedtesting.rules.StatementAdapter.evaluate(StatementAdapter.java:36)
	at com.carrotsearch.randomizedtesting.rules.SystemPropertiesRestoreRule$1.evaluate(SystemPropertiesRestoreRule.java:53)
	at org.apache.lucene.util.AbstractBeforeAfterRule$1.evaluate(AbstractBeforeAfterRule.java:46)
	at org.apache.lucene.util.TestRuleStoreClassName$1.evaluate(TestRuleStoreClassName.java:42)
	at com.carrotsearch.randomizedtesting.rules.SystemPropertiesInvariantRule$1.evaluate(SystemPropertiesInvariantRule.java:55)
	at com.carrotsearch.randomizedtesting.rules.NoShadowingOrOverridesOnMethodsRule$1.evaluate(NoShadowingOrOverridesOnMethodsRule.java:39)
	at com.carrotsearch.randomizedtesting.rules.NoShadowingOrOverridesOnMethodsRule$1.evaluate(NoShadowingOrOverridesOnMethodsRule.java:39)
	at com.carrotsearch.randomizedtesting.rules.StatementAdapter.evaluate(StatementAdapter.java:36)
	at com.carrotsearch.randomizedtesting.rules.StatementAdapter.evaluate(StatementAdapter.java:36)
	at com.carrotsearch.randomizedtesting.rules.StatementAdapter.evaluate(StatementAdapter.java:36)
	at org.apache.lucene.util.TestRuleAssertionsRequired$1.evaluate(TestRuleAssertionsRequired.java:54)
	at org.apache.lucene.util.TestRuleMarkFailure$1.evaluate(TestRuleMarkFailure.java:48)
	at org.apache.lucene.util.TestRuleIgnoreAfterMaxFailures$1.evaluate(TestRuleIgnoreAfterMaxFailures.java:65)
	at org.apache.lucene.util.TestRuleIgnoreTestSuites$1.evaluate(TestRuleIgnoreTestSuites.java:55)
	at com.carrotsearch.randomizedtesting.rules.StatementAdapter.evaluate(StatementAdapter.java:36)
	at com.carrotsearch.randomizedtesting.ThreadLeakControl$StatementRunner.run(ThreadLeakControl.java:365)
	at java.lang.Thread.run(Thread.java:745)
Caused by: java.net.SocketTimeoutException: Read timed out
	at java.net.SocketInputStream.socketRead0(Native Method)
	at java.net.SocketInputStream.socketRead(SocketInputStream.java:116)
	at java.net.SocketInputStream.read(SocketInputStream.java:170)
	at java.net.SocketInputStream.read(SocketInputStream.java:141)
	at sun.security.ssl.InputRecord.readFully(InputRecord.java:465)
	at sun.security.ssl.InputRecord.read(InputRecord.java:503)
	at sun.security.ssl.SSLSocketImpl.readRecord(SSLSocketImpl.java:954)
	at sun.security.ssl.SSLSocketImpl.readDataRecord(SSLSocketImpl.java:911)
	at sun.security.ssl.AppInputStream.read(AppInputStream.java:105)
	at org.apache.http.impl.io.AbstractSessionInputBuffer.fillBuffer(AbstractSessionInputBuffer.java:160)
	at org.apache.http.impl.io.SocketInputBuffer.fillBuffer(SocketInputBuffer.java:84)
	at org.apache.http.impl.io.AbstractSessionInputBuffer.readLine(AbstractSessionInputBuffer.java:273)
	at org.apache.http.impl.conn.DefaultHttpResponseParser.parseHead(DefaultHttpResponseParser.java:140)
	at org.apache.http.impl.conn.DefaultHttpResponseParser.parseHead(DefaultHttpResponseParser.java:57)
	at org.apache.http.impl.io.AbstractMessageParser.parse(AbstractMessageParser.java:260)
	at org.apache.http.impl.AbstractHttpClientConnection.receiveResponseHeader(AbstractHttpClientConnection.java:283)
	at org.apache.http.impl.conn.DefaultClientConnection.receiveResponseHeader(DefaultClientConnection.java:251)
	at org.apache.http.impl.conn.ManagedClientConnectionImpl.receiveResponseHeader(ManagedClientConnectionImpl.java:197)
	at org.apache.http.protocol.HttpRequestExecutor.doReceiveResponse(HttpRequestExecutor.java:271)
	at org.apache.http.protocol.HttpRequestExecutor.execute(HttpRequestExecutor.java:123)
	at org.apache.http.impl.client.DefaultRequestDirector.tryExecute(DefaultRequestDirector.java:682)
	at org.apache.http.impl.client.DefaultRequestDirector.execute(DefaultRequestDirector.java:486)
	at org.apache.http.impl.client.AbstractHttpClient.doExecute(AbstractHttpClient.java:863)
	at org.apache.http.impl.client.CloseableHttpClient.execute(CloseableHttpClient.java:82)
	at org.apache.http.impl.client.CloseableHttpClient.execute(CloseableHttpClient.java:106)
	at org.apache.http.impl.client.CloseableHttpClient.execute(CloseableHttpClient.java:57)
	at org.apache.solr.client.solrj.impl.HttpSolrServer.executeMethod(HttpSolrServer.java:465)
	... 48 more




Build Log:
[...truncated 11515 lines...]
   [junit4] Suite: org.apache.solr.TestDistributedSearch
   [junit4]   2> Creating dataDir: C:\Users\JenkinsSlave\workspace\Lucene-Solr-5.x-Windows\solr\build\solr-core\test\J0\temp\solr.TestDistributedSearch-363C8186B2D84C41-001\init-core-data-001
   [junit4]   2> 4571280 T13237 oas.SolrTestCaseJ4.buildSSLConfig Randomized ssl (true) and clientAuth (false)
   [junit4]   2> 4571281 T13237 oas.BaseDistributedSearchTestCase.initHostContext Setting hostContext system property: /aa/g
   [junit4]   2> 4571284 T13237 oas.SolrTestCaseJ4.setUp ###Starting testDistribSearch
   [junit4]   2> 4571340 T13237 oejs.Server.doStart jetty-8.1.10.v20130312
   [junit4]   2> 4571409 T13237 oejus.SslContextFactory.doStart Enabled Protocols [SSLv2Hello, SSLv3, TLSv1, TLSv1.1, TLSv1.2] of [SSLv2Hello, SSLv3, TLSv1, TLSv1.1, TLSv1.2]
   [junit4]   2> 4571489 T13237 oejs.AbstractConnector.doStart Started SslSelectChannelConnector@127.0.0.1:65279
   [junit4]   2> 4571497 T13237 oass.SolrDispatchFilter.init SolrDispatchFilter.init()
   [junit4]   2> 4571500 T13237 oasc.SolrResourceLoader.locateSolrHome JNDI not configured for solr (NoInitialContextEx)
   [junit4]   2> 4571500 T13237 oasc.SolrResourceLoader.locateSolrHome using system property solr.solr.home: C:\Users\JenkinsSlave\workspace\Lucene-Solr-5.x-Windows\solr\core\src\test-files\solr
   [junit4]   2> 4571501 T13237 oasc.SolrResourceLoader.<init> new SolrResourceLoader for directory: 'C:\Users\JenkinsSlave\workspace\Lucene-Solr-5.x-Windows\solr\core\src\test-files\solr\'
   [junit4]   2> 4571552 T13237 oasc.ConfigSolr.fromFile Loading container configuration from C:\Users\JenkinsSlave\workspace\Lucene-Solr-5.x-Windows\solr\core\src\test-files\solr\solr.xml
   [junit4]   2> 4571571 T13237 oasc.CoreContainer.<init> New CoreContainer 12391302
   [junit4]   2> 4571572 T13237 oasc.CoreContainer.load Loading cores into CoreContainer [instanceDir=C:\Users\JenkinsSlave\workspace\Lucene-Solr-5.x-Windows\solr\core\src\test-files\solr\]
   [junit4]   2> 4571573 T13237 oashc.HttpShardHandlerFactory.getParameter Setting socketTimeout to: 90000
   [junit4]   2> 4571573 T13237 oashc.HttpShardHandlerFactory.getParameter Setting urlScheme to: https
   [junit4]   2> 4571574 T13237 oashc.HttpShardHandlerFactory.getParameter Setting connTimeout to: 15000
   [junit4]   2> 4571574 T13237 oashc.HttpShardHandlerFactory.getParameter Setting maxConnectionsPerHost to: 20
   [junit4]   2> 4571575 T13237 oashc.HttpShardHandlerFactory.getParameter Setting maxConnections to: 10000
   [junit4]   2> 4571575 T13237 oashc.HttpShardHandlerFactory.getParameter Setting corePoolSize to: 0
   [junit4]   2> 4571576 T13237 oashc.HttpShardHandlerFactory.getParameter Setting maximumPoolSize to: 2147483647
   [junit4]   2> 4571576 T13237 oashc.HttpShardHandlerFactory.getParameter Setting maxThreadIdleTime to: 5
   [junit4]   2> 4571577 T13237 oashc.HttpShardHandlerFactory.getParameter Setting sizeOfQueue to: -1
   [junit4]   2> 4571577 T13237 oashc.HttpShardHandlerFactory.getParameter Setting fairnessPolicy to: false
   [junit4]   2> 4571581 T13237 oasu.UpdateShardHandler.<init> Creating UpdateShardHandler HTTP client with params: socketTimeout=340000&connTimeout=45000&retry=false
   [junit4]   2> 4571584 T13237 oasl.LogWatcher.createWatcher SLF4J impl is org.slf4j.impl.Log4jLoggerFactory
   [junit4]   2> 4571585 T13237 oasl.LogWatcher.newRegisteredLogWatcher Registering Log Listener [Log4j (org.slf4j.impl.Log4jLoggerFactory)]
   [junit4]   2> 4571586 T13237 oasc.CoreContainer.load Host Name: 127.0.0.1
   [junit4]   2> 4571590 T13247 oasc.SolrResourceLoader.<init> new SolrResourceLoader for directory: 'C:\Users\JenkinsSlave\workspace\Lucene-Solr-5.x-Windows\solr\core\src\test-files\solr\collection1\'
   [junit4]   2> 4571594 T13247 oasc.SolrResourceLoader.replaceClassLoader Adding 'file:/C:/Users/JenkinsSlave/workspace/Lucene-Solr-5.x-Windows/solr/core/src/test-files/solr/collection1/lib/.svn/' to classloader
   [junit4]   2> 4571596 T13247 oasc.SolrResourceLoader.replaceClassLoader Adding 'file:/C:/Users/JenkinsSlave/workspace/Lucene-Solr-5.x-Windows/solr/core/src/test-files/solr/collection1/lib/classes/' to classloader
   [junit4]   2> 4571597 T13247 oasc.SolrResourceLoader.replaceClassLoader Adding 'file:/C:/Users/JenkinsSlave/workspace/Lucene-Solr-5.x-Windows/solr/core/src/test-files/solr/collection1/lib/README' to classloader
   [junit4]   2> 4571656 T13247 oasc.SolrConfig.<init> Using Lucene MatchVersion: 5.0.0
   [junit4]   2> 4571687 T13247 oasc.SolrConfig.<init> Loaded SolrConfig: solrconfig.xml
   [junit4]   2> 4571688 T13247 oass.IndexSchema.readSchema Reading Solr Schema from C:\Users\JenkinsSlave\workspace\Lucene-Solr-5.x-Windows\solr\core\src\test-files\solr\collection1\conf\schema.xml
   [junit4]   2> 4571696 T13247 oass.IndexSchema.readSchema [collection1] Schema name=test
   [junit4]   2> 4571810 T13247 oass.OpenExchangeRatesOrgProvider.init Initialized with rates=open-exchange-rates.json, refreshInterval=1440.
   [junit4]   2> 4571825 T13247 oass.IndexSchema.readSchema default search field in schema is text
   [junit4]   2> 4571826 T13247 oass.IndexSchema.readSchema unique key field: id
   [junit4]   2> 4571857 T13247 oass.FileExchangeRateProvider.reload Reloading exchange rates from file currency.xml
   [junit4]   2> 4571865 T13247 oass.FileExchangeRateProvider.reload Reloading exchange rates from file currency.xml
   [junit4]   2> 4571875 T13247 oass.OpenExchangeRatesOrgProvider.reload Reloading exchange rates from open-exchange-rates.json
   [junit4]   2> 4571877 T13247 oass.OpenExchangeRatesOrgProvider$OpenExchangeRates.<init> WARN Unknown key IMPORTANT NOTE
   [junit4]   2> 4571877 T13247 oass.OpenExchangeRatesOrgProvider$OpenExchangeRates.<init> WARN Expected key, got STRING
   [junit4]   2> 4571878 T13247 oass.OpenExchangeRatesOrgProvider.reload Reloading exchange rates from open-exchange-rates.json
   [junit4]   2> 4571879 T13247 oass.OpenExchangeRatesOrgProvider$OpenExchangeRates.<init> WARN Unknown key IMPORTANT NOTE
   [junit4]   2> 4571879 T13247 oass.OpenExchangeRatesOrgProvider$OpenExchangeRates.<init> WARN Expected key, got STRING
   [junit4]   2> 4571880 T13247 oasc.CoreContainer.create Creating SolrCore 'collection1' using configuration from instancedir C:\Users\JenkinsSlave\workspace\Lucene-Solr-5.x-Windows\solr\core\src\test-files\solr\collection1\
   [junit4]   2> 4571880 T13247 oasc.SolrCore.initDirectoryFactory org.apache.solr.core.MockDirectoryFactory
   [junit4]   2> 4571882 T13247 oasc.SolrCore.<init> [collection1] Opening new SolrCore at C:\Users\JenkinsSlave\workspace\Lucene-Solr-5.x-Windows\solr\core\src\test-files\solr\collection1\, dataDir=C:\Users\JenkinsSlave\workspace\Lucene-Solr-5.x-Windows\solr\build\solr-core\test\J0\temp\solr.TestDistributedSearch-363C8186B2D84C41-001\tempDir-001/control/data\
   [junit4]   2> 4571883 T13247 oasc.JmxMonitoredMap.<init> JMX monitoring is enabled. Adding Solr mbeans to JMX Server: com.sun.jmx.mbeanserver.JmxMBeanServer@178be9b
   [junit4]   2> 4571885 T13247 oasc.CachingDirectoryFactory.get return new directory for C:\Users\JenkinsSlave\workspace\Lucene-Solr-5.x-Windows\solr\build\solr-core\test\J0\temp\solr.TestDistributedSearch-363C8186B2D84C41-001\tempDir-001/control/data\
   [junit4]   2> 4571886 T13247 oasc.SolrCore.getNewIndexDir New index directory detected: old=null new=C:\Users\JenkinsSlave\workspace\Lucene-Solr-5.x-Windows\solr\build\solr-core\test\J0\temp\solr.TestDistributedSearch-363C8186B2D84C41-001\tempDir-001/control/data\index/
   [junit4]   2> 4571886 T13247 oasc.SolrCore.initIndex WARN [collection1] Solr index directory 'C:\Users\JenkinsSlave\workspace\Lucene-Solr-5.x-Windows\solr\build\solr-core\test\J0\temp\solr.TestDistributedSearch-363C8186B2D84C41-001\tempDir-001\control\data\index' doesn't exist. Creating new index...
   [junit4]   2> 4571887 T13247 oasc.CachingDirectoryFactory.get return new directory for C:\Users\JenkinsSlave\workspace\Lucene-Solr-5.x-Windows\solr\build\solr-core\test\J0\temp\solr.TestDistributedSearch-363C8186B2D84C41-001\tempDir-001/control/data\index
   [junit4]   2> 4571888 T13247 oasu.RandomMergePolicy.<init> RandomMergePolicy wrapping class org.apache.lucene.index.TieredMergePolicy: [TieredMergePolicy: maxMergeAtOnce=39, maxMergeAtOnceExplicit=30, maxMergedSegmentMB=56.966796875, floorSegmentMB=1.2490234375, forceMergeDeletesPctAllowed=15.538201058890333, segmentsPerTier=36.0, maxCFSSegmentSizeMB=8.796093022207999E12, noCFSRatio=0.0
   [junit4]   2> 4571891 T13247 oasc.SolrDeletionPolicy.onCommit SolrDeletionPolicy.onCommit: commits: num=1
   [junit4]   2> 		commit{dir=RateLimitedDirectoryWrapper(MockDirectoryWrapper(RAMDirectory(id=lucene-52a53f))),segFN=segments_1,generation=1}
   [junit4]   2> 4571892 T13247 oasc.SolrDeletionPolicy.updateCommits newest commit generation = 1
   [junit4]   2> 4571892 T13247 oasc.SolrCore.initWriters created xml: solr.XMLResponseWriter
   [junit4]   2> 4571903 T13247 oasup.UpdateRequestProcessorChain.init creating updateRequestProcessorChain "dedupe"
   [junit4]   2> 4571904 T13247 oasup.UpdateRequestProcessorChain.init inserting DistributedUpdateProcessorFactory into updateRequestProcessorChain "dedupe"
   [junit4]   2> 4571904 T13247 oasup.UpdateRequestProcessorChain.init creating updateRequestProcessorChain "dedupe-allfields"
   [junit4]   2> 4571904 T13247 oasup.UpdateRequestProcessorChain.init inserting DistributedUpdateProcessorFactory into updateRequestProcessorChain "dedupe-allfields"
   [junit4]   2> 4571905 T13247 oasup.UpdateRequestProcessorChain.init creating updateRequestProcessorChain "stored_sig"
   [junit4]   2> 4571905 T13247 oasup.UpdateRequestProcessorChain.init inserting DistributedUpdateProcessorFactory into updateRequestProcessorChain "stored_sig"
   [junit4]   2> 4571905 T13247 oasup.UpdateRequestProcessorChain.init creating updateRequestProcessorChain "uniq-fields"
   [junit4]   2> 4571906 T13247 oasup.UpdateRequestProcessorChain.init inserting DistributedUpdateProcessorFactory into updateRequestProcessorChain "uniq-fields"
   [junit4]   2> 4571906 T13247 oasup.UpdateRequestProcessorChain.init creating updateRequestProcessorChain "distrib-dup-test-chain-explicit"
   [junit4]   2> 4571907 T13247 oasup.UpdateRequestProcessorChain.init creating updateRequestProcessorChain "distrib-dup-test-chain-implicit"
   [junit4]   2> 4571908 T13247 oasup.UpdateRequestProcessorChain.init inserting DistributedUpdateProcessorFactory into updateRequestProcessorChain "distrib-dup-test-chain-implicit"
   [junit4]   2> 4571908 T13247 oasc.SolrCore.loadUpdateProcessorChains no updateRequestProcessorChain defined as default, creating implicit default
   [junit4]   2> 4571909 T13247 oasc.RequestHandlers.initHandlersFromConfig created /update/csv: org.apache.solr.handler.UpdateRequestHandler
   [junit4]   2> 4571909 T13247 oasc.RequestHandlers.initHandlersFromConfig created /update/json: org.apache.solr.handler.UpdateRequestHandler
   [junit4]   2> 4571911 T13247 oasc.RequestHandlers.initHandlersFromConfig created /update/json/docs: org.apache.solr.handler.UpdateRequestHandler
   [junit4]   2> 4571911 T13247 oasc.RequestHandlers.initHandlersFromConfig adding lazy requestHandler: solr.ReplicationHandler
   [junit4]   2> 4571911 T13247 oasc.RequestHandlers.initHandlersFromConfig created /replication: solr.ReplicationHandler
   [junit4]   2> 4571912 T13247 oasc.RequestHandlers.initHandlersFromConfig created standard: solr.StandardRequestHandler
   [junit4]   2> 4571912 T13247 oasc.RequestHandlers.initHandlersFromConfig created /get: solr.RealTimeGetHandler
   [junit4]   2> 4571913 T13247 oasc.RequestHandlers.initHandlersFromConfig created dismax: solr.SearchHandler
   [junit4]   2> 4571913 T13247 oasc.RequestHandlers.initHandlersFromConfig created mock: org.apache.solr.core.MockQuerySenderListenerReqHandler
   [junit4]   2> 4571913 T13247 oasc.RequestHandlers.initHandlersFromConfig created /admin/: org.apache.solr.handler.admin.AdminHandlers
   [junit4]   2> 4571914 T13247 oasc.RequestHandlers.initHandlersFromConfig created /admin/file: solr.admin.ShowFileRequestHandler
   [junit4]   2> 4571914 T13247 oasc.RequestHandlers.initHandlersFromConfig created /admin/fileedit: solr.admin.EditFileRequestHandler
   [junit4]   2> 4571915 T13247 oasc.RequestHandlers.initHandlersFromConfig created defaults: solr.StandardRequestHandler
   [junit4]   2> 4571915 T13247 oasc.RequestHandlers.initHandlersFromConfig adding lazy requestHandler: solr.StandardRequestHandler
   [junit4]   2> 4571915 T13247 oasc.RequestHandlers.initHandlersFromConfig created lazy: solr.StandardRequestHandler
   [junit4]   2> 4571915 T13247 oasc.RequestHandlers.initHandlersFromConfig created /update: solr.UpdateRequestHandler
   [junit4]   2> 4571916 T13247 oasc.RequestHandlers.initHandlersFromConfig created /terms: org.apache.solr.handler.component.SearchHandler
   [junit4]   2> 4571916 T13247 oasc.RequestHandlers.initHandlersFromConfig created spellCheckCompRH: org.apache.solr.handler.component.SearchHandler
   [junit4]   2> 4571916 T13247 oasc.RequestHandlers.initHandlersFromConfig created spellCheckCompRH_Direct: org.apache.solr.handler.component.SearchHandler
   [junit4]   2> 4571917 T13247 oasc.RequestHandlers.initHandlersFromConfig created spellCheckWithWordbreak: org.apache.solr.handler.component.SearchHandler
   [junit4]   2> 4571917 T13247 oasc.RequestHandlers.initHandlersFromConfig created spellCheckWithWordbreak_Direct: org.apache.solr.handler.component.SearchHandler
   [junit4]   2> 4571917 T13247 oasc.RequestHandlers.initHandlersFromConfig created spellCheckCompRH1: org.apache.solr.handler.component.SearchHandler
   [junit4]   2> 4571918 T13247 oasc.RequestHandlers.initHandlersFromConfig created mltrh: org.apache.solr.handler.component.SearchHandler
   [junit4]   2> 4571918 T13247 oasc.RequestHandlers.initHandlersFromConfig created tvrh: org.apache.solr.handler.component.SearchHandler
   [junit4]   2> 4571923 T13247 oasc.RequestHandlers.initHandlersFromConfig created /mlt: solr.MoreLikeThisHandler
   [junit4]   2> 4571923 T13247 oasc.RequestHandlers.initHandlersFromConfig created /debug/dump: solr.DumpRequestHandler
   [junit4]   2> 4571930 T13247 oashl.XMLLoader.init xsltCacheLifetimeSeconds=60
   [junit4]   2> 4571932 T13247 oashl.XMLLoader.init xsltCacheLifetimeSeconds=60
   [junit4]   2> 4571933 T13247 oashl.XMLLoader.init xsltCacheLifetimeSeconds=60
   [junit4]   2> 4571940 T13247 oashl.XMLLoader.init xsltCacheLifetimeSeconds=60
   [junit4]   2> 4571943 T13247 oasc.SolrCore.initDeprecatedSupport WARN solrconfig.xml uses deprecated <admin/gettableFiles>, Please update your config to use the ShowFileRequestHandler.
   [junit4]   2> 4571952 T13247 oasu.CommitTracker.<init> Hard AutoCommit: disabled
   [junit4]   2> 4571952 T13247 oasu.CommitTracker.<init> Soft AutoCommit: disabled
   [junit4]   2> 4571953 T13247 oasu.RandomMergePolicy.<init> RandomMergePolicy wrapping class org.apache.lucene.index.TieredMergePolicy: [TieredMergePolicy: maxMergeAtOnce=27, maxMergeAtOnceExplicit=33, maxMergedSegmentMB=23.5712890625, floorSegmentMB=0.60546875, forceMergeDeletesPctAllowed=29.206801103504286, segmentsPerTier=43.0, maxCFSSegmentSizeMB=8.796093022207999E12, noCFSRatio=0.35723471297759424
   [junit4]   2> 4571953 T13247 oasc.SolrDeletionPolicy.onInit SolrDeletionPolicy.onInit: commits: num=1
   [junit4]   2> 		commit{dir=RateLimitedDirectoryWrapper(MockDirectoryWrapper(RAMDirectory(id=lucene-52a53f))),segFN=segments_1,generation=1}
   [junit4]   2> 4571953 T13247 oasc.SolrDeletionPolicy.updateCommits newest commit generation = 1
   [junit4]   2> 4571954 T13247 oass.SolrIndexSearcher.<init> Opening Searcher@cf0532[collection1] main
   [junit4]   2> 4571954 T13247 oasr.RestManager.init Initializing RestManager with initArgs: {storageIO=org.apache.solr.rest.ManagedResourceStorage$InMemoryStorageIO}
   [junit4]   2> 4571955 T13247 oasr.ManagedResourceStorage.load Reading _rest_managed.json using InMemoryStorage
   [junit4]   2> 4571955 T13247 oasr.ManagedResource.reloadFromStorage WARN No stored data found for /rest/managed
   [junit4]   2> 4571955 T13247 oasr.ManagedResourceStorage$JsonStorage.store Saved JSON object to path _rest_managed.json using InMemoryStorage
   [junit4]   2> 4571957 T13247 oasr.RestManager.init Initializing 0 registered ManagedResources
   [junit4]   2> 4571957 T13247 oashc.SpellCheckComponent.inform Initializing spell checkers
   [junit4]   2> 4571973 T13247 oass.DirectSolrSpellChecker.init init: {name=direct,classname=DirectSolrSpellChecker,field=lowerfilt,minQueryLength=3}
   [junit4]   2> 4572037 T13248 oasc.SolrCore.registerSearcher [collection1] Registered new searcher Searcher@cf0532[collection1] main{ExitableDirectoryReader(UninvertingDirectoryReader())}
   [junit4]   2> 4572041 T13247 oasc.CoreContainer.registerCore registering core: collection1
   [junit4]   2> 4572042 T13237 oass.SolrDispatchFilter.init user.dir=C:\Users\JenkinsSlave\workspace\Lucene-Solr-5.x-Windows\solr\build\solr-core\test\J0
   [junit4]   2> 4572043 T13237 oass.SolrDispatchFilter.init SolrDispatchFilter.init() done
   [junit4]   2> 4572063 T13237 oejs.Server.doStart jetty-8.1.10.v20130312
   [junit4]   2> 4572070 T13237 oejus.SslContextFactory.doStart Enabled Protocols [SSLv2Hello, SSLv3, TLSv1, TLSv1.1, TLSv1.2] of [SSLv2Hello, SSLv3, TLSv1, TLSv1.1, TLSv1.2]
   [junit4]   2> 4572072 T13237 oejs.AbstractConnector.doStart Started SslSelectChannelConnector@127.0.0.1:65282
   [junit4]   2> 4572076 T13237 oass.SolrDispatchFilter.init SolrDispatchFilter.init()
   [junit4]   2> 4572076 T13237 oasc.SolrResourceLoader.locateSolrHome JNDI not configured for solr (NoInitialContextEx)
   [junit4]   2> 4572077 T13237 oasc.SolrResourceLoader.locateSolrHome using system property solr.solr.home: C:\Users\JenkinsSlave\workspace\Lucene-Solr-5.x-Windows\solr\core\src\test-files\solr
   [junit4]   2> 4572077 T13237 oasc.SolrResourceLoader.<init> new SolrResourceLoader for directory: 'C:\Users\JenkinsSlave\workspace\Lucene-Solr-5.x-Windows\solr\core\src\test-files\solr\'
   [junit4]   2> 4572127 T13237 oasc.ConfigSolr.fromFile Loading container configuration from C:\Users\JenkinsSlave\workspace\Lucene-Solr-5.x-Windows\solr\core\src\test-files\solr\solr.xml
   [junit4]   2> 4572138 T13237 oasc.CoreContainer.<init> New CoreContainer 20844240
   [junit4]   2> 4572139 T13237 oasc.CoreContainer.load Loading cores into CoreContainer [instanceDir=C:\Users\JenkinsSlave\workspace\Lucene-Solr-5.x-Windows\solr\core\src\test-files\solr\]
   [junit4]   2> 4572139 T13237 oashc.HttpShardHandlerFactory.getParameter Setting socketTimeout to: 90000
   [junit4]   2> 4572140 T13237 oashc.HttpShardHandlerFactory.getParameter Setting urlScheme to: https
   [junit4]   2> 4572140 T13237 oashc.HttpShardHandlerFactory.getParameter Setting connTimeout to: 15000
   [junit4]   2> 4572141 T13237 oashc.HttpShardHandlerFactory.getParameter Setting maxConnectionsPerHost to: 20
   [junit4]   2> 4572141 T13237 oashc.HttpShardHandlerFactory.getParameter Setting maxConnections to: 10000
   [junit4]   2> 4572142 T13237 oashc.HttpShardHandlerFactory.getParameter Setting corePoolSize to: 0
   [junit4]   2> 4572142 T13237 oashc.HttpShardHandlerFactory.getParameter Setting maximumPoolSize to: 2147483647
   [junit4]   2> 4572143 T13237 oashc.HttpShardHandlerFactory.getParameter Setting maxThreadIdleTime to: 5
   [junit4]   2> 4572144 T13237 oashc.HttpShardHandlerFactory.getParameter Setting sizeOfQueue to: -1
   [junit4]   2> 4572144 T13237 oashc.HttpShardHandlerFactory.getParameter Setting fairnessPolicy to: false
   [junit4]   2> 4572149 T13237 oasu.UpdateShardHandler.<init> Creating UpdateShardHandler HTTP client with params: socketTimeout=340000&connTimeout=45000&retry=false
   [junit4]   2> 4572154 T13237 oasl.LogWatcher.createWatcher SLF4J impl is org.slf4j.impl.Log4jLoggerFactory
   [junit4]   2> 4572154 T13237 oasl.LogWatcher.newRegisteredLogWatcher Registering Log Listener [Log4j (org.slf4j.impl.Log4jLoggerFactory)]
   [junit4]   2> 4572155 T13237 oasc.CoreContainer.load Host Name: 127.0.0.1
   [junit4]   2> 4572158 T13259 oasc.SolrResourceLoader.<init> new SolrResourceLoader for directory: 'C:\Users\JenkinsSlave\workspace\Lucene-Solr-5.x-Windows\solr\core\src\test-files\solr\collection1\'
   [junit4]   2> 4572159 T13259 oasc.SolrResourceLoader.replaceClassLoader Adding 'file:/C:/Users/JenkinsSlave/workspace/Lucene-Solr-5.x-Windows/solr/core/src/test-files/solr/collection1/lib/.svn/' to classloader
   [junit4]   2> 4572160 T13259 oasc.SolrResourceLoader.replaceClassLoader Adding 'file:/C:/Users/JenkinsSlave/workspace/Lucene-Solr-5.x-Windows/solr/core/src/test-files/solr/collection1/lib/classes/' to classloader
   [junit4]   2> 4572160 T13259 oasc.SolrResourceLoader.replaceClassLoader Adding 'file:/C:/Users/JenkinsSlave/workspace/Lucene-Solr-5.x-Windows/solr/core/src/test-files/solr/collection1/lib/README' to classloader
   [junit4]   2> 4572254 T13259 oasc.SolrConfig.<init> Using Lucene MatchVersion: 5.0.0
   [junit4]   2> 4572284 T13259 oasc.SolrConfig.<init> Loaded SolrConfig: solrconfig.xml
   [junit4]   2> 4572285 T13259 oass.IndexSchema.readSchema Reading Solr Schema from C:\Users\JenkinsSlave\workspace\Lucene-Solr-5.x-Windows\solr\core\src\test-files\solr\collection1\conf\schema.xml
   [junit4]   2> 4572299 T13259 oass.IndexSchema.readSchema [collection1] Schema name=test
   [junit4]   2> 4572421 T13259 oass.OpenExchangeRatesOrgProvider.init Initialized with rates=open-exchange-rates.json, refreshInterval=1440.
   [junit4]   2> 4572426 T13259 oass.IndexSchema.readSchema default search field in schema is text
   [junit4]   2> 4572428 T13259 oass.IndexSchema.readSchema unique key field: id
   [junit4]   2> 4572436 T13259 oass.FileExchangeRateProvider.reload Reloading exchange rates from file currency.xml
   [junit4]   2> 4572483 T13259 oass.FileExchangeRateProvider.reload Reloading exchange rates from file currency.xml
   [junit4]   2> 4572486 T13259 oass.OpenExchangeRatesOrgProvider.reload Reloading exchange rates from open-exchange-rates.json
   [junit4]   2> 4572487 T13259 oass.OpenExchangeRatesOrgProvider$OpenExchangeRates.<init> WARN Unknown key IMPORTANT NOTE
   [junit4]   2> 4572488 T13259 oass.OpenExchangeRatesOrgProvider$OpenExchangeRates.<init> WARN Expected key, got STRING
   [junit4]   2> 4572488 T13259 oass.OpenExchangeRatesOrgProvider.reload Reloading exchange rates from open-exchange-rates.json
   [junit4]   2> 4572489 T13259 oass.OpenExchangeRatesOrgProvider$OpenExchangeRates.<init> WARN Unknown key IMPORTANT NOTE
   [junit4]   2> 4572491 T13259 oass.OpenExchangeRatesOrgProvider$OpenExchangeRates.<init> WARN Expected key, got STRING
   [junit4]   2> 4572492 T13259 oasc.CoreContainer.create Creating SolrCore 'collection1' using configuration from instancedir C:\Users\JenkinsSlave\workspace\Lucene-Solr-5.x-Windows\solr\core\src\test-files\solr\collection1\
   [junit4]   2> 4572492 T13259 oasc.SolrCore.initDirectoryFactory org.apache.solr.core.MockDirectoryFactory
   [junit4]   2> 4572493 T13259 oasc.SolrCore.<init> [collection1] Opening new SolrCore at C:\Users\JenkinsSlave\workspace\Lucene-Solr-5.x-Windows\solr\core\src\test-files\solr\collection1\, dataDir=C:\Users\JenkinsSlave\workspace\Lucene-Solr-5.x-Windows\solr\build\solr-core\test\J0\temp\solr.TestDistributedSearch-363C8186B2D84C41-001\tempDir-001/shard0/data\
   [junit4]   2> 4572493 T13259 oasc.JmxMonitoredMap.<init> JMX monitoring is enabled. Adding Solr mbeans to JMX Server: com.sun.jmx.mbeanserver.JmxMBeanServer@178be9b
   [junit4]   2> 4572494 T13259 oasc.CachingDirectoryFactory.get return new directory for C:\Users\JenkinsSlave\workspace\Lucene-Solr-5.x-Windows\solr\build\solr-core\test\J0\temp\solr.TestDistributedSearch-363C8186B2D84C41-001\tempDir-001/shard0/data\
   [junit4]   2> 4572495 T13259 oasc.SolrCore.getNewIndexDir New index directory detected: old=null new=C:\Users\JenkinsSlave\workspace\Lucene-Solr-5.x-Windows\solr\build\solr-core\test\J0\temp\solr.TestDistributedSearch-363C8186B2D84C41-001\tempDir-001/shard0/data\index/
   [junit4]   2> 4572498 T13259 oasc.SolrCore.initIndex WARN [collection1] Solr index directory 'C:\Users\JenkinsSlave\workspace\Lucene-Solr-5.x-Windows\solr\build\solr-core\test\J0\temp\solr.TestDistributedSearch-363C8186B2D84C41-001\tempDir-001\shard0\data\index' doesn't exist. Creating new index...
   [junit4]   2> 4572498 T13259 oasc.CachingDirectoryFactory.get return new directory for C:\Users\JenkinsSlave\workspace\Lucene-Solr-5.x-Windows\solr\build\solr-core\test\J0\temp\solr.TestDistributedSearch-363C8186B2D84C41-001\tempDir-001/shard0/data\index
   [junit4]   2> 4572499 T13259 oasu.RandomMergePolicy.<init> RandomMergePolicy wrapping class org.apache.lucene.index.TieredMergePolicy: [TieredMergePolicy: maxMergeAtOnce=39, maxMergeAtOnceExplicit=30, maxMergedSegmentMB=56.966796875, floorSegmentMB=1.2490234375, forceMergeDeletesPctAllowed=15.538201058890333, segmentsPerTier=36.0, maxCFSSegmentSizeMB=8.796093022207999E12, noCFSRatio=0.0
   [junit4]   2> 4572499 T13259 oasc.SolrDeletionPolicy.onCommit SolrDeletionPolicy.onCommit: commits: num=1
   [junit4]   2> 		commit{dir=RateLimitedDirectoryWrapper(MockDirectoryWrapper(RAMDirectory(id=lucene-68709d))),segFN=segments_1,generation=1}
   [junit4]   2> 4572500 T13259 oasc.SolrDeletionPolicy.updateCommits newest commit generation = 1
   [junit4]   2> 4572500 T13259 oasc.SolrCore.initWriters created xml: solr.XMLResponseWriter
   [junit4]   2> 4572503 T13259 oasup.UpdateRequestProcessorChain.init creating updateRequestProcessorChain "dedupe"
   [junit4]   2> 4572503 T13259 oasup.UpdateRequestProcessorChain.init inserting DistributedUpdateProcessorFactory into updateRequestProcessorChain "dedupe"
   [junit4]   2> 4572504 T13259 oasup.UpdateRequestProcessorChain.init creating updateRequestProcessorChain "dedupe-allfields"
   [junit4]   2> 4572504 T13259 oasup.UpdateRequestProcessorChain.init inserting DistributedUpdateProcessorFactory into updateRequestProcessorChain "dedupe-allfields"
   [junit4]   2> 4572504 T13259 oasup.UpdateRequestProcessorChain.init creating updateRequestProcessorChain "stored_sig"
   [junit4]   2> 4572504 T13259 oasup.UpdateRequestProcessorChain.init inserting DistributedUpdateProcessorFactory into updateRequestProcessorChain "stored_sig"
   [junit4]   2> 4572505 T13259 oasup.UpdateRequestProcessorChain.init creating updateRequestProcessorChain "uniq-fields"
   [junit4]   2> 4572505 T13259 oasup.UpdateRequestProcessorChain.init inserting DistributedUpdateProcessorFactory into updateRequestProcessorChain "uniq-fields"
   [junit4]   2> 4572505 T13259 oasup.UpdateRequestProcessorChain.init creating updateRequestProcessorChain "distrib-dup-test-chain-explicit"
   [junit4]   2> 4572506 T13259 oasup.UpdateRequestProcessorChain.init creating updateRequestProcessorChain "distrib-dup-test-chain-implicit"
   [junit4]   2> 4572506 T13259 oasup.UpdateRequestProcessorChain.init inserting DistributedUpdateProcessorFactory into updateRequestProcessorChain "distrib-dup-test-chain-implicit"
   [junit4]   2> 4572506 T13259 oasc.SolrCore.loadUpdateProcessorChains no updateRequestProcessorChain defined as default, creating implicit default
   [junit4]   2> 4572507 T13259 oasc.RequestHandlers.initHandlersFromConfig created /update/csv: org.apache.solr.handler.UpdateRequestHandler
   [junit4]   2> 4572507 T13259 oasc.RequestHandlers.initHandlersFromConfig created /update/json: org.apache.solr.handler.UpdateRequestHandler
   [junit4]   2> 4572508 T13259 oasc.RequestHandlers.initHandlersFromConfig created /update/json/docs: org.apache.solr.handler.UpdateRequestHandler
   [junit4]   2> 4572508 T13259 oasc.RequestHandlers.initHandlersFromConfig adding lazy requestHandler: solr.ReplicationHandler
   [junit4]   2> 4572509 T13259 oasc.RequestHandlers.initHandlersFromConfig created /replication: solr.ReplicationHandler
   [junit4]   2> 4572509 T13259 oasc.RequestHandlers.initHandlersFromConfig created standard: solr.StandardRequestHandler
   [junit4]   2> 4572510 T13259 oasc.RequestHandlers.initHandlersFromConfig created /get: solr.RealTimeGetHandler
   [junit4]   2> 4572510 T13259 oasc.RequestHandlers.initHandlersFromConfig created dismax: solr.SearchHandler
   [junit4]   2> 4572511 T13259 oasc.RequestHandlers.initHandlersFromConfig created mock: org.apache.solr.core.MockQuerySenderListenerReqHandler
   [junit4]   2> 4572511 T13259 oasc.RequestHandlers.initHandlersFromConfig created /admin/: org.apache.solr.handler.admin.AdminHandlers
   [junit4]   2> 4572512 T13259 oasc.RequestHandlers.initHandlersFromConfig created /admin/file: solr.admin.ShowFileRequestHandler
   [junit4]   2> 4572512 T13259 oasc.RequestHandlers.initHandlersFromConfig created /admin/fileedit: solr.admin.EditFileRequestHandler
   [junit4]   2> 4572513 T13259 oasc.RequestHandlers.initHandlersFromConfig created defaults: solr.StandardRequestHandler
   [junit4]   2> 4572513 T13259 oasc.RequestHandlers.initHandlersFromConfig adding lazy requestHandler: solr.StandardRequestHandler
   [junit4]   2> 4572514 T13259 oasc.RequestHandlers.initHandlersFromConfig created lazy: solr.StandardRequestHandler
   [junit4]   2> 4572514 T13259 oasc.RequestHandlers.initHandlersFromConfig created /update: solr.UpdateRequestHandler
   [junit4]   2> 4572514 T13259 oasc.RequestHandlers.initHandlersFromConfig created /terms: org.apache.solr.handler.component.SearchHandler
   [junit4]   2> 4572515 T13259 oasc.RequestHandlers.initHandlersFromConfig created spellCheckCompRH: org.apache.solr.handler.component.SearchHandler
   [junit4]   2> 4572515 T13259 oasc.RequestHandlers.initHandlersFromConfig created spellCheckCompRH_Direct: org.apache.solr.handler.component.SearchHandler
   [junit4]   2> 4572515 T13259 oasc.RequestHandlers.initHandlersFromConfig created spellCheckWithWordbreak: org.apache.solr.handler.component.SearchHandler
   [junit4]   2> 4572516 T13259 oasc.RequestHandlers.initHandlersFromConfig created spellCheckWithWordbreak_Direct: org.apache.solr.handler.component.SearchHandler
   [junit4]   2> 4572516 T13259 oasc.RequestHandlers.initHandlersFromConfig created spellCheckCompRH1: org.apache.solr.handler.component.SearchHandler
   [junit4]   2> 4572517 T13259 oasc.RequestHandlers.initHandlersFromConfig created mltrh: org.apache.solr.handler.component.SearchHandler
   [junit4]   2> 4572517 T13259 oasc.RequestHandlers.initHandlersFromConfig created tvrh: org.apache.solr.handler.component.SearchHandler
   [junit4]   2> 4572518 T13259 oasc.RequestHandlers.initHandlersFromConfig created /mlt: solr.MoreLikeThisHandler
   [junit4]   2> 4572518 T13259 oasc.RequestHandlers.initHandlersFromConfig created /debug/dump: solr.DumpRequestHandler
   [junit4]   2> 4572520 T13259 oashl.XMLLoader.init xsltCacheLifetimeSeconds=60
   [junit4]   2> 4572522 T13259 oashl.XMLLoader.init xsltCacheLifetimeSeconds=60
   [junit4]   2> 4572524 T13259 oashl.XMLLoader.init xsltCacheLifetimeSeconds=60
   [junit4]   2> 4572526 T13259 oashl.XMLLoader.init xsltCacheLifetimeSeconds=60
   [junit4]   2> 4572527 T13259 oasc.SolrCore.initDeprecatedSupport WARN solrconfig.xml uses deprecated <admin/gettableFiles>, Please update your config to use the ShowFileRequestHandler.
   [junit4]   2> 4572531 T13259 oasu.CommitTracker.<init> Hard AutoCommit: disabled
   [junit4]   2> 4572531 T13259 oasu.CommitTracker.<init> Soft AutoCommit: disabled
   [junit4]   2> 4572532 T13259 oasu.RandomMergePolicy.<init> RandomMergePolicy wrapping class org.apache.lucene.index.TieredMergePolicy: [TieredMergePolicy: maxMergeAtOnce=27, maxMergeAtOnceExplicit=33, maxMergedSegmentMB=23.5712890625, floorSegmentMB=0.60546875, forceMergeDeletesPctAllowed=29.206801103504286, segmentsPerTier=43.0, maxCFSSegmentSizeMB=8.796093022207999E12, noCFSRatio=0.35723471297759424
   [junit4]   2> 4572532 T13259 oasc.SolrDeletionPolicy.onInit SolrDeletionPolicy.onInit: commits: num=1
   [junit4]   2> 		commit{dir=RateLimitedDirectoryWrapper(MockDirectoryWrapper(RAMDirectory(id=lucene-68709d))),segFN=segments_1,generation=1}
   [junit4]   2> 4572533 T13259 oasc.SolrDeletionPolicy.updateCommits newest commit generation = 1
   [junit4]   2> 4572533 T13259 oass.SolrIndexSearcher.<init> Opening Searcher@2d0af[collection1] main
   [junit4]   2> 4572533 T13259 oasr.RestManager.init Initializing RestManager with initArgs: {storageIO=org.apache.solr.rest.ManagedResourceStorage$InMemoryStorageIO}
   [junit4]   2> 4572534 T13259 oasr.ManagedResourceStorage.load Reading _rest_managed.json using InMemoryStorage
   [junit4]   2> 4572534 T13259 oasr.ManagedResource.reloadFromStorage WARN No stored data found for /rest/managed
   [junit4]   2> 4572534 T13259 oasr.ManagedResourceStorage$JsonStorage.store Saved JSON object to path _rest_managed.json using InMemoryStorage
   [junit4]   2> 4572534 T13259 oasr.RestManager.init Initializing 0 registered ManagedResources
   [junit4]   2> 4572535 T13259 oashc.SpellCheckComponent.inform Initializing spell checkers
   [junit4]   2> 4572545 T13259 oass.DirectSolrSpellChecker.init init: {name=direct,classname=DirectSolrSpellChecker,field=lowerfilt,minQueryLength=3}
   [junit4]   2> 4572622 T13260 oasc.SolrCore.registerSearcher [collection1] Registered new searcher Searcher@2d0af[collection1] main{ExitableDirectoryReader(UninvertingDirectoryReader())}
   [junit4]   2> 4572629 T13259 oasc.CoreContainer.registerCore registering core: collection1
   [junit4]   2> 4572630 T13237 oass.SolrDispatchFilter.init user.dir=C:\Users\JenkinsSlave\workspace\Lucene-Solr-5.x-Windows\solr\build\solr-core\test\J0
   [junit4]   2> 4572631 T13237 oass.SolrDispatchFilter.init SolrDispatchFilter.init() done
   [junit4]   2> ASYNC  NEW_CORE C9133 name=collection1 org.apache.solr.core.SolrCore@170921
   [junit4]   2> 4572848 T13243 C9133 oasup.LogUpdateProcessor.finish [collection1] webapp=/aa/g path=/update params={wt=javabin&version=2} {deleteByQuery=*:* (-1483682378827169792)} 0 56
   [junit4]   2> ASYNC  NEW_CORE C9134 name=collection1 org.apache.solr.core.SolrCore@1f6b4f8
   [junit4]   2> 4572917 T13257 C9134 oasup.LogUpdateProcessor.finish [collection1] webapp=/aa/g path=/update params={wt=javabin&version=2} {deleteByQuery=*:* (-1483682378948804608)} 0 3
   [junit4]   2> 4572974 T13245 C9133 oasup.LogUpdateProcessor.finish [collection1] webapp=/aa/g path=/update params={wt=javabin&version=2} {add=[1 (1483682378971873280)]} 0 39
   [junit4]   2> 4572982 T13255 C9134 oasup.LogUpdateProcessor.finish [collection1] webapp=/aa/g path=/update params={wt=javabin&version=2} {add=[1 (1483682379018010624)]} 0 2
   [junit4]   2> 4572988 T13240 C9133 oasup.LogUpdateProcessor.finish [collection1] webapp=/aa/g path=/update params={wt=javabin&version=2} {add=[2 (1483682379026399232)]} 0 0
   [junit4]   2> 4572993 T13254 C9134 oasup.LogUpdateProcessor.finish [collection1] webapp=/aa/g path=/update params={wt=javabin&version=2} {add=[2 (1483682379030593536)]} 0 1
   [junit4]   2> 4573008 T13242 C9133 oasup.LogUpdateProcessor.finish [collection1] webapp=/aa/g path=/update params={wt=javabin&version=2} {add=[3 (1483682379043176448)]} 0 6
   [junit4]   2> 4573017 T13258 C9134 oasup.LogUpdateProcessor.finish [collection1] webapp=/aa/g path=/update params={wt=javabin&version=2} {add=[3 (1483682379055759360)]} 0 2
   [junit4]   2> 4573026 T13244 C9133 oasup.LogUpdateProcessor.finish [collection1] webapp=/aa/g path=/update params={wt=javabin&version=2} {add=[4 (1483682379065196544)]} 0 1
   [junit4]   2> 4573042 T13256 C9134 oasup.LogUpdateProcessor.finish [collection1] webapp=/aa/g path=/update params={wt=javabin&version=2} {add=[4 (1483682379081973760)]} 0 1
   [junit4]   2> 4573048 T13246 C9133 oasup.LogUpdateProcessor.finish [collection1] webapp=/aa/g path=/update params={wt=javabin&version=2} {add=[5 (1483682379088265216)]} 0 1
   [junit4]   2> 4573052 T13257 C9134 oasup.LogUpdateProcessor.finish [collection1] webapp=/aa/g path=/update params={wt=javabin&version=2} {add=[5 (1483682379092459520)]} 0 1
   [junit4]   2> 4573055 T13243 C9133 oasup.LogUpdateProcessor.finish [collection1] webapp=/aa/g path=/update params={wt=javabin&version=2} {add=[6 (1483682379096653824)]} 0 0
   [junit4]   2> 4573060 T13255 C9134 oasup.LogUpdateProcessor.finish [collection1] webapp=/aa/g path=/update params={wt=javabin&version=2} {add=[6 (1483682379100848128)]} 0 1
   [junit4]   2> 4573066 T13245 C9133 oasup.LogUpdateProcessor.finish [collection1] webapp=/aa/g path=/update params={wt=javabin&version=2} {add=[7 (1483682379106091008)]} 0 2
   [junit4]   2> 4573070 T13253 C9134 oasup.LogUpdateProcessor.finish [collection1] webapp=/aa/g path=/update params={wt=javabin&version=2} {add=[7 (1483682379112382464)]} 0 1
   [junit4]   2> 4573081 T13242 C9133 oasup.LogUpdateProcessor.finish [collection1] webapp=/aa/g path=/update params={wt=javabin&version=2} {add=[8 (1483682379122868224)]} 0 1
   [junit4]   2> 4573095 T13254 C9134 oasup.LogUpdateProcessor.finish [collection1] webapp=/aa/g path=/update params={wt=javabin&version=2} {add=[8 (1483682379138596864)]} 0 1
   [junit4]   2> 4573105 T13244 C9133 oasup.LogUpdateProcessor.finish [collection1] webapp=/aa/g path=/update params={wt=javabin&version=2} {add=[9 (1483682379146985472)]} 0 2
   [junit4]   2> 4573111 T13258 C9134 oasup.LogUpdateProcessor.finish [collection1] webapp=/aa/g path=/update params={wt=javabin&version=2} {add=[9 (1483682379155374080)]} 0 0
   [junit4]   2> 4573119 T13246 C9133 oasu.DirectUpdateHandler2.commit start commit{,optimize=false,openSearcher=true,waitSearcher=true,expungeDeletes=false,softCommit=false,prepareCommit=false}
   [junit4]   2> 4573282 T13246 C9133 oasc.SolrDeletionPolicy.onCommit SolrDeletionPolicy.onCommit: commits: num=2
   [junit4]   2> 		commit{dir=RateLimitedDirectoryWrapper(MockDirectoryWrapper(RAMDirectory(id=lucene-52a53f))),segFN=segments_1,generation=1}
   [junit4]   2> 		commit{dir=RateLimitedDirectoryWrapper(MockDirectoryWrapper(RAMDirectory(id=lucene-52a53f))),segFN=segments_2,generation=2}
   [junit4]   2> 4573292 T13246 C9133 oasc.SolrDeletionPolicy.updateCommits newest commit generation = 2
   [junit4]   2> 4573309 T13246 C9133 oass.SolrIndexSearcher.<init> Opening Searcher@11145f8[collection1] main
   [junit4]   2> 4573316 T13248 oasc.SolrCore.registerSearcher [collection1] Registered new searcher Searcher@11145f8[collection1] main{ExitableDirectoryReader(UninvertingDirectoryReader(Uninverting(_0(5.0.0):c9)))}
   [junit4]   2> 4573318 T13246 C9133 oasu.DirectUpdateHandler2.commit end_commit_flush
   [junit4]   2> 4573321 T13246 C9133 oasup.LogUpdateProcessor.finish [collection1] webapp=/aa/g path=/update params={waitSearcher=true&commit=true&softCommit=false&wt=javabin&version=2} {commit=} 0 204
   [junit4]   2> 4573331 T13256 C9134 oasu.DirectUpdateHandler2.commit start commit{,optimize=false,openSearcher=true,waitSearcher=true,expungeDeletes=false,softCommit=false,prepareCommit=false}
   [junit4]   2> 4573364 T13256 C9134 oasc.SolrDeletionPolicy.onCommit SolrDeletionPolicy.onCommit: commits: num=2
   [junit4]   2> 		commit{dir=RateLimitedDirectoryWrapper(MockDirectoryWrapper(RAMDirectory(id=lucene-68709d))),segFN=segments_1,generation=1}
   [junit4]   2> 		commit{dir=RateLimitedDirectoryWrapper(MockDirectoryWrapper(RAMDirectory(id=lucene-68709d))),segFN=segments_2,generation=2}
   [junit4]   2> 4573365 T13256 C9134 oasc.SolrDeletionPolicy.updateCommits newest commit generation = 2
   [junit4]   2> 4573366 T13256 C9134 oass.SolrIndexSearcher.<init> Opening Searcher@1a74e3e[collection1] main
   [junit4]   2> 4573373 T13256 C9134 oasu.DirectUpdateHandler2.commit end_commit_flush
   [junit4]   2> 4573389 T13260 oasc.SolrCore.registerSearcher [collection1] Registered new searcher Searcher@1a74e3e[collection1] main{ExitableDirectoryReader(UninvertingDirectoryReader(Uninverting(_0(5.0.0):c9)))}
   [junit4]   2> 4573390 T13256 C9134 oasup.LogUpdateProcessor.finish [collection1] webapp=/aa/g path=/update params={waitSearcher=true&commit=true&softCommit=false&wt=javabin&version=2} {commit=} 0 59
   [junit4]   2> 4573410 T13243 C9133 oasup.LogUpdateProcessor.finish [collection1] webapp=/aa/g path=/update params={wt=javabin&version=2} {add=[10 (1483682379455266816)]} 0 13
   [junit4]   2> 4573417 T13255 C9134 oasup.LogUpdateProcessor.finish [collection1] webapp=/aa/g path=/update params={wt=javabin&version=2} {add=[10 (1483682379475189760)]} 0 2
   [junit4]   2> 4573427 T13240 C9133 oasup.LogUpdateProcessor.finish [collection1] webapp=/aa/g path=/update params={wt=javabin&version=2} {add=[11 (1483682379486724096)]} 0 0
   [junit4]   2> 4573431 T13253 C9134 oasup.LogUpdateProcessor.finish [collection1] webapp=/aa/g path=/update params={wt=javabin&version=2} {add=[11 (1483682379490918400)]} 0 0
   [junit4]   2> 4573436 T13245 C9133 oasup.LogUpdateProcessor.finish [collection1] webapp=/aa/g path=/update params={wt=javabin&version=2} {add=[12 (1483682379496161280)]} 0 0
   [junit4]   2> 4573455 T13254 C9134 oasup.LogUpdateProcessor.finish [collection1] webapp=/aa/g path=/update params={wt=javabin&version=2} {add=[12 (1483682379516084224)]} 0 0
   [junit4]   2> 4573460 T13242 C9133 oasup.LogUpdateProcessor.finish [collection1] webapp=/aa/g path=/update params={wt=javabin&version=2} {add=[13 (1483682379520278528)]} 0 1
   [junit4]   2> 4573465 T13258 C9134 oasup.LogUpdateProcessor.finish [collection1] webapp=/aa/g path=/update params={wt=javabin&version=2} {add=[13 (1483682379524472832)]} 0 2
   [junit4]   2> 4573493 T13244 C9133 oasup.LogUpdateProcessor.finish [collection1] webapp=/aa/g path=/update params={wt=javabin&version=2} {add=[1001 (1483682379545444352)]} 0 10
   [junit4]   2> 4573498 T13256 C9134 oasup.LogUpdateProcessor.finish [collection1] webapp=/aa/g path=/update params={wt=javabin&version=2} {add=[1001 (1483682379561172992)]} 0 0
   [junit4]   2> 4573504 T13243 C9133 oasup.LogUpdateProcessor.finish [collection1] webapp=/aa/g path=/update params={wt=javabin&version=2} {add=[14 (1483682379566415872)]} 0 1
   [junit4]   2> 4573508 T13257 C9134 oasup.LogUpdateProcessor.finish [collection1] webapp=/aa/g path=/update params={wt=javabin&version=2} {add=[14 (1483682379571658752)]} 0 0
   [junit4]   2> 4573524 T13240 C9133 oasup.LogUpdateProcessor.finish [collection1] webapp=/aa/g path=/update params={wt=javabin&version=2} {add=[15 (1483682379587387392)]} 0 1
   [junit4]   2> 4573540 T13255 C9134 oasup.LogUpdateProcessor.finish [collection1] webapp=/aa/g path=/update params={wt=javabin&version=2} {add=[15 (1483682379604164608)]} 0 1
   [junit4]   2> 4573543 T13245 C9133 oasup.LogUpdateProcessor.finish [collection1] webapp=/aa/g path=/update params={wt=javabin&version=2} {add=[16 (1483682379608358912)]} 0 0
   [junit4]   2> 4573547 T13253 C9134 oasup.LogUpdateProcessor.finish [collection1] webapp=/aa/g path=/update params={wt=javabin&version=2} {add=[16 (1483682379612553216)]} 0 0
   [junit4]   2> 4573608 T13242 C9133 oasup.LogUpdateProcessor.finish [collection1] webapp=/aa/g path=/update params={wt=javabin&version=2} {add=[17 (1483682379676516352)]} 0 1
   [junit4]   2> 4573616 T13254 C9134 oasup.LogUpdateProcessor.finish [collection1] webapp=/aa/g path=/update params={wt=javabin&version=2} {add=[17 (1483682379683856384)]} 0 1
   [junit4]   2> 4573621 T13246 C9133 oasup.LogUpdateProcessor.finish [collection1] webapp=/aa/g path=/update params={wt=javabin&version=2} {add=[100 (1483682379688050688)]} 0 2
   [junit4]   2> 4573624 T13258 C9134 oasup.LogUpdateProcessor.finish [collection1] webapp=/aa/g path=/update params={wt=javabin&version=2} {add=[100 (1483682379693293568)]} 0 0
   [junit4]   2> 4573654 T13244 C9133 oasup.LogUpdateProcessor.finish [collection1] webapp=/aa/g path=/update params={wt=javabin&version=2} {add=[101 (1483682379724750848)]} 0 0
   [junit4]   2> 4573658 T13256 C9134 oasup.LogUpdateProcessor.finish [collection1] webapp=/aa/g path=/update params={wt=javabin&version=2} {add=[101 (1483682379727896576)]} 0 1
   [junit4]   2> 4573698 T13243 C9133 oasup.LogUpdateProcessor.finish [collection1] webapp=/aa/g path=/update params={wt=javabin&version=2} {add=[102 (1483682379770888192)]} 0 0
   [junit4]   2> 4573702 T13257 C9134 oasup.LogUpdateProcessor.finish [collection1] webapp=/aa/g path=/update params={wt=javabin&version=2} {add=[102 (1483682379774033920)]} 0 1
   [junit4]   2> 4573708 T13240 C9133 oasup.LogUpdateProcessor.finish [collection1] webapp=/aa/g path=/update params={wt=javabin&version=2} {add=[103 (1483682379779276800)]} 0 2
   [junit4]   2> 4573712 T13255 C9134 oasup.LogUpdateProcessor.finish [collection1] webapp=/aa/g path=/update params={wt=javabin&version=2} {add=[103 (1483682379784519680)]} 0 1
   [junit4]   2> 4573716 T13245 C9133 oasup.LogUpdateProcessor.finish [collection1] webapp=/aa/g path=/update params={wt=javabin&version=2} {add=[104 (1483682379789762560)]} 0 0
   [junit4]   2> 4573721 T13253 C9134 oasup.LogUpdateProcessor.finish [collection1] webapp=/aa/g path=/update params={wt=javabin&version=2} {add=[104 (1483682379793956864)]} 0 1
   [junit4]   2> 4573724 T13242 C9133 oasup.LogUpdateProcessor.finish [collection1] webapp=/aa/g path=/update params={wt=javabin&version=2} {add=[105 (1483682379798151168)]} 0 0
   [junit4]   2> 4573730 T13254 C9134 oasup.LogUpdateProcessor.finish [collection1] webapp=/aa/g path=/update params={wt=javabin&version=2} {add=[105 (1483682379803394048)]} 0 1
   [junit4]   2> 4573734 T13246 C9133 oasup.LogUpdateProcessor.finish [collection1] webapp=/aa/g path=/update params={wt=javabin&version=2} {add=[106 (1483682379808636928)]} 0 0
   [junit4]   2> 4573738 T13258 C9134 oasup.LogUpdateProcessor.finish [collection1] webapp=/aa/g path=/update params={wt=javabin&version=2} {add=[106 (1483682379812831232)]} 0 0
   [junit4]   2> 4573741 T13244 C9133 oasup.LogUpdateProcessor.finish [collection1] webapp=/aa/g path=/update params={wt=javabin&version=2} {add=[107 (1483682379815976960)]} 0 0
   [junit4]   2> 4573744 T13256 C9134 oasup.LogUpdateProcessor.finish [collection1] webapp=/aa/g path=/update params={wt=javabin&version=2} {add=[107 (1483682379819122688)]} 0 0
   [junit4]   2> 4573749 T13243 C9133 oasup.LogUpdateProcessor.finish [collection1] webapp=/aa/g path=/update params={wt=javabin&version=2} {add=[108 (1483682379824365568)]} 0 1
   [junit4]   2> 4573752 T13257 C9134 oasup.LogUpdateProcessor.finish [collection1] webapp=/aa/g path=/update params={wt=javabin&version=2} {add=[108 (1483682379827511296)]} 0 0
   [junit4]   2> 4573755 T13240 C9133 oasup.LogUpdateProcessor.finish [collection1] webapp=/aa/g path=/update params={wt=javabin&version=2} {add=[109 (1483682379830657024)]} 0 0
   [junit4]   2> 4573759 T13255 C9134 oasup.LogUpdateProcessor.finish [collection1] webapp=/aa/g path=/update params={wt=javabin&version=2} {add=[109 (1483682379834851328)]} 0 0
   [junit4]   2> 4573762 T13245 C9133 oasup.LogUpdateProcessor.finish [collection1] webapp=/aa/g path=/update params={wt=javabin&version=2} {add=[110 (1483682379837997056)]} 0 0
   [junit4]   2> 4573765 T13253 C9134 oasup.LogUpdateProcessor.finish [collection1] webapp=/aa/g path=/update params={wt=javabin&version=2} {add=[110 (1483682379841142784)]} 0 0
   [junit4]   2> 4573769 T13242 C9133 oasup.LogUpdateProcessor.finish [collection1] webapp=/aa/g path=/update params={wt=javabin&version=2} {add=[111 (1483682379845337088)]} 0 0
   [junit4]   2> 4573773 T13254 C9134 oasup.LogUpdateProcessor.finish [collection1] webapp=/aa/g path=/update params={wt=javabin&version=2} {add=[111 (1483682379848482816)]} 0 1
   [junit4]   2> 4573778 T13246 C9133 oasup.LogUpdateProcessor.finish [collection1] webapp=/aa/g path=/update params={wt=javabin&version=2} {add=[112 (1483682379852677120)]} 0 2
   [junit4]   2> 4573781 T13258 C9134 oasup.LogUpdateProcessor.finish [collection1] webapp=/aa/g path=/update params={wt=javabin&version=2} {add=[112 (1483682379857920000)]} 0 0
   [junit4]   2> 4573784 T13244 C9133 oasup.LogUpdateProcessor.finish [collection1] webapp=/aa/g path=/update params={wt=javabin&version=2} {add=[113 (1483682379861065728)]} 0 0
   [junit4]   2> 4573789 T13256 C9134 oasup.LogUpdateProcessor.finish [collection1] webapp=/aa/g path=/update params={wt=javabin&version=2} {add=[113 (1483682379865260032)]} 0 1
   [junit4]   2> 4573792 T13243 C9133 oasup.LogUpdateProcessor.finish [collection1] webapp=/aa/g path=/update params={wt=javabin&version=2} {add=[114 (1483682379869454336)]} 0 0
   [junit4]   2> 4573795 T13257 C9134 oasup.LogUpdateProcessor.finish [collection1] webapp=/aa/g path=/update params={wt=javabin&version=2} {add=[114 (1483682379872600064)]} 0 0
   [junit4]   2> 4573799 T13240 C9133 oasup.LogUpdateProcessor.finish [collection1] webapp=/aa/g path=/update params={wt=javabin&version=2} {add=[115 (1483682379876794368)]} 0 0
   [junit4]   2> 4573802 T13253 C9134 oasup.LogUpdateProcessor.finish [collection1] webapp=/aa/g path=/update params={wt=javabin&version=2} {add=[115 (1483682379879940096)]} 0 0
   [junit4]   2> 4573805 T13245 C9133 oasup.LogUpdateProcessor.finish [collection1] webapp=/aa/g path=/update params={wt=javabin&version=2} {add=[116 (1483682379883085824)]} 0 0
   [junit4]   2> 4573809 T13254 C9134 oasup.LogUpdateProcessor.finish [collection1] webapp=/aa/g path=/update params={wt=javabin&version=2} {add=[116 (1483682379887280128)]} 0 0
   [junit4]   2> 4573812 T13242 C9133 oasup.LogUpdateProcessor.finish [collection1] webapp=/aa/g path=/update params={wt=javabin&version=2} {add=[117 (1483682379890425856)]} 0 0
   [junit4]   2> 4573816 T13258 C9134 oasup.LogUpdateProcessor.finish [collection1] webapp=/aa/g path=/update params={wt=javabin&version=2} {add=[117 (1483682379893571584)]} 0 1
   [junit4]   2> 4573821 T13246 C9133 oasup.LogUpdateProcessor.finish [collection1] webapp=/aa/g path=/update params={wt=javabin&version=2} {add=[118 (1483682379898814464)]} 0 1
   [junit4]   2> 4573825 T13256 C9134 oasup.LogUpdateProcessor.finish [collection1] webapp=/aa/g path=/update params={wt=javabin&version=2} {add=[118 (1483682379903008768)]} 0 1
   [junit4]   2> 4573828 T13244 C9133 oasup.LogUpdateProcessor.finish [collection1] webapp=/aa/g path=/update params={wt=javabin&version=2} {add=[119 (1483682379907203072)]} 0 0
   [junit4]   2> 4573834 T13257 C9134 oasup.LogUpdateProcessor.finish [collection1] webapp=/aa/g path=/update params={wt=javabin&version=2} {add=[119 (1483682379913494528)]} 0 0
   [junit4]   2> 4573837 T13243 C9133 oasup.LogUpdateProcessor.finish [collection1] webapp=/aa/g path=/update params={wt=javabin&version=2} {add=[120 (1483682379916640256)]} 0 0
   [junit4]   2> 4573845 T13255 C9134 oasup.LogUpdateProcessor.finish [collection1] webapp=/aa/g path=/update params={wt=javabin&version=2} {add=[120 (1483682379923980288)]} 0 1
   [junit4]   2> 4573856 T13240 C9133 oasup.LogUpdateProcessor.finish [collection1] webapp=/aa/g path=/update params={wt=javabin&version=2} {add=[121 (1483682379936563200)]} 0 2
   [junit4]   2> 4573865 T13253 C9134 oasup.LogUpdateProcessor.finish [collection1] webapp=/aa/g path=/update params={wt=javabin&version=2} {add=[121 (1483682379946000384)]} 0 0
   [junit4]   2> 4666038 T13245 C9133 oasup.LogUpdateProcessor.finish [collection1] webapp=/aa/g path=/update params={wt=javabin&version=2} {add=[122 (1483682476595347456)]} 0 1
   [junit4]   2> 4666055 T13237 oasc.CoreContainer.shutdown Shutting down CoreContainer instance=12391302
   [junit4]   2> 4666059 T13237 oasc.SolrCore.close [collection1]  CLOSING SolrCore org.apache.solr.core.SolrCore@170921
   [junit4]   2> 4666071 T13237 oasu.DirectUpdateHandler2.close closing DirectUpdateHandler2{commits=1,autocommits=0,soft autocommits=0,optimizes=0,rollbacks=0,expungeDeletes=0,docsPending=32,adds=32,deletesById=0,deletesByQuery=0,errors=0,cumulative_adds=41,cumulative_deletesById=0,cumulative_deletesByQuery=1,cumulative_errors=0,transaction_logs_total_size=3424,transaction_logs_total_number=1}
   [junit4]   2> 4666074 T13237 oasu.SolrCoreState.decrefSolrCoreState Closing SolrCoreState
   [junit4]   2> 4666074 T13237 oasu.DefaultSolrCoreState.closeIndexWriter SolrCoreState ref count has reached 0 - closing IndexWriter
   [junit4]   2> 4666075 T13237 oasu.DefaultSolrCoreState.closeIndexWriter closing IndexWriter with IndexWriterCloser
   [junit4]   2> 4666076 T13237 C9133 oasu.DirectUpdateHandler2.closeWriter Committing on IndexWriter close.
   [junit4]   2> 4666096 T13237 C9133 oasc.SolrDeletionPolicy.onCommit SolrDeletionPolicy.onCommit: commits: num=2
   [junit4]   2> 		commit{dir=RateLimitedDirectoryWrapper(MockDirectoryWrapper(RAMDirectory(id=lucene-52a53f))),segFN=segments_2,generation=2}
   [junit4]   2> 		commit{dir=RateLimitedDirectoryWrapper(MockDirectoryWrapper(RAMDirectory(id=lucene-52a53f))),segFN=segments_3,generation=3}
   [junit4]   2> 4666096 T13237 C9133 oasc.SolrDeletionPolicy.updateCommits newest commit generation = 3
   [junit4]   2> 4666099 T13237 oasc.SolrCore.closeSearcher [collection1] Closing main searcher on request.
   [junit4]   2> 4666100 T13237 oasc.CachingDirectoryFactory.close Closing MockDirectoryFactory - 2 directories currently being tracked
   [junit4]   2> 4666100 T13237 oasc.CachingDirectoryFactory.closeCacheValue looking to close C:\Users\JenkinsSlave\workspace\Lucene-Solr-5.x-Windows\solr\build\solr-core\test\J0\temp\solr.TestDistributedSearch-363C8186B2D84C41-001\tempDir-001/control/data\ [CachedDir<<refCount=0;path=C:\Users\JenkinsSlave\workspace\Lucene-Solr-5.x-Windows\solr\build\solr-core\test\J0\temp\solr.TestDistributedSearch-363C8186B2D84C41-001\tempDir-001/control/data\;done=false>>]
   [junit4]   2> 4666100 T13237 oasc.CachingDirectoryFactory.close Closing directory: C:\Users\JenkinsSlave\workspace\Lucene-Solr-5.x-Windows\solr\build\solr-core\test\J0\temp\solr.TestDistributedSearch-363C8186B2D84C41-001\tempDir-001/control/data\
   [junit4]   2> 4666100 T13237 oasc.CachingDirectoryFactory.closeCacheValue looking to close C:\Users\JenkinsSlave\workspace\Lucene-Solr-5.x-Windows\solr\build\solr-core\test\J0\temp\solr.TestDistributedSearch-363C8186B2D84C41-001\tempDir-001/control/data\index [CachedDir<<refCount=0;path=C:\Users\JenkinsSlave\workspace\Lucene-Solr-5.x-Windows\solr\build\solr-core\test\J0\temp\solr.TestDistributedSearch-363C8186B2D84C41-001\tempDir-001/control/data\index;done=false>>]
   [junit4]   2> 4666102 T13237 oasc.CachingDirectoryFactory.close Closing directory: C:\Users\JenkinsSlave\workspace\Lucene-Solr-5.x-Windows\solr\build\solr-core\test\J0\temp\solr.TestDistributedSearch-363C8186B2D84C41-001\tempDir-001/control/data\index
   [junit4]   2> 4666103 T13237 oejsh.ContextHandler.doStop stopped o.e.j.s.ServletContextHandler{/aa/g,null}
   [junit4]   2> 4672045 T13237 oasc.CoreContainer.shutdown Shutting down CoreContainer instance=20844240
   [junit4]   2> 4672047 T13237 oasc.SolrCore.close [collection1]  CLOSING SolrCore org.apache.solr.core.SolrCore@1f6b4f8
   [junit4]   2> 4672062 T13237 oasu.DirectUpdateHandler2.close closing DirectUpdateHandler2{commits=1,autocommits=0,soft autocommits=0,optimizes=0,rollbacks=0,expungeDeletes=0,docsPending=31,adds=31,deletesById=0,deletesByQuery=0,errors=0,cumulative_adds=40,cumulative_deletesById=0,cumulative_deletesByQuery=1,cumulative_errors=0,transaction_logs_total_size=3424,transaction_logs_total_number=1}
   [junit4]   2> 4672063 T13237 oasu.SolrCoreState.decrefSolrCoreState Closing SolrCoreState
   [junit4]   2> 4672065 T13237 oasu.DefaultSolrCoreState.closeIndexWriter SolrCoreState ref count has reached 0 - closing IndexWriter
   [junit4]   2> 4672065 T13237 oasu.DefaultSolrCoreState.closeIndexWriter closing IndexWriter with IndexWriterCloser
   [junit4]   2> 4672065 T13237 C9134 oasu.DirectUpdateHandler2.closeWriter Committing on IndexWriter close.
   [junit4]   2> 4672088 T13237 C9134 oasc.SolrDeletionPolicy.onCommit SolrDeletionPolicy.onCommit: commits: num=2
   [junit4]   2> 		commit{dir=RateLimitedDirectoryWrapper(MockDirectoryWrapper(RAMDirectory(id=lucene-68709d))),segFN=segments_2,generation=2}
   [junit4]   2> 		commit{dir=RateLimitedDirectoryWrapper(MockDirectoryWrapper(RAMDirectory(id=lucene-68709d))),segFN=segments_3,generation=3}
   [junit4]   2> 4672089 T13237 C9134 oasc.SolrDeletionPolicy.updateCommits newest commit generation = 3
   [junit4]   2> 4672090 T13237 oasc.SolrCore.closeSearcher [collection1] Closing main searcher on request.
   [junit4]   2> 4672090 T13237 oasc.CachingDirectoryFactory.close Closing MockDirectoryFactory - 2 directories currently being tracked
   [junit4]   2> 4672092 T13237 oasc.CachingDirectoryFactory.closeCacheValue looking to close C:\Users\JenkinsSlave\workspace\Lucene-Solr-5.x-Windows\solr\build\solr-core\test\J0\temp\solr.TestDistributedSearch-363C8186B2D84C41-001\tempDir-001/shard0/data\index [CachedDir<<refCount=0;path=C:\Users\JenkinsSlave\workspace\Lucene-Solr-5.x-Windows\solr\build\solr-core\test\J0\temp\solr.TestDistributedSearch-363C8186B2D84C41-001\tempDir-001/shard0/data\index;done=false>>]
   [junit4]   2> 4672092 T13237 oasc.CachingDirectoryFactory.close Closing directory: C:\Users\JenkinsSlave\workspace\Lucene-Solr-5.x-Windows\solr\build\solr-core\test\J0\temp\solr.TestDistributedSearch-363C8186B2D84C41-001\tempDir-001/shard0/data\index
   [junit4]   2> 4672093 T13237 oasc.CachingDirectoryFactory.closeCacheValue looking to close C:\Users\JenkinsSlave\workspace\Lucene-Solr-5.x-Windows\solr\build\solr-core\test\J0\temp\solr.TestDistributedSearch-363C8186B2D84C41-001\tempDir-001/shard0/data\ [CachedDir<<refCount=0;path=C:\Users\JenkinsSlave\workspace\Lucene-Solr-5.x-Windows\solr\build\solr-core\test\J0\temp\solr.TestDistributedSearch-363C8186B2D84C41-001\tempDir-001/shard0/data\;done=false>>]
   [junit4]   2> 4672093 T13237 oasc.CachingDirectoryFactory.close Closing directory: C:\Users\JenkinsSlave\workspace\Lucene-Solr-5.x-Windows\solr\build\solr-core\test\J0\temp\solr.TestDistributedSearch-363C8186B2D84C41-001\tempDir-001/shard0/data\
   [junit4]   2> 4672094 T13237 oejsh.ContextHandler.doStop stopped o.e.j.s.ServletContextHandler{/aa/g,null}
   [junit4]   2> 4678083 T13237 oas.SolrTestCaseJ4.tearDown ###Ending testDistribSearch
   [junit4]   2> NOTE: reproduce with: ant test  -Dtestcase=TestDistributedSearch -Dtests.method=testDistribSearch -Dtests.seed=363C8186B2D84C41 -Dtests.slow=true -Dtests.locale=sr_RS -Dtests.timezone=Asia/Kuwait -Dtests.asserts=false -Dtests.file.encoding=US-ASCII
   [junit4] ERROR    107s | TestDistributedSearch.testDistribSearch <<<
   [junit4]    > Throwable #1: org.apache.solr.client.solrj.SolrServerException: Timeout occured while waiting response from server at: https://127.0.0.1:65279/aa/g
   [junit4]    > 	at __randomizedtesting.SeedInfo.seed([363C8186B2D84C41:B7DA0F9EC5872C7D]:0)
   [junit4]    > 	at org.apache.solr.client.solrj.impl.HttpSolrServer.executeMethod(HttpSolrServer.java:581)
   [junit4]    > 	at org.apache.solr.client.solrj.impl.HttpSolrServer.request(HttpSolrServer.java:215)
   [junit4]    > 	at org.apache.solr.client.solrj.impl.HttpSolrServer.request(HttpSolrServer.java:211)
   [junit4]    > 	at org.apache.solr.client.solrj.request.AbstractUpdateRequest.process(AbstractUpdateRequest.java:124)
   [junit4]    > 	at org.apache.solr.client.solrj.SolrServer.add(SolrServer.java:116)
   [junit4]    > 	at org.apache.solr.client.solrj.SolrServer.add(SolrServer.java:102)
   [junit4]    > 	at org.apache.solr.BaseDistributedSearchTestCase.indexDoc(BaseDistributedSearchTestCase.java:438)
   [junit4]    > 	at org.apache.solr.BaseDistributedSearchTestCase.indexr(BaseDistributedSearchTestCase.java:420)
   [junit4]    > 	at org.apache.solr.TestDistributedSearch.doTest(TestDistributedSearch.java:120)
   [junit4]    > 	at org.apache.solr.BaseDistributedSearchTestCase.testDistribSearch(BaseDistributedSearchTestCase.java:875)
   [junit4]    > 	at java.lang.Thread.run(Thread.java:745)
   [junit4]    > Caused by: java.net.SocketTimeoutException: Read timed out
   [junit4]    > 	at java.net.SocketInputStream.socketRead0(Native Method)
   [junit4]    > 	at java.net.SocketInputStream.socketRead(SocketInputStream.java:116)
   [junit4]    > 	at java.net.SocketInputStream.read(SocketInputStream.java:170)
   [junit4]    > 	at java.net.SocketInputStream.read(SocketInputStream.java:141)
   [junit4]    > 	at sun.security.ssl.InputRecord.readFully(InputRecord.java:465)
   [junit4]    > 	at sun.security.ssl.InputRecord.read(InputRecord.java:503)
   [junit4]    > 	at sun.security.ssl.SSLSocketImpl.readRecord(SSLSocketImpl.java:954)
   [junit4]    > 	at sun.security.ssl.SSLSocketImpl.readDataRecord(SSLSocketImpl.java:911)
   [junit4]    > 	at sun.security.ssl.AppInputStream.read(AppInputStream.java:105)
   [junit4]    > 	at org.apache.http.impl.io.AbstractSessionInputBuffer.fillBuffer(AbstractSessionInputBuffer.java:160)
   [junit4]    > 	at org.apache.http.impl.io.SocketInputBuffer.fillBuffer(SocketInputBuffer.java:84)
   [junit4]    > 	at org.apache.http.impl.io.AbstractSessionInputBuffer.readLine(AbstractSessionInputBuffer.java:273)
   [junit4]    > 	at org.apache.http.impl.conn.DefaultHttpResponseParser.parseHead(DefaultHttpResponseParser.java:140)
   [junit4]    > 	at org.apache.http.impl.conn.DefaultHttpResponseParser.parseHead(DefaultHttpResponseParser.java:57)
   [junit4]    > 	at org.apache.http.impl.io.AbstractMessageParser.parse(AbstractMessageParser.java:260)
   [junit4]    > 	at org.apache.http.impl.AbstractHttpClientConnection.receiveResponseHeader(AbstractHttpClientConnection.java:283)
   [junit4]    > 	at org.apache.http.impl.conn.DefaultClientConnection.receiveResponseHeader(DefaultClientConnection.java:251)
   [junit4]    > 	at org.apache.http.impl.conn.ManagedClientConnectionImpl.receiveResponseHeader(ManagedClientConnectionImpl.java:197)
   [junit4]    > 	at org.apache.http.protocol.HttpRequestExecutor.doReceiveResponse(HttpRequestExecutor.java:271)
   [junit4]    > 	at org.apache.http.protocol.HttpRequestExecutor.execute(HttpRequestExecutor.java:123)
   [junit4]    > 	at org.apache.http.impl.client.DefaultRequestDirector.tryExecute(DefaultRequestDirector.java:682)
   [junit4]    > 	at org.apache.http.impl.client.DefaultRequestDirector.execute(DefaultRequestDirector.java:486)
   [junit4]    > 	at org.apache.http.impl.client.AbstractHttpClient.doExecute(AbstractHttpClient.java:863)
   [junit4]    > 	at org.apache.http.impl.client.CloseableHttpClient.execute(CloseableHttpClient.java:82)
   [junit4]    > 	at org.apache.http.impl.client.CloseableHttpClient.execute(CloseableHttpClient.java:106)
   [junit4]    > 	at org.apache.http.impl.client.CloseableHttpClient.execute(CloseableHttpClient.java:57)
   [junit4]    > 	at org.apache.solr.client.solrj.impl.HttpSolrServer.executeMethod(HttpSolrServer.java:465)
   [junit4]    > 	... 48 more
   [junit4]   2> 4678167 T13237 oas.SolrTestCaseJ4.deleteCore ###deleteCore
   [junit4]   2> NOTE: leaving temporary files on disk at: C:\Users\JenkinsSlave\workspace\Lucene-Solr-5.x-Windows\solr\build\solr-core\test\J0\temp\solr.TestDistributedSearch-363C8186B2D84C41-001
   [junit4]   2> NOTE: test params are: codec=Asserting(Lucene50): {other_tl1=FSTOrd50, SubjectTerms_mfacet=FSTOrd50, n_l1=FSTOrd50, a_n_tdt=PostingsFormat(name=LuceneVarGapFixedInterval), multiDefault=PostingsFormat(name=LuceneFixedGap), intDefault=FSTOrd50, n_td1=PostingsFormat(name=LuceneFixedGap), n_d1=FSTOrd50, n_f1=PostingsFormat(name=LuceneFixedGap), range_facet_l=FSTOrd50, n_tl1=PostingsFormat(name=LuceneFixedGap), oddField_s=PostingsFormat(name=Memory doPackFST= true), n_tf1=FSTOrd50, lowerfilt1and2=PostingsFormat(name=LuceneFixedGap), a_t=FSTOrd50, lowerfilt=PostingsFormat(name=LuceneFixedGap), id=PostingsFormat(name=LuceneVarGapFixedInterval), text=PostingsFormat(name=Memory doPackFST= true), timestamp=FSTOrd50, n_dt1=PostingsFormat(name=LuceneFixedGap), a_i1=FSTOrd50, b_n_tdt=FSTOrd50, n_ti1=PostingsFormat(name=LuceneVarGapFixedInterval), rnd_b=PostingsFormat(name=LuceneVarGapFixedInterval), _version_=FSTOrd50, foo_b=PostingsFormat(name=Memory doPackFST= true), n_tdt1=FSTOrd50, foo_d=PostingsFormat(name=LuceneVarGapFixedInterval), foo_f=PostingsFormat(name=Memory doPackFST= true)}, docValues:{timestamp=DocValuesFormat(name=Asserting)}, sim=DefaultSimilarity, locale=sr_RS, timezone=Asia/Kuwait
   [junit4]   2> NOTE: Windows 7 6.1 x86/Oracle Corporation 1.8.0_40-ea (32-bit)/cpus=2,threads=1,free=85273792,total=432173056
   [junit4]   2> NOTE: All tests run in this JVM: [DistanceFunctionTest, TestRandomMergePolicy, TestDefaultSimilarityFactory, RAMDirectoryFactoryTest, AssignTest, PreAnalyzedUpdateProcessorTest, ShardSplitTest, TestSolrXmlPersistence, CachingDirectoryFactoryTest, TestReversedWildcardFilterFactory, BlockDirectoryTest, SuggesterFSTTest, TestMaxScoreQueryParser, TestHighlightDedupGrouping, TestMultiCoreConfBootstrap, FullSolrCloudDistribCmdsTest, DeleteInactiveReplicaTest, TestDistribDocBasedVersion, TestMergePolicyConfig, DistributedExpandComponentTest, TestFastWriter, TestJoin, SimplePostToolTest, TestExceedMaxTermLength, TestManagedSchemaDynamicFieldResource, SoftAutoCommitTest, DocValuesTest, TestCloudPivotFacet, QueryEqualityTest, HdfsLockFactoryTest, TestAddFieldRealTimeGet, TestLMDirichletSimilarityFactory, FieldAnalysisRequestHandlerTest, TermVectorComponentDistributedTest, AsyncMigrateRouteKeyTest, AnalysisAfterCoreReloadTest, TestComplexPhraseQParserPlugin, TestStressLucene, LeaderInitiatedRecoveryOnCommitTest, TestArbitraryIndexDir, PingRequestHandlerTest, TestHighFrequencyDictionaryFactory, TestSolrDeletionPolicy2, SimpleCollectionCreateDeleteTest, TestIndexingPerformance, SyncSliceTest, TestLuceneMatchVersion, MoreLikeThisHandlerTest, AnalyticsMergeStrategyTest, AddSchemaFieldsUpdateProcessorFactoryTest, LeaderElectionTest, UUIDFieldTest, ShardRoutingCustomTest, TestTrie, SolrRequestParserTest, LegacyHTMLStripCharFilterTest, TestSolr4Spatial2, TestComponentsName, TestSweetSpotSimilarityFactory, NumericFieldsTest, TestJmxIntegration, SuggesterTest, CoreAdminRequestStatusTest, TestBM25SimilarityFactory, TestIBSimilarityFactory, TestSchemaSimilarityResource, HdfsChaosMonkeySafeLeaderTest, DirectSolrConnectionTest, TestFieldTypeResource, TestManagedSynonymFilterFactory, FileBasedSpellCheckerTest, TestPseudoReturnFields, TestDefaultSearchFieldResource, TestReloadAndDeleteDocs, TestDistributedGrouping, TestAnalyzedSuggestions, RequestHandlersTest, CoreAdminHandlerTest, SliceStateTest, VMParamsZkACLAndCredentialsProvidersTest, PeerSyncTest, ConnectionManagerTest, HardAutoCommitTest, TestSolrQueryParser, ShardRoutingTest, TestCoreContainer, DirectSolrSpellCheckerTest, AlternateDirectoryTest, AnalysisErrorHandlingTest, SolrCoreCheckLockOnStartupTest, ResponseLogComponentTest, TestBlendedInfixSuggestions, UniqFieldsUpdateProcessorFactoryTest, TestCloudManagedSchemaConcurrent, PreAnalyzedFieldTest, RollingRestartTest, TestOverriddenPrefixQueryForCustomFieldType, DistributedIntervalFacetingTest, DeleteShardTest, PathHierarchyTokenizerFactoryTest, SpellCheckCollatorTest, ResponseHeaderTest, CurrencyFieldXmlFileTest, TestCloudManagedSchema, StatsComponentTest, SignatureUpdateProcessorFactoryTest, TestWriterPerf, DistributedQueryElevationComponentTest, HdfsBasicDistributedZkTest, LoggingHandlerTest, TestFieldSortValues, TestFieldCollectionResource, TermsComponentTest, TestReplicaProperties, CursorMarkTest, TestConfig, CoreContainerCoreInitFailuresTest, DOMUtilTest, JSONWriterTest, TestModifyConfFiles, TestCSVResponseWriter, ChaosMonkeyNothingIsSafeTest, SearchHandlerTest, CopyFieldTest, SimpleFacetsTest, TestStressReorder, DocExpirationUpdateProcessorFactoryTest, MultiTermTest, TestReload, TestSortingResponseWriter, TestZkChroot, TestRandomFaceting, TestFiltering, TestDocSet, TestExpandComponent, IndexBasedSpellCheckerTest, SystemInfoHandlerTest, TestInfoStreamLogging, TestNonDefinedSimilarityFactory, TestCollationFieldDocValues, CloudMLTQParserTest, TestStressVersions, MergeStrategyTest, MigrateRouteKeyTest, TestWordDelimiterFilterFactory, SpellCheckComponentTest, TestOmitPositions, TestManagedSchemaFieldTypeResource, TestDocBasedVersionConstraints, TestReplicationHandler, TestShardHandlerFactory, NoCacheHeaderTest, TestSearcherReuse, TestLeaderElectionZkExpiry, TestBulkSchemaConcurrent, SchemaVersionSpecificBehaviorTest, DistributedTermsComponentTest, SolrInfoMBeanTest, TestCoreDiscovery, OverseerCollectionProcessorTest, TestSchemaManager, HdfsBasicDistributedZk2Test, RankQueryTest, OverriddenZkACLAndCredentialsProvidersTest, TestStressUserVersions, TestBulkSchemaAPI, ZkCLITest, TestFieldTypeCollectionResource, AliasIntegrationTest, DocValuesMissingTest, BinaryUpdateRequestHandlerTest, TestNonNRTOpen, MinimalSchemaTest, EchoParamsTest, TestSort, SampleTest, StatelessScriptUpdateProcessorFactoryTest, LukeRequestHandlerTest, TestManagedSchema, CoreMergeIndexesAdminHandlerTest, ChaosMonkeySafeLeaderTest, TestSolrDeletionPolicy1, TestRemoteStreaming, TestQueryUtils, HttpPartitionTest, TestSuggestSpellingConverter, DeleteLastCustomShardedReplicaTest, TimeZoneUtilsTest, TestRecovery, QueryResultKeyTest, HdfsRecoveryZkTest, TestBinaryField, RegexBoostProcessorTest, DirectUpdateHandlerTest, StandardRequestHandlerTest, StressHdfsTest, SolrCmdDistributorTest, TestChildDocTransformer, SolrPluginUtilsTest, TestSolrQueryParserResource, TestSystemIdResolver, DocValuesMultiTest, NotRequiredUniqueKeyTest, TestMiniSolrCloudCluster, DateFieldTest, UpdateRequestProcessorFactoryTest, ScriptEngineTest, ClusterStateUpdateTest, TestDynamicFieldCollectionResource, TestCollationField, DistributedDebugComponentTest, DistributedFacetPivotLargeTest, DistributedFacetPivotSmallTest, OutOfBoxZkACLAndCredentialsProvidersTest, TestRandomDVFaceting, BasicDistributedZkTest, BasicDistributedZk2Test, UnloadDistributedZkTest, CollectionsAPIDistributedZkTest, OpenCloseCoreStressTest, OverseerTest, LeaderElectionIntegrationTest, BasicZkTest, RecoveryZkTest, ZkSolrClientTest, TestDistributedSearch]
   [junit4] Completed in 106.98s, 1 test, 1 error <<< FAILURES!

[...truncated 649 lines...]
BUILD FAILED
C:\Users\JenkinsSlave\workspace\Lucene-Solr-5.x-Windows\build.xml:525: The following error occurred while executing this line:
C:\Users\JenkinsSlave\workspace\Lucene-Solr-5.x-Windows\build.xml:473: The following error occurred while executing this line:
C:\Users\JenkinsSlave\workspace\Lucene-Solr-5.x-Windows\build.xml:61: The following error occurred while executing this line:
C:\Users\JenkinsSlave\workspace\Lucene-Solr-5.x-Windows\extra-targets.xml:39: The following error occurred while executing this line:
C:\Users\JenkinsSlave\workspace\Lucene-Solr-5.x-Windows\solr\build.xml:189: The following error occurred while executing this line:
C:\Users\JenkinsSlave\workspace\Lucene-Solr-5.x-Windows\solr\common-build.xml:502: The following error occurred while executing this line:
C:\Users\JenkinsSlave\workspace\Lucene-Solr-5.x-Windows\lucene\common-build.xml:1359: The following error occurred while executing this line:
C:\Users\JenkinsSlave\workspace\Lucene-Solr-5.x-Windows\lucene\common-build.xml:966: There were test failures: 441 suites, 1804 tests, 1 error, 53 ignored (30 assumptions)

Total time: 155 minutes 1 second
Build step 'Invoke Ant' marked build as failure
[description-setter] Description set: Java: 32bit/jdk1.8.0_40-ea-b09 -server -XX:+UseSerialGC (asserts: false)
Archiving artifacts
Recording test results
Email was triggered for: Failure - Any
Sending email for trigger: Failure - Any



Mime
View raw message