lucene-dev mailing list archives

Site index · List index
Message view « Date » · « Thread »
Top « Date » · « Thread »
From Apache Jenkins Server <jenk...@builds.apache.org>
Subject [JENKINS] Lucene-Solr-SmokeRelease-5.x - Build # 216 - Still Failing
Date Sat, 29 Nov 2014 02:37:43 GMT
Build: https://builds.apache.org/job/Lucene-Solr-SmokeRelease-5.x/216/

No tests ran.

Build Log:
[...truncated 52068 lines...]
prepare-release-no-sign:
    [mkdir] Created dir: /usr/home/jenkins/jenkins-slave/workspace/Lucene-Solr-SmokeRelease-5.x/lucene/build/smokeTestRelease/dist
     [copy] Copying 446 files to /usr/home/jenkins/jenkins-slave/workspace/Lucene-Solr-SmokeRelease-5.x/lucene/build/smokeTestRelease/dist/lucene
     [copy] Copying 245 files to /usr/home/jenkins/jenkins-slave/workspace/Lucene-Solr-SmokeRelease-5.x/lucene/build/smokeTestRelease/dist/solr
   [smoker] Java 1.7 JAVA_HOME=/home/jenkins/tools/java/latest1.7
   [smoker] NOTE: output encoding is US-ASCII
   [smoker] 
   [smoker] Load release URL "file:/usr/home/jenkins/jenkins-slave/workspace/Lucene-Solr-SmokeRelease-5.x/lucene/build/smokeTestRelease/dist/"...
   [smoker] 
   [smoker] Test Lucene...
   [smoker]   test basics...
   [smoker]   get KEYS
   [smoker]     0.1 MB in 0.01 sec (8.9 MB/sec)
   [smoker]   check changes HTML...
   [smoker]   download lucene-5.0.0-src.tgz...
   [smoker]     27.8 MB in 0.04 sec (680.5 MB/sec)
   [smoker]     verify md5/sha1 digests
   [smoker]   download lucene-5.0.0.tgz...
   [smoker]     63.9 MB in 0.09 sec (697.3 MB/sec)
   [smoker]     verify md5/sha1 digests
   [smoker]   download lucene-5.0.0.zip...
   [smoker]     73.4 MB in 0.13 sec (547.4 MB/sec)
   [smoker]     verify md5/sha1 digests
   [smoker]   unpack lucene-5.0.0.tgz...
   [smoker]     verify JAR metadata/identity/no javax.* or java.* classes...
   [smoker]     test demo with 1.7...
   [smoker]       got 5619 hits for query "lucene"
   [smoker]     checkindex with 1.7...
   [smoker]     check Lucene's javadoc JAR
   [smoker]   unpack lucene-5.0.0.zip...
   [smoker]     verify JAR metadata/identity/no javax.* or java.* classes...
   [smoker]     test demo with 1.7...
   [smoker]       got 5619 hits for query "lucene"
   [smoker]     checkindex with 1.7...
   [smoker]     check Lucene's javadoc JAR
   [smoker]   unpack lucene-5.0.0-src.tgz...
   [smoker]     make sure no JARs/WARs in src dist...
   [smoker]     run "ant validate"
   [smoker]     run tests w/ Java 7 and testArgs='-Dtests.jettyConnector=Socket -Dtests.multiplier=1 -Dtests.slow=false'...
   [smoker]     test demo with 1.7...
   [smoker]       got 207 hits for query "lucene"
   [smoker]     checkindex with 1.7...
   [smoker]     generate javadocs w/ Java 7...
   [smoker] 
   [smoker] Crawl/parse...
   [smoker] 
   [smoker] Verify...
   [smoker]   confirm all releases have coverage in TestBackwardsCompatibility
   [smoker]     find all past Lucene releases...
   [smoker]     run TestBackwardsCompatibility..
   [smoker]     success!
   [smoker] 
   [smoker] Test Solr...
   [smoker]   test basics...
   [smoker]   get KEYS
   [smoker]     0.1 MB in 0.00 sec (72.2 MB/sec)
   [smoker]   check changes HTML...
   [smoker]   download solr-5.0.0-src.tgz...
   [smoker]     34.1 MB in 0.04 sec (880.4 MB/sec)
   [smoker]     verify md5/sha1 digests
   [smoker]   download solr-5.0.0.tgz...
   [smoker]     119.2 MB in 0.17 sec (704.3 MB/sec)
   [smoker]     verify md5/sha1 digests
   [smoker]   download solr-5.0.0.zip...
   [smoker]     125.4 MB in 0.14 sec (924.5 MB/sec)
   [smoker]     verify md5/sha1 digests
   [smoker]   unpack solr-5.0.0.tgz...
   [smoker]     verify JAR metadata/identity/no javax.* or java.* classes...
   [smoker]     unpack lucene-5.0.0.tgz...
   [smoker]       **WARNING**: skipping check of /usr/home/jenkins/jenkins-slave/workspace/Lucene-Solr-SmokeRelease-5.x/lucene/build/smokeTestRelease/tmp/unpack/solr-5.0.0/contrib/dataimporthandler-extras/lib/javax.mail-1.5.1.jar: it has javax.* classes
   [smoker]       **WARNING**: skipping check of /usr/home/jenkins/jenkins-slave/workspace/Lucene-Solr-SmokeRelease-5.x/lucene/build/smokeTestRelease/tmp/unpack/solr-5.0.0/contrib/dataimporthandler-extras/lib/activation-1.1.1.jar: it has javax.* classes
   [smoker]     verify WAR metadata/contained JAR identity/no javax.* or java.* classes...
   [smoker]     unpack lucene-5.0.0.tgz...
   [smoker]     copying unpacked distribution for Java 7 ...
   [smoker]     test solr example w/ Java 7...
   [smoker]       start Solr instance (log=/usr/home/jenkins/jenkins-slave/workspace/Lucene-Solr-SmokeRelease-5.x/lucene/build/smokeTestRelease/tmp/unpack/solr-5.0.0-java7/solr-example.log)...
   [smoker] Sending stop command to Solr running on port 8983 ... waiting 5 seconds to allow Jetty process 48159 to stop gracefully.
   [smoker]     Solr process 48159 is still running; forcefully killing it now.
   [smoker] Killed process 48159
   [smoker]       starting Solr on port 8983 from /usr/home/jenkins/jenkins-slave/workspace/Lucene-Solr-SmokeRelease-5.x/lucene/build/smokeTestRelease/tmp/unpack/solr-5.0.0-java7
   [smoker]       startup done
   [smoker] Creating new core 'techproducts' using command:
   [smoker] 
   [smoker] http://localhost:8983/solr/admin/cores?action=CREATE&name=techproducts&instanceDir=techproducts
   [smoker] 
   [smoker] {
   [smoker]   "responseHeader":{
   [smoker]     "status":0,
   [smoker]     "QTime":2471},
   [smoker]   "core":"techproducts"}
   [smoker] 
   [smoker]       test utf8...
   [smoker]       index example docs...
   [smoker]       run query...
   [smoker]       stop server using: bin/solr stop -p 8983
   [smoker] Sending stop command to Solr running on port 8983 ... waiting 5 seconds to allow Jetty process 25340 to stop gracefully.
   [smoker]     Solr process 25340 is still running; forcefully killing it now.
   [smoker] Killed process 25340
   [smoker]   unpack solr-5.0.0.zip...
   [smoker]     verify JAR metadata/identity/no javax.* or java.* classes...
   [smoker]     unpack lucene-5.0.0.tgz...
   [smoker]       **WARNING**: skipping check of /usr/home/jenkins/jenkins-slave/workspace/Lucene-Solr-SmokeRelease-5.x/lucene/build/smokeTestRelease/tmp/unpack/solr-5.0.0/contrib/dataimporthandler-extras/lib/javax.mail-1.5.1.jar: it has javax.* classes
   [smoker]       **WARNING**: skipping check of /usr/home/jenkins/jenkins-slave/workspace/Lucene-Solr-SmokeRelease-5.x/lucene/build/smokeTestRelease/tmp/unpack/solr-5.0.0/contrib/dataimporthandler-extras/lib/activation-1.1.1.jar: it has javax.* classes
   [smoker]     verify WAR metadata/contained JAR identity/no javax.* or java.* classes...
   [smoker]     unpack lucene-5.0.0.tgz...
   [smoker]     copying unpacked distribution for Java 7 ...
   [smoker]     test solr example w/ Java 7...
   [smoker]       start Solr instance (log=/usr/home/jenkins/jenkins-slave/workspace/Lucene-Solr-SmokeRelease-5.x/lucene/build/smokeTestRelease/tmp/unpack/solr-5.0.0-java7/solr-example.log)...
   [smoker] No process found for Solr node running on port 8983
   [smoker]       starting Solr on port 8983 from /usr/home/jenkins/jenkins-slave/workspace/Lucene-Solr-SmokeRelease-5.x/lucene/build/smokeTestRelease/tmp/unpack/solr-5.0.0-java7
   [smoker]       startup done
   [smoker] Creating new core 'techproducts' using command:
   [smoker] 
   [smoker] http://localhost:8983/solr/admin/cores?action=CREATE&name=techproducts&instanceDir=techproducts
   [smoker] 
   [smoker] {
   [smoker]   "responseHeader":{
   [smoker]     "status":0,
   [smoker]     "QTime":2599},
   [smoker]   "core":"techproducts"}
   [smoker] 
   [smoker]       test utf8...
   [smoker]       index example docs...
   [smoker]       run query...
   [smoker]       stop server using: bin/solr stop -p 8983
   [smoker] Sending stop command to Solr running on port 8983 ... waiting 5 seconds to allow Jetty process 25471 to stop gracefully.
   [smoker]     Solr process 25471 is still running; forcefully killing it now.
   [smoker] Killed process 25471
   [smoker]   unpack solr-5.0.0-src.tgz...
   [smoker]     make sure no JARs/WARs in src dist...
   [smoker]     run "ant validate"
   [smoker]     run tests w/ Java 7 and testArgs='-Dtests.jettyConnector=Socket -Dtests.multiplier=1 -Dtests.slow=false'...
   [smoker] 
   [smoker] command "export JAVA_HOME="/home/jenkins/tools/java/latest1.7" PATH="/home/jenkins/tools/java/latest1.7/bin:$PATH" JAVACMD="/home/jenkins/tools/java/latest1.7/bin/java"; ant clean test -Dtests.slow=false -Dtests.jettyConnector=Socket -Dtests.multiplier=1 -Dtests.slow=false" failed:
   [smoker] Buildfile: /usr/home/jenkins/jenkins-slave/workspace/Lucene-Solr-SmokeRelease-5.x/lucene/build/smokeTestRelease/tmp/unpack/solr-5.0.0/solr/build.xml
   [smoker] 
   [smoker] clean:
   [smoker]    [delete] Deleting directory /usr/home/jenkins/jenkins-slave/workspace/Lucene-Solr-SmokeRelease-5.x/lucene/build/smokeTestRelease/tmp/unpack/solr-5.0.0/solr/build
   [smoker] 
   [smoker] ivy-availability-check:
   [smoker] 
   [smoker] ivy-fail:
   [smoker] 
   [smoker] ivy-configure:
   [smoker] [ivy:configure] :: Apache Ivy 2.3.0 - 20130110142753 :: http://ant.apache.org/ivy/ ::
   [smoker] [ivy:configure] :: loading settings :: file = /usr/home/jenkins/jenkins-slave/workspace/Lucene-Solr-SmokeRelease-5.x/lucene/build/smokeTestRelease/tmp/unpack/solr-5.0.0/lucene/ivy-settings.xml
   [smoker] 
   [smoker] resolve-groovy:
   [smoker] [ivy:cachepath] :: resolving dependencies :: org.codehaus.groovy#groovy-all-caller;working
   [smoker] [ivy:cachepath] 	confs: [default]
   [smoker] [ivy:cachepath] 	found org.codehaus.groovy#groovy-all;2.3.6 in public
   [smoker] [ivy:cachepath] :: resolution report :: resolve 149ms :: artifacts dl 3ms
   [smoker] 	---------------------------------------------------------------------
   [smoker] 	|                  |            modules            ||   artifacts   |
   [smoker] 	|       conf       | number| search|dwnlded|evicted|| number|dwnlded|
   [smoker] 	---------------------------------------------------------------------
   [smoker] 	|      default     |   1   |   0   |   0   |   0   ||   1   |   0   |
   [smoker] 	---------------------------------------------------------------------
   [smoker] 
   [smoker] -init-totals:
   [smoker]     [mkdir] Created dir: /usr/home/jenkins/jenkins-slave/workspace/Lucene-Solr-SmokeRelease-5.x/lucene/build/smokeTestRelease/tmp/unpack/solr-5.0.0/solr/build/solr
   [smoker] 
   [smoker] -clover.load:
   [smoker] 
   [smoker] test-solr-core:
   [smoker] 
   [smoker] test:
   [smoker] 
   [smoker] -clover.disable:
   [smoker] 
   [smoker] ivy-availability-check:
   [smoker] 
   [smoker] ivy-fail:
   [smoker] 
   [smoker] ivy-configure:
   [smoker] [ivy:configure] :: loading settings :: file = /usr/home/jenkins/jenkins-slave/workspace/Lucene-Solr-SmokeRelease-5.x/lucene/build/smokeTestRelease/tmp/unpack/solr-5.0.0/lucene/ivy-settings.xml
   [smoker] 
   [smoker] -clover.load:
   [smoker] 
   [smoker] -clover.classpath:
   [smoker] 
   [smoker] -clover.setup:
   [smoker] 
   [smoker] clover:
   [smoker] 
   [smoker] check-analyzers-icu-uptodate:
   [smoker] 
   [smoker] jar-analyzers-icu:
   [smoker] 
   [smoker] -compile-analysis-extras:
   [smoker] 
   [smoker] check-analyzers-icu-uptodate:
   [smoker] 
   [smoker] jar-analyzers-icu:
   [smoker] 
   [smoker] compile-solr-core:
   [smoker] 
   [smoker] compile-solrj:
   [smoker] 
   [smoker] check-lucene-core-uptodate:
   [smoker] 
   [smoker] jar-lucene-core:
   [smoker] 
   [smoker] check-backward-codecs-uptodate:
   [smoker] 
   [smoker] jar-backward-codecs:
   [smoker] 
   [smoker] check-analyzers-phonetic-uptodate:
   [smoker] 
   [smoker] jar-analyzers-phonetic:
   [smoker] 
   [smoker] check-analyzers-kuromoji-uptodate:
   [smoker] 
   [smoker] jar-analyzers-kuromoji:
   [smoker] 
   [smoker] check-codecs-uptodate:
   [smoker] 
   [smoker] jar-codecs:
   [smoker] 
   [smoker] check-expressions-uptodate:
   [smoker] 
   [smoker] jar-expressions:
   [smoker] 
   [smoker] check-suggest-uptodate:
   [smoker] 
   [smoker] jar-suggest:
   [smoker] 
   [smoker] check-highlighter-uptodate:
   [smoker] 
   [smoker] jar-highlighter:
   [smoker] 
   [smoker] check-memory-uptodate:
   [smoker] 
   [smoker] jar-memory:
   [smoker] 
   [smoker] check-misc-uptodate:
   [smoker] 
   [smoker] jar-misc:
   [smoker] 
   [smoker] check-spatial-uptodate:
   [smoker] 
   [smoker] jar-spatial:
   [smoker] 
   [smoker] check-grouping-uptodate:
   [smoker] 
   [smoker] jar-grouping:
   [smoker] 
   [smoker] check-queries-uptodate:
   [smoker] 
   [smoker] jar-queries:
   [smoker] 
   [smoker] check-queryparser-uptodate:
   [smoker] 
   [smoker] jar-queryparser:
   [smoker] 
   [smoker] check-join-uptodate:
   [smoker] 
   [smoker] jar-join:
   [smoker] 
   [smoker] prep-lucene-jars:
   [smoker] 
   [smoker] resolve-example:
   [smoker] 
   [smoker] ivy-availability-check:
   [smoker] 
   [smoker] ivy-fail:
   [smoker] 
   [smoker] ivy-configure:
   [smoker] [ivy:configure] :: loading settings :: file = /usr/home/jenkins/jenkins-slave/workspace/Lucene-Solr-SmokeRelease-5.x/lucene/build/smokeTestRelease/tmp/unpack/solr-5.0.0/lucene/ivy-settings.xml
   [smoker] 
   [smoker] resolve:
   [smoker] 
   [smoker] resolve-server:
   [smoker] 
   [smoker] ivy-availability-check:
   [smoker] 
   [smoker] ivy-fail:
   [smoker] 
   [smoker] ivy-fail:
   [smoker] 
   [smoker] ivy-configure:
   [smoker] [ivy:configure] :: loading settings :: file = /usr/home/jenkins/jenkins-slave/workspace/Lucene-Solr-SmokeRelease-5.x/lucene/build/smokeTestRelease/tmp/unpack/solr-5.0.0/lucene/ivy-settings.xml
   [smoker] 
   [smoker] sync-hack:
   [smoker] 
   [smoker] resolve:
   [smoker] 
   [smoker] ivy-availability-check:
   [smoker] 
   [smoker] ivy-fail:
   [smoker] 
   [smoker] ivy-fail:
   [smoker] 
   [smoker] ivy-configure:
   [smoker] [ivy:configure] :: loading settings :: file = /usr/home/jenkins/jenkins-slave/workspace/Lucene-Solr-SmokeRelease-5.x/lucene/build/smokeTestRelease/tmp/unpack/solr-5.0.0/lucene/ivy-settings.xml
   [smoker] 
   [smoker] resolve:
   [smoker] 
   [smoker] common.init:
   [smoker] 
   [smoker] compile-lucene-core:
   [smoker] 
   [smoker] ivy-availability-check:
   [smoker] 
   [smoker] ivy-fail:
   [smoker] 
   [smoker] ivy-configure:
   [smoker] [ivy:configure] :: loading settings :: file = /usr/home/jenkins/jenkins-slave/workspace/Lucene-Solr-SmokeRelease-5.x/lucene/build/smokeTestRelease/tmp/unpack/solr-5.0.0/lucene/ivy-settings.xml
   [smoker] 
   [smoker] resolve:
   [smoker] 
   [smoker] init:
   [smoker] 
   [smoker] -clover.disable:
   [smoker] 
   [smoker] -clover.load:
   [smoker] 
   [smoker] -clover.classpath:
   [smoker] 
   [smoker] -clover.setup:
   [smoker] 
   [smoker] clover:
   [smoker] 
   [smoker] compile-core:
   [smoker] 
   [smoker] init:
   [smoker] 
   [smoker] -clover.disable:
   [smoker] 
   [smoker] -clover.load:
   [smoker] 
   [smoker] -clover.classpath:
   [smoker] 
   [smoker] -clover.setup:
   [smoker] 
   [smoker] clover:
   [smoker] 
   [smoker] common.compile-core:
   [smoker]     [mkdir] Created dir: /usr/home/jenkins/jenkins-slave/workspace/Lucene-Solr-SmokeRelease-5.x/lucene/build/smokeTestRelease/tmp/unpack/solr-5.0.0/solr/build/solr-solrj/classes/java
   [smoker]     [javac] Compiling 145 source files to /usr/home/jenkins/jenkins-slave/workspace/Lucene-Solr-SmokeRelease-5.x/lucene/build/smokeTestRelease/tmp/unpack/solr-5.0.0/solr/build/solr-solrj/classes/java
   [smoker]     [javac] Note: Some input files use or override a deprecated API.
   [smoker]     [javac] Note: Recompile with -Xlint:deprecation for details.
   [smoker]     [javac] Note: Some input files use unchecked or unsafe operations.
   [smoker]     [javac] Note: Recompile with -Xlint:unchecked for details.
   [smoker] 
   [smoker] compile-core:
   [smoker] 
   [smoker] check-lucene-core-uptodate:
   [smoker] 
   [smoker] jar-lucene-core:
   [smoker] 
   [smoker] check-backward-codecs-uptodate:
   [smoker] 
   [smoker] jar-backward-codecs:
   [smoker] 
   [smoker] check-analyzers-phonetic-uptodate:
   [smoker] 
   [smoker] jar-analyzers-phonetic:
   [smoker] 
   [smoker] check-analyzers-kuromoji-uptodate:
   [smoker] 
   [smoker] jar-analyzers-kuromoji:
   [smoker] 
   [smoker] check-codecs-uptodate:
   [smoker] 
   [smoker] jar-codecs:
   [smoker] 
   [smoker] check-expressions-uptodate:
   [smoker] 
   [smoker] jar-expressions:
   [smoker] 
   [smoker] check-suggest-uptodate:
   [smoker] 
   [smoker] jar-suggest:
   [smoker] 
   [smoker] check-highlighter-uptodate:
   [smoker] 
   [smoker] jar-highlighter:
   [smoker] 
   [smoker] check-memory-uptodate:
   [smoker] 
   [smoker] jar-memory:
   [smoker] 
   [smoker] check-misc-uptodate:
   [smoker] 
   [smoker] jar-misc:
   [smoker] 
   [smoker] check-spatial-uptodate:
   [smoker] 
   [smoker] jar-spatial:
   [smoker] 
   [smoker] check-grouping-uptodate:
   [smoker] 
   [smoker] jar-grouping:
   [smoker] 
   [smoker] check-queries-uptodate:
   [smoker] 
   [smoker] jar-queries:
   [smoker] 
   [smoker] check-queryparser-uptodate:
   [smoker] 
   [smoker] jar-queryparser:
   [smoker] 
   [smoker] check-join-uptodate:
   [smoker] 
   [smoker] jar-join:
   [smoker] 
   [smoker] prep-lucene-jars:
   [smoker] 
   [smoker] resolve-example:
   [smoker] 
   [smoker] ivy-availability-check:
   [smoker] 
   [smoker] ivy-fail:
   [smoker] 
   [smoker] ivy-configure:
   [smoker] [ivy:configure] :: loading settings :: file = /usr/home/jenkins/jenkins-slave/workspace/Lucene-Solr-SmokeRelease-5.x/lucene/build/smokeTestRelease/tmp/unpack/solr-5.0.0/lucene/ivy-settings.xml
   [smoker] 
   [smoker] resolve:
   [smoker] 
   [smoker] resolve-server:
   [smoker] 
   [smoker] ivy-availability-check:
   [smoker] 
   [smoker] ivy-fail:
   [smoker] 
   [smoker] ivy-fail:
   [smoker] 
   [smoker] ivy-configure:
   [smoker] [ivy:configure] :: loading settings :: file = /usr/home/jenkins/jenkins-slave/workspace/Lucene-Solr-SmokeRelease-5.x/lucene/build/smokeTestRelease/tmp/unpack/solr-5.0.0/lucene/ivy-settings.xml
   [smoker] 
   [smoker] sync-hack:
   [smoker] 
   [smoker] resolve:
   [smoker] 
   [smoker] ivy-availability-check:
   [smoker] 
   [smoker] ivy-fail:
   [smoker] 
   [smoker] ivy-fail:
   [smoker] 
   [smoker] ivy-configure:
   [smoker] [ivy:configure] :: loading settings :: file = /usr/home/jenkins/jenkins-slave/workspace/Lucene-Solr-SmokeRelease-5.x/lucene/build/smokeTestRelease/tmp/unpack/solr-5.0.0/lucene/ivy-settings.xml
   [smoker] 
   [smoker] resolve:
   [smoker] 
   [smoker] common.init:
   [smoker] 
   [smoker] compile-lucene-core:
   [smoker] 
   [smoker] ivy-availability-check:
   [smoker] 
   [smoker] ivy-fail:
   [smoker] 
   [smoker] ivy-configure:
   [smoker] [ivy:configure] :: loading settings :: file = /usr/home/jenkins/jenkins-slave/workspace/Lucene-Solr-SmokeRelease-5.x/lucene/build/smokeTestRelease/tmp/unpack/solr-5.0.0/lucene/ivy-settings.xml
   [smoker] 
   [smoker] resolve:
   [smoker] 
   [smoker] init:
   [smoker] 
   [smoker] -clover.disable:
   [smoker] 
   [smoker] -clover.load:
   [smoker] 
   [smoker] -clover.classpath:
   [smoker] 
   [smoker] -clover.setup:
   [smoker] 
   [smoker] clover:
   [smoker] 
   [smoker] compile-core:
   [smoker] 
   [smoker] init:
   [smoker] 
   [smoker] -clover.disable:
   [smoker] 
   [smoker] -clover.load:
   [smoker] 
   [smoker] -clover.classpath:
   [smoker] 
   [smoker] -clover.setup:
   [smoker] 
   [smoker] clover:
   [smoker] 
   [smoker] common.compile-core:
   [smoker]     [mkdir] Created dir: /usr/home/jenkins/jenkins-slave/workspace/Lucene-Solr-SmokeRelease-5.x/lucene/build/smokeTestRelease/tmp/unpack/solr-5.0.0/solr/build/solr-core/classes/java
   [smoker]     [javac] Compiling 687 source files to /usr/home/jenkins/jenkins-slave/workspace/Lucene-Solr-SmokeRelease-5.x/lucene/build/smokeTestRelease/tmp/unpack/solr-5.0.0/solr/build/solr-core/classes/java
   [smoker]     [javac] Note: Some input files use or override a deprecated API.
   [smoker]     [javac] Note: Recompile with -Xlint:deprecation for details.
   [smoker]     [javac] Note: Some input files use unchecked or unsafe operations.
   [smoker]     [javac] Note: Recompile with -Xlint:unchecked for details.
   [smoker] 
   [smoker] common-solr.compile-core:
   [smoker] 
   [smoker] compile-core:
   [smoker] 
   [smoker] compile-solrj:
   [smoker] 
   [smoker] check-lucene-core-uptodate:
   [smoker] 
   [smoker] jar-lucene-core:
   [smoker] 
   [smoker] check-backward-codecs-uptodate:
   [smoker] 
   [smoker] jar-backward-codecs:
   [smoker] 
   [smoker] check-analyzers-phonetic-uptodate:
   [smoker] 
   [smoker] jar-analyzers-phonetic:
   [smoker] 
   [smoker] check-analyzers-kuromoji-uptodate:
   [smoker] 
   [smoker] jar-analyzers-kuromoji:
   [smoker] 
   [smoker] check-codecs-uptodate:
   [smoker] 
   [smoker] jar-codecs:
   [smoker] 
   [smoker] check-expressions-uptodate:
   [smoker] 
   [smoker] jar-expressions:
   [smoker] 
   [smoker] check-suggest-uptodate:
   [smoker] 
   [smoker] jar-suggest:
   [smoker] 
   [smoker] check-highlighter-uptodate:
   [smoker] 
   [smoker] jar-highlighter:
   [smoker] 
   [smoker] check-memory-uptodate:
   [smoker] 
   [smoker] jar-memory:
   [smoker] 
   [smoker] check-misc-uptodate:
   [smoker] 
   [smoker] jar-misc:
   [smoker] 
   [smoker] check-spatial-uptodate:
   [smoker] 
   [smoker] jar-spatial:
   [smoker] 
   [smoker] check-grouping-uptodate:
   [smoker] 
   [smoker] jar-grouping:
   [smoker] 
   [smoker] check-queries-uptodate:
   [smoker] 
   [smoker] jar-queries:
   [smoker] 
   [smoker] check-queryparser-uptodate:
   [smoker] 
   [smoker] jar-queryparser:
   [smoker] 
   [smoker] check-join-uptodate:
   [smoker] 
   [smoker] jar-join:
   [smoker] 
   [smoker] prep-lucene-jars:
   [smoker] 
   [smoker] resolve-example:
   [smoker] 
   [smoker] ivy-availability-check:
   [smoker] 
   [smoker] ivy-fail:
   [smoker] 
   [smoker] ivy-configure:
   [smoker] [ivy:configure] :: loading settings :: file = /usr/home/jenkins/jenkins-slave/workspace/Lucene-Solr-SmokeRelease-5.x/lucene/build/smokeTestRelease/tmp/unpack/solr-5.0.0/lucene/ivy-settings.xml
   [smoker] 
   [smoker] resolve:
   [smoker] 
   [smoker] resolve-server:
   [smoker] 
   [smoker] ivy-availability-check:
   [smoker] 
   [smoker] ivy-fail:
   [smoker] 
   [smoker] ivy-fail:
   [smoker] 
   [smoker] ivy-configure:
   [smoker] [ivy:configure] :: loading settings :: file = /usr/home/jenkins/jenkins-slave/workspace/Lucene-Solr-SmokeRelease-5.x/lucene/build/smokeTestRelease/tmp/unpack/solr-5.0.0/lucene/ivy-settings.xml
   [smoker] 
   [smoker] sync-hack:
   [smoker] 
   [smoker] resolve:
   [smoker] 
   [smoker] ivy-availability-check:
   [smoker] 
   [smoker] ivy-fail:
   [smoker] 
   [smoker] ivy-fail:
   [smoker] 
   [smoker] ivy-configure:
   [smoker] [ivy:configure] :: loading settings :: file = /usr/home/jenkins/jenkins-slave/workspace/Lucene-Solr-SmokeRelease-5.x/lucene/build/smokeTestRelease/tmp/unpack/solr-5.0.0/lucene/ivy-settings.xml
   [smoker] 
   [smoker] resolve:
   [smoker] 
   [smoker] common.init:
   [smoker] 
   [smoker] compile-lucene-core:
   [smoker] 
   [smoker] ivy-availability-check:
   [smoker] 
   [smoker] ivy-fail:
   [smoker] 
   [smoker] ivy-configure:
   [smoker] [ivy:configure] :: loading settings :: file = /usr/home/jenkins/jenkins-slave/workspace/Lucene-Solr-SmokeRelease-5.x/lucene/build/smokeTestRelease/tmp/unpack/solr-5.0.0/lucene/ivy-settings.xml
   [smoker] 
   [smoker] resolve:
   [smoker] 
   [smoker] init:
   [smoker] 
   [smoker] -clover.disable:
   [smoker] 
   [smoker] -clover.load:
   [smoker] 
   [smoker] -clover.classpath:
   [smoker] 
   [smoker] -clover.setup:
   [smoker] 
   [smoker] clover:
   [smoker] 
   [smoker] compile-core:
   [smoker] 
   [smoker] init:
   [smoker] 
   [smoker] -clover.disable:
   [smoker] 
   [smoker] -clover.load:
   [smoker] 
   [smoker] -clover.classpath:
   [smoker] 
   [smoker] -clover.setup:
   [smoker] 
   [smoker] clover:
   [smoker] 
   [smoker] common.compile-core:
   [smoker] 
   [smoker] compile-core:
   [smoker] 
   [smoker] check-lucene-core-uptodate:
   [smoker] 
   [smoker] jar-lucene-core:
   [smoker] 
   [smoker] check-backward-codecs-uptodate:
   [smoker] 
   [smoker] jar-backward-codecs:
   [smoker] 
   [smoker] check-analyzers-phonetic-uptodate:
   [smoker] 
   [smoker] jar-analyzers-phonetic:
   [smoker] 
   [smoker] check-analyzers-kuromoji-uptodate:
   [smoker] 
   [smoker] jar-analyzers-kuromoji:
   [smoker] 
   [smoker] check-codecs-uptodate:
   [smoker] 
   [smoker] jar-codecs:
   [smoker] 
   [smoker] check-expressions-uptodate:
   [smoker] 
   [smoker] jar-expressions:
   [smoker] 
   [smoker] check-suggest-uptodate:
   [smoker] 
   [smoker] jar-suggest:
   [smoker] 
   [smoker] check-highlighter-uptodate:
   [smoker] 
   [smoker] jar-highlighter:
   [smoker] 
   [smoker] check-memory-uptodate:
   [smoker] 
   [smoker] jar-memory:
   [smoker] 
   [smoker] check-misc-uptodate:
   [smoker] 
   [smoker] jar-misc:
   [smoker] 
   [smoker] check-spatial-uptodate:
   [smoker] 
   [smoker] jar-spatial:
   [smoker] 
   [smoker] check-grouping-uptodate:
   [smoker] 
   [smoker] jar-grouping:
   [smoker] 
   [smoker] check-queries-uptodate:
   [smoker] 
   [smoker] jar-queries:
   [smoker] 
   [smoker] check-queryparser-uptodate:
   [smoker] 
   [smoker] jar-queryparser:
   [smoker] 
   [smoker] check-join-uptodate:
   [smoker] 
   [smoker] jar-join:
   [smoker] 
   [smoker] prep-lucene-jars:
   [smoker] 
   [smoker] resolve-example:
   [smoker] 
   [smoker] ivy-availability-check:
   [smoker] 
   [smoker] ivy-fail:
   [smoker] 
   [smoker] ivy-configure:
   [smoker] [ivy:configure] :: loading settings :: file = /usr/home/jenkins/jenkins-slave/workspace/Lucene-Solr-SmokeRelease-5.x/lucene/build/smokeTestRelease/tmp/unpack/solr-5.0.0/lucene/ivy-settings.xml
   [smoker] 
   [smoker] resolve:
   [smoker] 
   [smoker] resolve-server:
   [smoker] 
   [smoker] ivy-availability-check:
   [smoker] 
   [smoker] ivy-fail:
   [smoker] 
   [smoker] ivy-fail:
   [smoker] 
   [smoker] ivy-configure:
   [smoker] [ivy:configure] :: loading settings :: file = /usr/home/jenkins/jenkins-slave/workspace/Lucene-Solr-SmokeRelease-5.x/lucene/build/smokeTestRelease/tmp/unpack/solr-5.0.0/lucene/ivy-settings.xml
   [smoker] 
   [smoker] sync-hack:
   [smoker] 
   [smoker] resolve:
   [smoker] 
   [smoker] ivy-availability-check:
   [smoker] 
   [smoker] ivy-fail:
   [smoker] 
   [smoker] ivy-fail:
   [smoker] 
   [smoker] ivy-configure:
   [smoker] [ivy:configure] :: loading settings :: file = /usr/home/jenkins/jenkins-slave/workspace/Lucene-Solr-SmokeRelease-5.x/lucene/build/smokeTestRelease/tmp/unpack/solr-5.0.0/lucene/ivy-settings.xml
   [smoker] 
   [smoker] resolve:
   [smoker] 
   [smoker] common.init:
   [smoker] 
   [smoker] compile-lucene-core:
   [smoker] 
   [smoker] ivy-availability-check:
   [smoker] 
   [smoker] ivy-fail:
   [smoker] 
   [smoker] ivy-configure:
   [smoker] [ivy:configure] :: loading settings :: file = /usr/home/jenkins/jenkins-slave/workspace/Lucene-Solr-SmokeRelease-5.x/lucene/build/smokeTestRelease/tmp/unpack/solr-5.0.0/lucene/ivy-settings.xml
   [smoker] 
   [smoker] resolve:
   [smoker] 
   [smoker] init:
   [smoker] 
   [smoker] -clover.disable:
   [smoker] 
   [smoker] -clover.load:
   [smoker] 
   [smoker] -clover.classpath:
   [smoker] 
   [smoker] -clover.setup:
   [smoker] 
   [smoker] clover:
   [smoker] 
   [smoker] compile-core:
   [smoker] 
   [smoker] init:
   [smoker] 
   [smoker] -clover.disable:
   [smoker] 
   [smoker] -clover.load:
   [smoker] 
   [smoker] -clover.classpath:
   [smoker] 
   [smoker] -clover.setup:
   [smoker] 
   [smoker] clover:
   [smoker] 
   [smoker] common.compile-core:
   [smoker]     [mkdir] Created dir: /usr/home/jenkins/jenkins-slave/workspace/Lucene-Solr-SmokeRelease-5.x/lucene/build/smokeTestRelease/tmp/unpack/solr-5.0.0/solr/build/contrib/solr-analysis-extras/classes/java
   [smoker]     [javac] Compiling 1 source file to /usr/home/jenkins/jenkins-slave/workspace/Lucene-Solr-SmokeRelease-5.x/lucene/build/smokeTestRelease/tmp/unpack/solr-5.0.0/solr/build/contrib/solr-analysis-extras/classes/java
   [smoker]     [javac] Note: /usr/home/jenkins/jenkins-slave/workspace/Lucene-Solr-SmokeRelease-5.x/lucene/build/smokeTestRelease/tmp/unpack/solr-5.0.0/solr/contrib/analysis-extras/src/java/org/apache/solr/schema/ICUCollationField.java uses or overrides a deprecated API.
   [smoker]     [javac] Note: Recompile with -Xlint:deprecation for details.
   [smoker] 
   [smoker] common-solr.compile-core:
   [smoker] 
   [smoker] solr-contrib-build.compile-core:
   [smoker] 
   [smoker] compile-core:
   [smoker] 
   [smoker] compile:
   [smoker] 
   [smoker] compile-solr-test-framework:
   [smoker] 
   [smoker] ivy-availability-check:
   [smoker] 
   [smoker] ivy-fail:
   [smoker] 
   [smoker] ivy-configure:
   [smoker] [ivy:configure] :: loading settings :: file = /usr/home/jenkins/jenkins-slave/workspace/Lucene-Solr-SmokeRelease-5.x/lucene/build/smokeTestRelease/tmp/unpack/solr-5.0.0/lucene/ivy-settings.xml
   [smoker] 
   [smoker] resolve:
   [smoker] 
   [smoker] compile-solr-core:
   [smoker] 
   [smoker] compile-solrj:
   [smoker] 
   [smoker] check-lucene-core-uptodate:
   [smoker] 
   [smoker] jar-lucene-core:
   [smoker] 
   [smoker] check-backward-codecs-uptodate:
   [smoker] 
   [smoker] jar-backward-codecs:
   [smoker] 
   [smoker] check-analyzers-phonetic-uptodate:
   [smoker] 
   [smoker] jar-analyzers-phonetic:
   [smoker] 
   [smoker] check-analyzers-kuromoji-uptodate:
   [smoker] 
   [smoker] jar-analyzers-kuromoji:
   [smoker] 
   [smoker] check-codecs-uptodate:
   [smoker] 
   [smoker] jar-codecs:
   [smoker] 
   [smoker] check-expressions-uptodate:
   [smoker] 
   [smoker] jar-expressions:
   [smoker] 
   [smoker] check-suggest-uptodate:
   [smoker] 
   [smoker] jar-suggest:
   [smoker] 
   [smoker] check-highlighter-uptodate:
   [smoker] 
   [smoker] jar-highlighter:
   [smoker] 
   [smoker] check-memory-uptodate:
   [smoker] 
   [smoker] jar-memory:
   [smoker] 
   [smoker] check-misc-uptodate:
   [smoker] 
   [smoker] jar-misc:
   [smoker] 
   [smoker] check-spatial-uptodate:
   [smoker] 
   [smoker] jar-spatial:
   [smoker] 
   [smoker] check-grouping-uptodate:
   [smoker] 
   [smoker] jar-grouping:
   [smoker] 
   [smoker] check-queries-uptodate:
   [smoker] 
   [smoker] jar-queries:
   [smoker] 
   [smoker] check-queryparser-uptodate:
   [smoker] 
   [smoker] jar-queryparser:
   [smoker] 
   [smoker] check-join-uptodate:
   [smoker] 
   [smoker] jar-join:
   [smoker] 
   [smoker] prep-lucene-jars:
   [smoker] 
   [smoker] resolve-example:
   [smoker] 
   [smoker] ivy-availability-check:
   [smoker] 
   [smoker] ivy-fail:
   [smoker] 
   [smoker] ivy-configure:
   [smoker] [ivy:configure] :: loading settings :: file = /usr/home/jenkins/jenkins-slave/workspace/Lucene-Solr-SmokeRelease-5.x/lucene/build/smokeTestRelease/tmp/unpack/solr-5.0.0/lucene/ivy-settings.xml
   [smoker] 
   [smoker] resolve:
   [smoker] 
   [smoker] resolve-server:
   [smoker] 
   [smoker] ivy-availability-check:
   [smoker] 
   [smoker] ivy-fail:
   [smoker] 
   [smoker] ivy-fail:
   [smoker] 
   [smoker] ivy-configure:
   [smoker] [ivy:configure] :: loading settings :: file = /usr/home/jenkins/jenkins-slave/workspace/Lucene-Solr-SmokeRelease-5.x/lucene/build/smokeTestRelease/tmp/unpack/solr-5.0.0/lucene/ivy-settings.xml
   [smoker] 
   [smoker] sync-hack:
   [smoker] 
   [smoker] resolve:
   [smoker] 
   [smoker] ivy-availability-check:
   [smoker] 
   [smoker] ivy-fail:
   [smoker] 
   [smoker] ivy-fail:
   [smoker] 
   [smoker] ivy-configure:
   [smoker] [ivy:configure] :: loading settings :: file = /usr/home/jenkins/jenkins-slave/workspace/Lucene-Solr-SmokeRelease-5.x/lucene/build/smokeTestRelease/tmp/unpack/solr-5.0.0/lucene/ivy-settings.xml
   [smoker] 
   [smoker] resolve:
   [smoker] 
   [smoker] common.init:
   [smoker] 
   [smoker] compile-lucene-core:
   [smoker] 
   [smoker] ivy-availability-check:
   [smoker] 
   [smoker] ivy-fail:
   [smoker] 
   [smoker] ivy-configure:
   [smoker] [ivy:configure] :: loading settings :: file = /usr/home/jenkins/jenkins-slave/workspace/Lucene-Solr-SmokeRelease-5.x/lucene/build/smokeTestRelease/tmp/unpack/solr-5.0.0/lucene/ivy-settings.xml
   [smoker] 
   [smoker] resolve:
   [smoker] 
   [smoker] init:
   [smoker] 
   [smoker] -clover.disable:
   [smoker] 
   [smoker] -clover.load:
   [smoker] 
   [smoker] -clover.classpath:
   [smoker] 
   [smoker] -clover.setup:
   [smoker] 
   [smoker] clover:
   [smoker] 
   [smoker] compile-core:
   [smoker] 
   [smoker] init:
   [smoker] 
   [smoker] -clover.disable:
   [smoker] 
   [smoker] -clover.load:
   [smoker] 
   [smoker] -clover.classpath:
   [smoker] 
   [smoker] -clover.setup:
   [smoker] 
   [smoker] clover:
   [smoker] 
   [smoker] common.compile-core:
   [smoker] 
   [smoker] compile-core:
   [smoker] 
   [smoker] check-lucene-core-uptodate:
   [smoker] 
   [smoker] jar-lucene-core:
   [smoker] 
   [smoker] check-backward-codecs-uptodate:
   [smoker] 
   [smoker] jar-backward-codecs:
   [smoker] 
   [smoker] check-analyzers-phonetic-uptodate:
   [smoker] 
   [smoker] jar-analyzers-phonetic:
   [smoker] 
   [smoker] check-analyzers-kuromoji-uptodate:
   [smoker] 
   [smoker] jar-analyzers-kuromoji:
   [smoker] 
   [smoker] check-codecs-uptodate:
   [smoker] 
   [smoker] jar-codecs:
   [smoker] 
   [smoker] check-expressions-uptodate:
   [smoker] 
   [smoker] jar-expressions:
   [smoker] 
   [smoker] check-suggest-uptodate:
   [smoker] 
   [smoker] jar-suggest:
   [smoker] 
   [smoker] check-highlighter-uptodate:
   [smoker] 
   [smoker] jar-highlighter:
   [smoker] 
   [smoker] check-memory-uptodate:
   [smoker] 
   [smoker] jar-memory:
   [smoker] 
   [smoker] check-misc-uptodate:
   [smoker] 
   [smoker] jar-misc:
   [smoker] 
   [smoker] check-spatial-uptodate:
   [smoker] 
   [smoker] jar-spatial:
   [smoker] 
   [smoker] check-grouping-uptodate:
   [smoker] 
   [smoker] jar-grouping:
   [smoker] 
   [smoker] check-queries-uptodate:
   [smoker] 
   [smoker] jar-queries:
   [smoker] 
   [smoker] check-queryparser-uptodate:
   [smoker] 
   [smoker] jar-queryparser:
   [smoker] 
   [smoker] check-join-uptodate:
   [smoker] 
   [smoker] jar-join:
   [smoker] 
   [smoker] prep-lucene-jars:
   [smoker] 
   [smoker] resolve-example:
   [smoker] 
   [smoker] ivy-availability-check:
   [smoker] 
   [smoker] ivy-fail:
   [smoker] 
   [smoker] ivy-configure:
   [smoker] [ivy:configure] :: loading settings :: file = /usr/home/jenkins/jenkins-slave/workspace/Lucene-Solr-SmokeRelease-5.x/lucene/build/smokeTestRelease/tmp/unpack/solr-5.0.0/lucene/ivy-settings.xml
   [smoker] 
   [smoker] resolve:
   [smoker] 
   [smoker] resolve-server:
   [smoker] 
   [smoker] ivy-availability-check:
   [smoker] 
   [smoker] ivy-fail:
   [smoker] 
   [smoker] ivy-fail:
   [smoker] 
   [smoker] ivy-configure:
   [smoker] [ivy:configure] :: loading settings :: file = /usr/home/jenkins/jenkins-slave/workspace/Lucene-Solr-SmokeRelease-5.x/lucene/build/smokeTestRelease/tmp/unpack/solr-5.0.0/lucene/ivy-settings.xml
   [smoker] 
   [smoker] sync-hack:
   [smoker] 
   [smoker] resolve:
   [smoker] 
   [smoker] ivy-availability-check:
   [smoker] 
   [smoker] ivy-fail:
   [smoker] 
   [smoker] ivy-fail:
   [smoker] 
   [smoker] ivy-configure:
   [smoker] [ivy:configure] :: loading settings :: file = /usr/home/jenkins/jenkins-slave/workspace/Lucene-Solr-SmokeRelease-5.x/lucene/build/smokeTestRelease/tmp/unpack/solr-5.0.0/lucene/ivy-settings.xml
   [smoker] 
   [smoker] resolve:
   [smoker] 
   [smoker] common.init:
   [smoker] 
   [smoker] compile-lucene-core:
   [smoker] 
   [smoker] ivy-availability-check:
   [smoker] 
   [smoker] ivy-fail:
   [smoker] 
   [smoker] ivy-configure:
   [smoker] [ivy:configure] :: loading settings :: file = /usr/home/jenkins/jenkins-slave/workspace/Lucene-Solr-SmokeRelease-5.x/lucene/build/smokeTestRelease/tmp/unpack/solr-5.0.0/lucene/ivy-settings.xml
   [smoker] 
   [smoker] resolve:
   [smoker] 
   [smoker] init:
   [smoker] 
   [smoker] -clover.disable:
   [smoker] 
   [smoker] -clover.load:
   [smoker] 
   [smoker] -clover.classpath:
   [smoker] 
   [smoker] -clover.setup:
   [smoker] 
   [smoker] clover:
   [smoker] 
   [smoker] compile-core:
   [smoker] 
   [smoker] init:
   [smoker] 
   [smoker] -clover.disable:
   [smoker] 
   [smoker] -clover.load:
   [smoker] 
   [smoker] -clover.classpath:
   [smoker] 
   [smoker] -clover.setup:
   [smoker] 
   [smoker] clover:
   [smoker] 
   [smoker] common.compile-core:
   [smoker] 
   [smoker] common-solr.compile-core:
   [smoker] 
   [smoker] compile-core:
   [smoker] 
   [smoker] compile-test-framework:
   [smoker] 
   [smoker] compile-test-framework:
   [smoker] 
   [smoker] ivy-availability-check:
   [smoker] 
   [smoker] ivy-fail:
   [smoker] 
   [smoker] ivy-configure:
   [smoker] [ivy:configure] :: loading settings :: file = /usr/home/jenkins/jenkins-slave/workspace/Lucene-Solr-SmokeRelease-5.x/lucene/build/smokeTestRelease/tmp/unpack/solr-5.0.0/lucene/ivy-settings.xml
   [smoker] 
   [smoker] resolve:
   [smoker] 
   [smoker] init:
   [smoker] 
   [smoker] compile-lucene-core:
   [smoker] 
   [smoker] ivy-availability-check:
   [smoker] 
   [smoker] ivy-fail:
   [smoker] 
   [smoker] ivy-configure:
   [smoker] [ivy:configure] :: loading settings :: file = /usr/home/jenkins/jenkins-slave/workspace/Lucene-Solr-SmokeRelease-5.x/lucene/build/smokeTestRelease/tmp/unpack/solr-5.0.0/lucene/ivy-settings.xml
   [smoker] 
   [smoker] resolve:
   [smoker] 
   [smoker] init:
   [smoker] 
   [smoker] -clover.disable:
   [smoker] 
   [smoker] -clover.load:
   [smoker] 
   [smoker] -clover.classpath:
   [smoker] 
   [smoker] -clover.setup:
   [smoker] 
   [smoker] clover:
   [smoker] 
   [smoker] compile-core:
   [smoker] 
   [smoker] compile-codecs:
   [smoker] 
   [smoker] ivy-availability-check:
   [smoker] 
   [smoker] ivy-fail:
   [smoker] 
   [smoker] ivy-configure:
   [smoker] [ivy:configure] :: loading settings :: file = /usr/home/jenkins/jenkins-slave/workspace/Lucene-Solr-SmokeRelease-5.x/lucene/build/smokeTestRelease/tmp/unpack/solr-5.0.0/lucene/ivy-settings.xml
   [smoker] 
   [smoker] resolve:
   [smoker] 
   [smoker] common.init:
   [smoker] 
   [smoker] compile-lucene-core:
   [smoker] 
   [smoker] init:
   [smoker] 
   [smoker] -clover.disable:
   [smoker] 
   [smoker] -clover.load:
   [smoker] 
   [smoker] -clover.classpath:
   [smoker] 
   [smoker] -clover.setup:
   [smoker] 
   [smoker] clover:
   [smoker] 
   [smoker] compile-core:
   [smoker] 
   [smoker] -clover.disable:
   [smoker] 
   [smoker] -clover.load:
   [smoker] 
   [smoker] -clover.classpath:
   [smoker] 
   [smoker] -clover.setup:
   [smoker] 
   [smoker] clover:
   [smoker] 
   [smoker] common.compile-core:
   [smoker] 
   [smoker] compile-core:
   [smoker] 
   [smoker] compile-core:
   [smoker]     [mkdir] Created dir: /usr/home/jenkins/jenkins-slave/workspace/Lucene-Solr-SmokeRelease-5.x/lucene/build/smokeTestRelease/tmp/unpack/solr-5.0.0/solr/build/solr-test-framework/classes/java
   [smoker]     [javac] Compiling 36 source files to /usr/home/jenkins/jenkins-slave/workspace/Lucene-Solr-SmokeRelease-5.x/lucene/build/smokeTestRelease/tmp/unpack/solr-5.0.0/solr/build/solr-test-framework/classes/java
   [smoker]     [javac] Note: Some input files use or override a deprecated API.
   [smoker]     [javac] Note: Recompile with -Xlint:deprecation for details.
   [smoker]     [javac] Note: Some input files use unchecked or unsafe operations.
   [smoker]     [javac] Note: Recompile with -Xlint:unchecked for details.
   [smoker] 
   [smoker] compile-solrj:
   [smoker] 
   [smoker] check-lucene-core-uptodate:
   [smoker] 
   [smoker] jar-lucene-core:
   [smoker] 
   [smoker] check-backward-codecs-uptodate:
   [smoker] 
   [smoker] jar-backward-codecs:
   [smoker] 
   [smoker] check-analyzers-phonetic-uptodate:
   [smoker] 
   [smoker] jar-analyzers-phonetic:
   [smoker] 
   [smoker] check-analyzers-kuromoji-uptodate:
   [smoker] 
   [smoker] jar-analyzers-kuromoji:
   [smoker] 
   [smoker] check-codecs-uptodate:
   [smoker] 
   [smoker] jar-codecs:
   [smoker] 
   [smoker] check-expressions-uptodate:
   [smoker] 
   [smoker] jar-expressions:
   [smoker] 
   [smoker] check-suggest-uptodate:
   [smoker] 
   [smoker] jar-suggest:
   [smoker] 
   [smoker] check-highlighter-uptodate:
   [smoker] 
   [smoker] jar-highlighter:
   [smoker] 
   [smoker] check-memory-uptodate:
   [smoker] 
   [smoker] jar-memory:
   [smoker] 
   [smoker] check-misc-uptodate:
   [smoker] 
   [smoker] jar-misc:
   [smoker] 
   [smoker] check-spatial-uptodate:
   [smoker] 
   [smoker] jar-spatial:
   [smoker] 
   [smoker] check-grouping-uptodate:
   [smoker] 
   [smoker] jar-grouping:
   [smoker] 
   [smoker] check-queries-uptodate:
   [smoker] 
   [smoker] jar-queries:
   [smoker] 
   [smoker] check-queryparser-uptodate:
   [smoker] 
   [smoker] jar-queryparser:
   [smoker] 
   [smoker] check-join-uptodate:
   [smoker] 
   [smoker] jar-join:
   [smoker] 
   [smoker] prep-lucene-jars:
   [smoker] 
   [smoker] resolve-example:
   [smoker] 
   [smoker] ivy-availability-check:
   [smoker] 
   [smoker] ivy-fail:
   [smoker] 
   [smoker] ivy-configure:
   [smoker] [ivy:configure] :: loading settings :: file = /usr/home/jenkins/jenkins-slave/workspace/Lucene-Solr-SmokeRelease-5.x/lucene/build/smokeTestRelease/tmp/unpack/solr-5.0.0/lucene/ivy-settings.xml
   [smoker] 
   [smoker] resolve:
   [smoker] 
   [smoker] resolve-server:
   [smoker] 
   [smoker] ivy-availability-check:
   [smoker] 
   [smoker] ivy-fail:
   [smoker] 
   [smoker] ivy-fail:
   [smoker] 
   [smoker] ivy-configure:
   [smoker] [ivy:configure] :: loading settings :: file = /usr/home/jenkins/jenkins-slave/workspace/Lucene-Solr-SmokeRelease-5.x/lucene/build/smokeTestRelease/tmp/unpack/solr-5.0.0/lucene/ivy-settings.xml
   [smoker] 
   [smoker] sync-hack:
   [smoker] 
   [smoker] resolve:
   [smoker] 
   [smoker] ivy-availability-check:
   [smoker] 
   [smoker] ivy-fail:
   [smoker] 
   [smoker] ivy-fail:
   [smoker] 
   [smoker] ivy-configure:
   [smoker] [ivy:configure] :: loading settings :: file = /usr/home/jenkins/jenkins-slave/workspace/Lucene-Solr-SmokeRelease-5.x/lucene/build/smokeTestRelease/tmp/unpack/solr-5.0.0/lucene/ivy-settings.xml
   [smoker] 
   [smoker] resolve:
   [smoker] 
   [smoker] common.init:
   [smoker] 
   [smoker] compile-lucene-core:
   [smoker] 
   [smoker] ivy-availability-check:
   [smoker] 
   [smoker] ivy-fail:
   [smoker] 
   [smoker] ivy-configure:
   [smoker] [ivy:configure] :: loading settings :: file = /usr/home/jenkins/jenkins-slave/workspace/Lucene-Solr-SmokeRelease-5.x/lucene/build/smokeTestRelease/tmp/unpack/solr-5.0.0/lucene/ivy-settings.xml
   [smoker] 
   [smoker] resolve:
   [smoker] 
   [smoker] init:
   [smoker] 
   [smoker] -clover.disable:
   [smoker] 
   [smoker] -clover.load:
   [smoker] 
   [smoker] -clover.classpath:
   [smoker] 
   [smoker] -clover.setup:
   [smoker] 
   [smoker] clover:
   [smoker] 
   [smoker] compile-core:
   [smoker] 
   [smoker] init:
   [smoker] 
   [smoker] -clover.disable:
   [smoker] 
   [smoker] -clover.load:
   [smoker] 
   [smoker] -clover.classpath:
   [smoker] 
   [smoker] -clover.setup:
   [smoker] 
   [smoker] clover:
   [smoker] 
   [smoker] common.compile-core:
   [smoker] 
   [smoker] compile-core:
   [smoker] 
   [smoker] check-lucene-core-uptodate:
   [smoker] 
   [smoker] jar-lucene-core:
   [smoker] 
   [smoker] check-backward-codecs-uptodate:
   [smoker] 
   [smoker] jar-backward-codecs:
   [smoker] 
   [smoker] check-analyzers-phonetic-uptodate:
   [smoker] 
   [smoker] jar-analyzers-phonetic:
   [smoker] 
   [smoker] check-analyzers-kuromoji-uptodate:
   [smoker] 
   [smoker] jar-analyzers-kuromoji:
   [smoker] 
   [smoker] check-codecs-uptodate:
   [smoker] 
   [smoker] jar-codecs:
   [smoker] 
   [smoker] check-expressions-uptodate:
   [smoker] 
   [smoker] jar-expressions:
   [smoker] 
   [smoker] check-suggest-uptodate:
   [smoker] 
   [smoker] jar-suggest:
   [smoker] 
   [smoker] check-highlighter-uptodate:
   [smoker] 
   [smoker] jar-highlighter:
   [smoker] 
   [smoker] check-memory-uptodate:
   [smoker] 
   [smoker] jar-memory:
   [smoker] 
   [smoker] check-misc-uptodate:
   [smoker] 
   [smoker] jar-misc:
   [smoker] 
   [smoker] check-spatial-uptodate:
   [smoker] 
   [smoker] jar-spatial:
   [smoker] 
   [smoker] check-grouping-uptodate:
   [smoker] 
   [smoker] jar-grouping:
   [smoker] 
   [smoker] check-queries-uptodate:
   [smoker] 
   [smoker] jar-queries:
   [smoker] 
   [smoker] check-queryparser-uptodate:
   [smoker] 
   [smoker] jar-queryparser:
   [smoker] 
   [smoker] check-join-uptodate:
   [smoker] 
   [smoker] jar-join:
   [smoker] 
   [smoker] prep-lucene-jars:
   [smoker] 
   [smoker] resolve-example:
   [smoker] 
   [smoker] ivy-availability-check:
   [smoker] 
   [smoker] ivy-fail:
   [smoker] 
   [smoker] ivy-configure:
   [smoker] [ivy:configure] :: loading settings :: file = /usr/home/jenkins/jenkins-slave/workspace/Lucene-Solr-SmokeRelease-5.x/lucene/build/smokeTestRelease/tmp/unpack/solr-5.0.0/lucene/ivy-settings.xml
   [smoker] 
   [smoker] resolve:
   [smoker] 
   [smoker] resolve-server:
   [smoker] 
   [smoker] ivy-availability-check:
   [smoker] 
   [smoker] ivy-fail:
   [smoker] 
   [smoker] ivy-fail:
   [smoker] 
   [smoker] ivy-configure:
   [smoker] [ivy:configure] :: loading settings :: file = /usr/home/jenkins/jenkins-slave/workspace/Lucene-Solr-SmokeRelease-5.x/lucene/build/smokeTestRelease/tmp/unpack/solr-5.0.0/lucene/ivy-settings.xml
   [smoker] 
   [smoker] sync-hack:
   [smoker] 
   [smoker] resolve:
   [smoker] 
   [smoker] ivy-fail:
   [smoker] 
   [smoker] resolve:
   [smoker] 
   [smoker] common.init:
   [smoker] 
   [smoker] compile-lucene-core:
   [smoker] 
   [smoker] ivy-availability-check:
   [smoker] 
   [smoker] ivy-fail:
   [smoker] 
   [smoker] ivy-configure:
   [smoker] [ivy:configure] :: loading settings :: file = /usr/home/jenkins/jenkins-slave/workspace/Lucene-Solr-SmokeRelease-5.x/lucene/build/smokeTestRelease/tmp/unpack/solr-5.0.0/lucene/ivy-settings.xml
   [smoker] 
   [smoker] resolve:
   [smoker] 
   [smoker] init:
   [smoker] 
   [smoker] -clover.disable:
   [smoker] 
   [smoker] -clover.load:
   [smoker] 
   [smoker] -clover.classpath:
   [smoker] 
   [smoker] -clover.setup:
   [smoker] 
   [smoker] clover:
   [smoker] 
   [smoker] compile-core:
   [smoker] 
   [smoker] init:
   [smoker] 
   [smoker] common.compile-core:
   [smoker] 
   [smoker] common-solr.compile-core:
   [smoker] 
   [smoker] compile-core:
   [smoker] 
   [smoker] compile-test-framework:
   [smoker] 
   [smoker] ivy-availability-check:
   [smoker] 
   [smoker] ivy-fail:
   [smoker] 
   [smoker] ivy-configure:
   [smoker] [ivy:configure] :: loading settings :: file = /usr/home/jenkins/jenkins-slave/workspace/Lucene-Solr-SmokeRelease-5.x/lucene/build/smokeTestRelease/tmp/unpack/solr-5.0.0/lucene/ivy-settings.xml
   [smoker] 
   [smoker] resolve:
   [smoker] 
   [smoker] init:
   [smoker] 
   [smoker] compile-lucene-core:
   [smoker] 
   [smoker] compile-codecs:
   [smoker] 
   [smoker] ivy-availability-check:
   [smoker] 
   [smoker] ivy-fail:
   [smoker] 
   [smoker] ivy-configure:
   [smoker] [ivy:configure] :: loading settings :: file = /usr/home/jenkins/jenkins-slave/workspace/Lucene-Solr-SmokeRelease-5.x/lucene/build/smokeTestRelease/tmp/unpack/solr-5.0.0/lucene/ivy-settings.xml
   [smoker] 
   [smoker] resolve:
   [smoker] 
   [smoker] common.init:
   [smoker] 
   [smoker] compile-lucene-core:
   [smoker] 
   [smoker] init:
   [smoker] 
   [smoker] -clover.disable:
   [smoker] 
   [smoker] -clover.load:
   [smoker] 
   [smoker] -clover.classpath:
   [smoker] 
   [smoker] -clover.setup:
   [smoker] 
   [smoker] clover:
   [smoker] 
   [smoker] compile-core:
   [smoker] 
   [smoker] -clover.disable:
   [smoker] 
   [smoker] -clover.load:
   [smoker] 
   [smoker] -clover.classpath:
   [smoker] 
   [smoker] -clover.setup:
   [smoker] 
   [smoker] clover:
   [smoker] 
   [smoker] common.compile-core:
   [smoker] 
   [smoker] compile-core:
   [smoker] 
   [smoker] common.compile-test:
   [smoker]     [mkdir] Created dir: /usr/home/jenkins/jenkins-slave/workspace/Lucene-Solr-SmokeRelease-5.x/lucene/build/smokeTestRelease/tmp/unpack/solr-5.0.0/solr/build/solr-core/classes/test
   [smoker]     [javac] Compiling 489 source files to /usr/home/jenkins/jenkins-slave/workspace/Lucene-Solr-SmokeRelease-5.x/lucene/build/smokeTestRelease/tmp/unpack/solr-5.0.0/solr/build/solr-core/classes/test
   [smoker]     [javac] Note: Some input files use or override a deprecated API.
   [smoker]     [javac] Note: Recompile with -Xlint:deprecation for details.
   [smoker]     [javac] Note: Some input files use unchecked or unsafe operations.
   [smoker]     [javac] Note: Recompile with -Xlint:unchecked for details.
   [smoker]      [copy] Copying 1 file to /usr/home/jenkins/jenkins-slave/workspace/Lucene-Solr-SmokeRelease-5.x/lucene/build/smokeTestRelease/tmp/unpack/solr-5.0.0/solr/build/solr-core/classes/test
   [smoker] 
   [smoker] common-solr.compile-test:
   [smoker] 
   [smoker] compile-test:
   [smoker] 
   [smoker] install-junit4-taskdef:
   [smoker] 
   [smoker] compile-tools:
   [smoker] 
   [smoker] ivy-availability-check:
   [smoker] 
   [smoker] ivy-fail:
   [smoker] 
   [smoker] ivy-configure:
   [smoker] [ivy:configure] :: loading settings :: file = /usr/home/jenkins/jenkins-slave/workspace/Lucene-Solr-SmokeRelease-5.x/lucene/build/smokeTestRelease/tmp/unpack/solr-5.0.0/lucene/ivy-settings.xml
   [smoker] 
   [smoker] resolve:
   [smoker] 
   [smoker] init:
   [smoker] 
   [smoker] compile-core:
   [smoker] 
   [smoker] validate:
   [smoker] 
   [smoker] resolve-groovy:
   [smoker] 
   [smoker] -init-totals:
   [smoker] 
   [smoker] -test:
   [smoker]     [mkdir] Created dir: /usr/home/jenkins/jenkins-slave/workspace/Lucene-Solr-SmokeRelease-5.x/lucene/build/smokeTestRelease/tmp/unpack/solr-5.0.0/solr/build/solr-core/test
   [smoker] [loadresource] Do not set property tests.explicitclass as its length is 0.
   [smoker]     [mkdir] Created dir: /usr/home/jenkins/jenkins-slave/workspace/Lucene-Solr-SmokeRelease-5.x/lucene/build/smokeTestRelease/tmp/unpack/solr-5.0.0/solr/build/solr-core/test/temp
   [smoker]     [mkdir] Created dir: /usr/home/jenkins/jenkins-slave/workspace/Lucene-Solr-SmokeRelease-5.x/lucene/build/smokeTestRelease/tmp/unpack/solr-5.0.0/.caches/test-stats/solr-core
   [smoker]    [junit4] <JUnit4> says hallo! Master seed: 1F00E3F0E3D1690
   [smoker]    [junit4] Your default console's encoding may not display certain unicode glyphs: US-ASCII
   [smoker]    [junit4] Executing 450 suites with 4 JVMs.
   [smoker]    [junit4] 
   [smoker]    [junit4] Started J0 PID(26193@lucene.zones.apache.org).
   [smoker]    [junit4] Started J2 PID(26190@lucene.zones.apache.org).
   [smoker]    [junit4] Started J3 PID(26192@lucene.zones.apache.org).
   [smoker]    [junit4] Started J1 PID(26191@lucene.zones.apache.org).
   [smoker]    [junit4] Suite: org.apache.solr.util.TestRandomMergePolicy
   [smoker]    [junit4] Completed on J0 in 8.10s, 2 tests
   [smoker]    [junit4] 
   [smoker]    [junit4] Suite: org.apache.solr.handler.CSVRequestHandlerTest
   [smoker]    [junit4] Completed on J0 in 37.80s, 1 test
   [smoker]    [junit4] 
   [smoker]    [junit4] Suite: org.apache.solr.update.processor.RegexBoostProcessorTest
   [smoker]    [junit4] Completed on J2 in 45.95s, 4 tests
   [smoker]    [junit4] 
   [smoker]    [junit4] Suite: org.apache.solr.update.processor.UniqFieldsUpdateProcessorFactoryTest
   [smoker]    [junit4] Completed on J3 in 48.88s, 1 test
   [smoker]    [junit4] 
   [smoker]    [junit4] Suite: org.apache.solr.search.TestMaxScoreQueryParser
   [smoker]    [junit4] Completed on J2 in 4.06s, 6 tests
   [smoker]    [junit4] 
   [smoker]    [junit4] Suite: org.apache.solr.update.processor.SignatureUpdateProcessorFactoryTest
   [smoker]    [junit4] Completed on J1 in 51.98s, 6 tests
   [smoker]    [junit4] 
   [smoker]    [junit4] Suite: org.apache.solr.search.TestComponentsName
   [smoker]    [junit4] Completed on J1 in 4.06s, 1 test
   [smoker]    [junit4] 
   [smoker]    [junit4] Suite: org.apache.solr.cloud.ChaosMonkeySafeLeaderTest
   [smoker]    [junit4] IGNOR/A 0.15s J1 | ChaosMonkeySafeLeaderTest.testDistribSearch
   [smoker]    [junit4]    > Assumption #1: 'slow' test group is disabled (@Slow())
   [smoker]    [junit4] Completed on J1 in 0.27s, 1 test, 1 skipped
   [smoker]    [junit4] 
   [smoker]    [junit4] Suite: org.apache.solr.analysis.TestReversedWildcardFilterFactory
   [smoker]    [junit4] Completed on J2 in 7.84s, 4 tests
   [smoker]    [junit4] 
   [smoker]    [junit4] Suite: org.apache.solr.core.TestQuerySenderNoQuery
   [smoker]    [junit4] Completed on J1 in 2.47s, 3 tests
   [smoker]    [junit4] 
   [smoker]    [junit4] Suite: org.apache.solr.core.TestConfigSets
   [smoker]    [junit4] Completed on J2 in 1.85s, 4 tests
   [smoker]    [junit4] 
   [smoker]    [junit4] Suite: org.apache.solr.search.TestFiltering
   [smoker]    [junit4] Completed on J0 in 15.45s, 3 tests
   [smoker]    [junit4] 
   [smoker]    [junit4] Suite: org.apache.solr.search.TestSolrJ
   [smoker]    [junit4] Completed on J0 in 0.06s, 1 test
   [smoker]    [junit4] 
   [smoker]    [junit4] Suite: org.apache.solr.util.FileUtilsTest
   [smoker]    [junit4] Completed on J0 in 0.03s, 1 test
   [smoker]    [junit4] 
   [smoker]    [junit4] Suite: org.apache.solr.cloud.RecoveryZkTest
   [smoker]    [junit4] IGNOR/A 0.20s J0 | RecoveryZkTest.testDistribSearch
   [smoker]    [junit4]    > Assumption #1: 'slow' test group is disabled (@Slow())
   [smoker]    [junit4] Completed on J0 in 0.34s, 1 test, 1 skipped
   [smoker]    [junit4] 
   [smoker]    [junit4] Suite: org.apache.solr.search.function.TestFunctionQuery
   [smoker]    [junit4] Completed on J1 in 8.44s, 15 tests
   [smoker]    [junit4] 
   [smoker]    [junit4] Suite: org.apache.solr.response.TestChildDocTransformer
   [smoker]    [junit4] Completed on J1 in 3.20s, 2 tests
   [smoker]    [junit4] 
   [smoker]    [junit4] Suite: org.apache.solr.DistributedIntervalFacetingTest
   [smoker]    [junit4] IGNOR/A 0.00s J1 | DistributedIntervalFacetingTest.testDistribSearch
   [smoker]    [junit4]    > Assumption #1: 'slow' test group is disabled (@Slow())
   [smoker]    [junit4] Completed on J1 in 0.01s, 1 test, 1 skipped
   [smoker]    [junit4] 
   [smoker]    [junit4] Suite: org.apache.solr.search.TestSolr4Spatial
   [smoker]    [junit4] IGNOR/A 0.16s J2 | TestSolr4Spatial.testSortMultiVal {p0=bbox}
   [smoker]    [junit4]    > Assumption #1: Multivalue not supported for this field
   [smoker]    [junit4] IGNOR/A 0.02s J2 | TestSolr4Spatial.solr4OldShapeSyntax {p0=pointvector}
   [smoker]    [junit4]    > Assumption #1: Mostly just valid for prefix-tree
   [smoker]    [junit4] IGNOR/A 0.02s J2 | TestSolr4Spatial.testSortMultiVal {p0=pointvector}
   [smoker]    [junit4]    > Assumption #1: Multivalue not supported for this field
   [smoker]    [junit4] Completed on J2 in 12.08s, 45 tests, 3 skipped
   [smoker]    [junit4] 
   [smoker]    [junit4] Suite: org.apache.solr.analysis.PathHierarchyTokenizerFactoryTest
   [smoker]    [junit4] Completed on J1 in 1.80s, 2 tests
   [smoker]    [junit4] 
   [smoker]    [junit4] Suite: org.apache.solr.update.processor.URLClassifyProcessorTest
   [smoker]    [junit4] Completed on J1 in 1.12s, 7 tests
   [smoker]    [junit4] 
   [smoker]    [junit4] Suite: org.apache.solr.util.TestSystemIdResolver
   [smoker]    [junit4] Completed on J1 in 0.14s, 1 test
   [smoker]    [junit4] 
   [smoker]    [junit4] Suite: org.apache.solr.handler.admin.LukeRequestHandlerTest
   [smoker]    [junit4] Completed on J1 in 4.59s, 6 tests
   [smoker]    [junit4] 
   [smoker]    [junit4] Suite: org.apache.solr.core.TestCoreContainer
   [smoker]    [junit4] Completed on J0 in 26.70s, 9 tests
   [smoker]    [junit4] 
   [smoker]    [junit4] Suite: org.apache.solr.util.SimplePostToolTest
   [smoker]    [junit4] Completed on J0 in 0.38s, 11 tests
   [smoker]    [junit4] 
   [smoker]    [junit4] Suite: org.apache.solr.search.MergeStrategyTest
   [smoker]    [junit4] Completed on J3 in 42.33s, 1 test
   [smoker]    [junit4] 
   [smoker]    [junit4] Suite: org.apache.solr.cloud.AsyncMigrateRouteKeyTest
   [smoker]    [junit4] IGNOR/A 0.18s J3 | AsyncMigrateRouteKeyTest.testDistribSearch
   [smoker]    [junit4]    > Assumption #1: 'slow' test group is disabled (@Slow())
   [smoker]    [junit4] Completed on J3 in 0.33s, 1 test, 1 skipped
   [smoker]    [junit4] 
   [smoker]    [junit4] Suite: org.apache.solr.search.ReturnFieldsTest
   [smoker]    [junit4] Completed on J0 in 3.07s, 12 tests
   [smoker]    [junit4] 
   [smoker]    [junit4] Suite: org.apache.solr.util.PrimUtilsTest
   [smoker]    [junit4] Completed on J0 in 0.11s, 2 tests
   [smoker]    [junit4] 
   [smoker]    [junit4] Suite: org.apache.solr.rest.TestManagedResource
   [smoker]    [junit4] Completed on J0 in 0.26s, 2 tests
   [smoker]    [junit4] 
   [smoker]    [junit4] Suite: org.apache.solr.core.SOLR749Test
   [smoker]    [junit4] Completed on J3 in 4.44s, 2 tests
   [smoker]    [junit4] 
   [smoker]    [junit4] Suite: org.apache.solr.search.QueryEqualityTest
   [smoker]    [junit4] Completed on J0 in 5.22s, 73 tests
   [smoker]    [junit4] 
   [smoker]    [junit4] Suite: org.apache.solr.search.TestSearchPerf
   [smoker]    [junit4] Completed on J3 in 1.35s, 1 test
   [smoker]    [junit4] 
   [smoker]    [junit4] Suite: org.apache.solr.handler.admin.ShowFileRequestHandlerTest
   [smoker]    [junit4] Completed on J1 in 19.36s, 4 tests
   [smoker]    [junit4] 
   [smoker]    [junit4] Suite: org.apache.solr.rest.schema.TestBulkSchemaAPI
   [smoker]    [junit4] Completed on J2 in 26.83s, 2 tests
   [smoker]    [junit4] 
   [smoker]    [junit4] Suite: org.apache.solr.request.TestBinaryResponseWriter
   [smoker]    [junit4] Completed on J0 in 1.66s, 2 tests
   [smoker]    [junit4] 
   [smoker]    [junit4] Suite: org.apache.solr.TestCursorMarkWithoutUniqueKey
   [smoker]    [junit4] Completed on J0 in 0.90s, 1 test
   [smoker]    [junit4] 
   [smoker]    [junit4] Suite: org.apache.solr.TestDistributedMissingSort
   [smoker]    [junit4] IGNOR/A 0.00s J0 | TestDistributedMissingSort.testDistribSearch
   [smoker]    [junit4]    > Assumption #1: 'slow' test group is disabled (@Slow())
   [smoker]    [junit4] Completed on J0 in 0.01s, 1 test, 1 skipped
   [smoker]    [junit4] 
   [smoker]    [junit4] Suite: org.apache.solr.search.SpatialFilterTest
   [smoker]    [junit4] Completed on J1 in 2.56s, 3 tests
   [smoker]    [junit4] 
   [smoker]    [junit4] Suite: org.apache.solr.core.TestArbitraryIndexDir
   [smoker]    [junit4] Completed on J0 in 1.95s, 1 test
   [smoker]    [junit4] 
   [smoker]    [junit4] Suite: org.apache.solr.core.ResourceLoaderTest
   [smoker]    [junit4] Completed on J0 in 0.31s, 7 tests
   [smoker]    [junit4] 
   [smoker]    [junit4] Suite: org.apache.solr.BasicFunctionalityTest
   [smoker]    [junit4] Completed on J2 in 4.93s, 23 tests
   [smoker]    [junit4] 
   [smoker]    [junit4] Suite: org.apache.solr.response.TestSortingResponseWriter
   [smoker]    [junit4] Completed on J0 in 1.91s, 1 test
   [smoker]    [junit4] 
   [smoker]    [junit4] Suite: org.apache.solr.TestRandomFaceting
   [smoker]    [junit4] IGNOR/A 0.00s J0 | TestRandomFaceting.testRandomFaceting
   [smoker]    [junit4]    > Assumption #1: 'slow' test group is disabled (@Slow())
   [smoker]    [junit4] Completed on J0 in 0.01s, 1 test, 1 skipped
   [smoker]    [junit4] 
   [smoker]    [junit4] Suite: org.apache.solr.analysis.TestCharFilters
   [smoker]    [junit4] Completed on J2 in 0.63s, 2 tests
   [smoker]    [junit4] 
   [smoker]    [junit4] Suite: org.apache.solr.update.processor.UpdateRequestProcessorFactoryTest
   [smoker]    [junit4] Completed on J2 in 2.66s, 2 tests
   [smoker]    [junit4] 
   [smoker]    [junit4] Suite: org.apache.solr.util.DateMathParserTest
   [smoker]    [junit4] Completed on J2 in 0.10s, 8 tests
   [smoker]    [junit4] 
   [smoker]    [junit4] Suite: org.apache.solr.core.TestSolrXmlPersistor
   [smoker]    [junit4] Completed on J2 in 0.21s, 7 tests
   [smoker]    [junit4] 
   [smoker]    [junit4] Suite: org.apache.solr.handler.PingRequestHandlerTest
   [smoker]    [junit4] Completed on J2 in 1.64s, 5 tests
   [smoker]    [junit4] 
   [smoker]    [junit4] Suite: org.apache.solr.core.CachingDirectoryFactoryTest
   [smoker]    [junit4] Completed on J1 in 8.35s, 1 test
   [smoker]    [junit4] 
   [smoker]    [junit4] Suite: org.apache.solr.search.TestCustomSort
   [smoker]    [junit4] Completed on J2 in 1.53s, 1 test
   [smoker]    [junit4] 
   [smoker]    [junit4] Suite: org.apache.solr.cloud.TestReplicaProperties
   [smoker]    [junit4] IGNOR/A 0.01s J2 | TestReplicaProperties.testDistribSearch
   [smoker]    [junit4]    > Assumption #1: 'slow' test group is disabled (@Slow())
   [smoker]    [junit4] Completed on J2 in 0.11s, 1 test, 1 skipped
   [smoker]    [junit4] 
   [smoker]    [junit4] Suite: org.apache.solr.search.TestReRankQParserPlugin
   [smoker]    [junit4] Completed on J1 in 2.59s, 2 tests
   [smoker]    [junit4] 
   [smoker]    [junit4] Suite: org.apache.solr.search.TestQueryUtils
   [smoker]    [junit4] Completed on J2 in 2.17s, 1 test
   [smoker]    [junit4] 
   [smoker]    [junit4] Suite: org.apache.solr.rest.schema.TestFieldTypeCollectionResource
   [smoker]    [junit4] Completed on J2 in 6.45s, 2 tests
   [smoker]    [junit4] 
   [smoker]    [junit4] Suite: org.apache.solr.handler.BinaryUpdateRequestHandlerTest
   [smoker]    [junit4] Completed on J2 in 1.95s, 1 test
   [smoker]    [junit4] 
   [smoker]    [junit4] Suite: org.apache.solr.rest.schema.TestDynamicFieldResource
   [smoker]    [junit4] Completed on J1 in 9.72s, 4 tests
   [smoker]    [junit4] 
   [smoker]    [junit4] Suite: org.apache.solr.search.TestSearcherReuse
   [smoker]    [junit4] Completed on J2 in 1.12s, 1 test
   [smoker]    [junit4] 
   [smoker]    [junit4] Suite: org.apache.solr.handler.admin.MBeansHandlerTest
   [smoker]    [junit4] Completed on J1 in 1.93s, 1 test
   [smoker]    [junit4] 
   [smoker]    [junit4] Suite: org.apache.solr.search.TestRealTimeGet
   [smoker]    [junit4] Completed on J2 in 17.00s, 4 tests
   [smoker]    [junit4] 
   [smoker]    [junit4] Suite: org.apache.solr.search.TestStressVersions
   [smoker]    [junit4] Completed on J1 in 21.66s, 1 test
   [smoker]    [junit4] 
   [smoker]    [junit4] Suite: org.apache.solr.rest.schema.TestCopyFieldCollectionResource
   [smoker]    [junit4] Completed on J2 in 7.03s, 5 tests
   [smoker]    [junit4] 
   [smoker]    [junit4] Suite: org.apache.solr.cloud.TestShortCircuitedRequests
   [smoker]    [junit4] IGNOR/A 0.00s J2 | TestShortCircuitedRequests.testDistribSearch
   [smoker]    [junit4]    > Assumption #1: 'slow' test group is disabled (@Slow())
   [smoker]    [junit4] Completed on J2 in 0.01s, 1 test, 1 skipped
   [smoker]    [junit4] 
   [smoker]    [junit4] Suite: org.apache.solr.handler.component.DistributedFacetPivotLongTailTest
   [smoker]    [junit4] Completed on J0 in 56.49s, 1 test
   [smoker]    [junit4] 
   [smoker]    [junit4] HEARTBEAT J3 PID(26192@lucene.zones.apache.org): 2014-11-29T02:14:05, stalled for 63.8s at: TermVectorComponentDistributedTest.testDistribSearch
   [smoker]    [junit4] Suite: org.apache.solr.handler.component.TermVectorComponentDistributedTest
   [smoker]    [junit4] Completed on J3 in 66.30s, 1 test
   [smoker]    [junit4] 
   [smoker]    [junit4] Suite: org.apache.solr.OutputWriterTest
   [smoker]    [junit4] Completed on J3 in 1.74s, 5 tests
   [smoker]    [junit4] 
   [smoker]    [junit4] Suite: org.apache.solr.cloud.TestHashPartitioner
   [smoker]    [junit4] Completed on J2 in 19.21s, 5 tests
   [smoker]    [junit4] 
   [smoker]    [junit4] Suite: org.apache.solr.highlight.HighlighterConfigTest
   [smoker]    [junit4] Completed on J2 in 1.57s, 1 test
   [smoker]    [junit4] 
   [smoker]    [junit4] Suite: org.apache.solr.rest.schema.TestUniqueKeyFieldResource
   [smoker]    [junit4] Completed on J0 in 10.04s, 1 test
   [smoker]    [junit4] 
   [smoker]    [junit4] Suite: org.apache.solr.search.TestRecovery
   [smoker]    [junit4] Completed on J1 in 26.20s, 11 tests
   [smoker]    [junit4] 
   [smoker]    [junit4] Suite: org.apache.solr.core.TestImplicitCoreProperties
   [smoker]    [junit4] Completed on J0 in 2.42s, 1 test
   [smoker]    [junit4] 
   [smoker]    [junit4] Suite: org.apache.solr.cloud.ClusterStateTest
   [smoker]    [junit4] Completed on J1 in 2.39s, 1 test
   [smoker]    [junit4] 
   [smoker]    [junit4] Suite: org.apache.solr.TestTolerantSearch
   [smoker]    [junit4] Completed on J3 in 8.79s, 2 tests
   [smoker]    [junit4] 
   [smoker]    [junit4] Suite: org.apache.solr.request.TestRemoteStreaming
   [smoker]    [junit4] Completed on J2 in 7.26s, 4 tests
   [smoker]    [junit4] 
   [smoker]    [junit4] Suite: org.apache.solr.spelling.TestSuggestSpellingConverter
   [smoker]    [junit4] Completed on J2 in 0.05s, 2 tests
   [smoker]    [junit4] 
   [smoker]    [junit4] Suite: org.apache.solr.core.TestShardHandlerFactory
   [smoker]    [junit4] Completed on J2 in 0.80s, 2 tests
   [smoker]    [junit4] 
   [smoker]    [junit4] Suite: org.apache.solr.util.SolrPluginUtilsTest
   [smoker]    [junit4] Completed on J3 in 1.97s, 7 tests
   [smoker]    [junit4] 
   [smoker]    [junit4] Suite: org.apache.solr.util.TimeZoneUtilsTest
   [smoker]    [junit4] Completed on J3 in 0.17s, 5 tests
   [smoker]    [junit4] 
   [smoker]    [junit4] Suite: org.apache.solr.schema.DocValuesMissingTest
   [smoker]    [junit4] Completed on J2 in 2.91s, 58 tests
   [smoker]    [junit4] 
   [smoker]    [junit4] Suite: org.apache.solr.search.mlt.CloudMLTQParserTest
   [smoker]    [junit4] IGNOR/A 0.00s J2 | CloudMLTQParserTest.testDistribSearch
   [smoker]    [junit4]    > Assumption #1: 'slow' test group is disabled (@Slow())
   [smoker]    [junit4] Completed on J2 in 0.01s, 1 test, 1 skipped
   [smoker]    [junit4] 
   [smoker]    [junit4] Suite: org.apache.solr.cloud.DistribDocExpirationUpdateProcessorTest
   [smoker]    [junit4] IGNOR/A 0.00s J2 | DistribDocExpirationUpdateProcessorTest.testDistribSearch
   [smoker]    [junit4]    > Assumption #1: 'slow' test group is disabled (@Slow())
   [smoker]    [junit4] Completed on J2 in 0.01s, 1 test, 1 skipped
   [smoker]    [junit4] 
   [smoker]    [junit4] Suite: org.apache.solr.schema.TestCloudManagedSchema
   [smoker]    [junit4] IGNOR/A 0.00s J2 | TestCloudManagedSchema.testDistribSearch
   [smoker]    [junit4]    > Assumption #1: 'slow' test group is disabled (@Slow())
   [smoker]    [junit4] Completed on J2 in 0.01s, 1 test, 1 skipped
   [smoker]    [junit4] 
   [smoker]    [junit4] Suite: org.apache.solr.cloud.SimpleCollectionCreateDeleteTest
   [smoker]    [junit4] IGNOR/A 0.00s J2 | SimpleCollectionCreateDeleteTest.testDistribSearch
   [smoker]    [junit4]    > Assumption #1: 'slow' test group is disabled (@Slow())
   [smoker]    [junit4] Completed on J2 in 0.00s, 1 test, 1 skipped
   [smoker]    [junit4] 
   [smoker]    [junit4] Suite: org.apache.solr.search.AnalyticsQueryTest
   [smoker]    [junit4] Completed on J2 in 1.73s, 1 test
   [smoker]    [junit4] 
   [smoker]    [junit4] Suite: org.apache.solr.rest.schema.TestDefaultSearchFieldResource
   [smoker]    [junit4] Completed on J1 in 6.34s, 1 test
   [smoker]    [junit4] 
   [smoker]    [junit4] Suite: org.apache.solr.search.TestSurroundQueryParser
   [smoker]    [junit4] Completed on J2 in 2.27s, 1 test
   [smoker]    [junit4] 
   [smoker]    [junit4] Suite: org.apache.solr.internal.csv.writer.CSVConfigTest
   [smoker]    [junit4] Completed on J2 in 0.07s, 7 tests
   [smoker]    [junit4] 
   [smoker]    [junit4] Suite: org.apache.solr.cloud.ConnectionManagerTest
   [smoker]    [junit4] IGNOR/A 0.00s J2 | ConnectionManagerTest.testLikelyExpired
   [smoker]    [junit4]    > Assumption #1: 'slow' test group is disabled (@Slow())
   [smoker]    [junit4] Completed on J2 in 0.01s, 2 tests, 2 skipped
   [smoker]    [junit4] 
   [smoker]    [junit4] Suite: org.apache.solr.search.TestStressUserVersions
   [smoker]    [junit4] Completed on J2 in 7.05s, 1 test
   [smoker]    [junit4] 
   [smoker]    [junit4] Suite: org.apache.solr.schema.MultiTermTest
   [smoker]    [junit4] Completed on J2 in 1.16s, 3 tests
   [smoker]    [junit4] 
   [smoker]    [junit4] Suite: org.apache.solr.core.OpenCloseCoreStressTest
   [smoker]    [junit4] IGNOR/A 0.00s J1 | OpenCloseCoreStressTest.test1HourNew
   [smoker]    [junit4]    > Assumption #1: 'weekly' test group is disabled (@Weekly())
   [smoker]    [junit4] IGNOR/A 0.00s J1 | OpenCloseCoreStressTest.test15SecondsNew
   [smoker]    [junit4]    > Assumption #1: 'nightly' test group is disabled (@Nightly())
   [smoker]    [junit4] IGNOR/A 0.00s J1 | OpenCloseCoreStressTest.test10MinutesNew
   [smoker]    [junit4]    > Assumption #1: 'nightly' test group is disabled (@Nightly())
   [smoker]    [junit4] IGNOR/A 0.00s J1 | OpenCloseCoreStressTest.test1HourOld
   [smoker]    [junit4]    > Assumption #1: 'weekly' test group is disabled (@Weekly())
   [smoker]    [junit4] IGNOR/A 0.00s J1 | OpenCloseCoreStressTest.test10MinutesOld
   [smoker]    [junit4]    > Assumption #1: 'nightly' test group is disabled (@Nightly())
   [smoker]    [junit4] IGNOR/A 0.00s J1 | OpenCloseCoreStressTest.test15SecondsOld
   [smoker]    [junit4]    > Assumption #1: 'nightly' test group is disabled (@Nightly())
   [smoker]    [junit4] Completed on J1 in 11.22s, 7 tests, 6 skipped
   [smoker]    [junit4] 
   [smoker]    [junit4] Suite: org.apache.solr.cloud.hdfs.HdfsChaosMonkeySafeLeaderTest
   [smoker]    [junit4] IGNOR/A 0.00s J1 | HdfsChaosMonkeySafeLeaderTest.testDistribSearch
   [smoker]    [junit4]    > Assumption #1: 'nightly' test group is disabled (@Nightly(value=))
   [smoker]    [junit4] Completed on J1 in 0.01s, 1 test, 1 skipped
   [smoker]    [junit4] 
   [smoker]    [junit4] Suite: org.apache.solr.spelling.suggest.TestAnalyzeInfixSuggestions
   [smoker]    [junit4] Completed on J2 in 2.77s, 2 tests
   [smoker]    [junit4] 
   [smoker]    [junit4] Suite: org.apache.solr.TestDistributedSearch
   [smoker]    [junit4] IGNOR/A 0.00s J2 | TestDistributedSearch.testDistribSearch
   [smoker]    [junit4]    > Assumption #1: 'slow' test group is disabled (@Slow())
   [smoker]    [junit4] Completed on J2 in 0.00s, 1 test, 1 skipped
   [smoker]    [junit4] 
   [smoker]    [junit4] Suite: org.apache.solr.cloud.TestCloudInspectUtil
   [smoker]    [junit4] Completed on J2 in 0.03s, 1 test
   [smoker]    [junit4] 
   [smoker]    [junit4] Suite: org.apache.solr.cloud.ZkNodePropsTest
   [smoker]    [junit4] Completed on J2 in 0.05s, 1 test
   [smoker]    [junit4] 
   [smoker]    [junit4] Suite: org.apache.solr.search.similarities.TestPerFieldSimilarity
   [smoker]    [junit4] Completed on J2 in 0.70s, 7 tests
   [smoker]    [junit4] 
   [smoker]    [junit4] Suite: org.apache.solr.CursorPagingTest
   [smoker]    [junit4] Completed on J0 in 23.13s, 5 tests
   [smoker]    [junit4] 
   [smoker]    [junit4] Suite: org.apache.solr.util.TestUtils
   [smoker]    [junit4] Completed on J0 in 0.04s, 5 tests
   [smoker]    [junit4] 
   [smoker]    [junit4] Suite: org.apache.solr.cloud.ChaosMonkeyNothingIsSafeTest
   [smoker]    [junit4] IGNOR/A 0.00s J0 | ChaosMonkeyNothingIsSafeTest.testDistribSearch
   [smoker]    [junit4]    > Assumption #1: 'slow' test group is disabled (@Slow())
   [smoker]    [junit4] Completed on J0 in 0.01s, 1 test, 1 skipped
   [smoker]    [junit4] 
   [smoker]    [junit4] Suite: org.apache.solr.handler.component.SuggestComponentTest
   [smoker]    [junit4] Completed on J1 in 5.83s, 7 tests
   [smoker]    [junit4] 
   [smoker]    [junit4] Suite: org.apache.solr.request.TestIntervalFaceting
   [smoker]    [junit4] IGNOR/A 0.00s J1 | TestIntervalFaceting.testRandom
   [smoker]    [junit4]    > Assumption #1: 'slow' test group is disabled (@Slow())
   [smoker]    [junit4] Completed on J1 in 2.74s, 17 tests, 1 skipped
   [smoker]    [junit4] 
   [smoker]    [junit4] Suite: org.apache.solr.update.AutoCommitTest
   [smoker]    [junit4] IGNOR/A 0.00s J1 | AutoCommitTest.testCommitWithin
   [smoker]    [junit4]    > Assumption #1: 'slow' test group is disabled (@Slow())
   [smoker]    [junit4] IGNOR/A 0.00s J1 | AutoCommitTest.testMaxTime
   [smoker]    [junit4]    > Assumption #1: 'slow' test group is disabled (@Slow())
   [smoker]    [junit4] IGNOR/A 0.00s J1 | AutoCommitTest.testMaxDocs
   [smoker]    [junit4]    > Assumption #1: 'slow' test group is disabled (@Slow())
   [smoker]    [junit4] Completed on J1 in 0.01s, 3 tests, 3 skipped
   [smoker]    [junit4] 
   [smoker]    [junit4] Suite: org.apache.solr.core.TestSolrConfigHandler
   [smoker]    [junit4] Completed on J3 in 27.12s, 3 tests
   [smoker]    [junit4] 
   [smoker]    [junit4] Suite: org.apache.solr.handler.admin.CoreAdminRequestStatusTest
   [smoker]    [junit4] Completed on J1 in 4.21s, 1 test
   [smoker]    [junit4] 
   [smoker]    [junit4] Suite: org.apache.solr.handler.DocumentAnalysisRequestHandlerTest
   [smoker]    [junit4] Completed on J3 in 1.60s, 4 tests
   [smoker]    [junit4] 
   [smoker]    [junit4] Suite: org.apache.solr.schema.ChangedSchemaMergeTest
   [smoker]    [junit4] Completed on J1 in 0.45s, 1 test
   [smoker]    [junit4] 
   [smoker]    [junit4] Suite: org.apache.solr.schema.UUIDFieldTest
   [smoker]    [junit4] Completed on J3 in 0.02s, 1 test
   [smoker]    [junit4] 
   [smoker]    [junit4] Suite: org.apache.solr.cloud.hdfs.HdfsUnloadDistributedZkTest
   [smoker]    [junit4] IGNOR/A 0.00s J3 | HdfsUnloadDistributedZkTest.testDistribSearch
   [smoker]    [junit4]    > Assumption #1: 'nightly' test group is disabled (@Nightly(value=))
   [smoker]    [junit4] Completed on J3 in 0.01s, 1 test, 1 skipped
   [smoker]    [junit4] 
   [smoker]    [junit4] Suite: org.apache.solr.search.TestFastLRUCache
   [smoker]    [junit4] Completed on J3 in 0.16s, 7 tests
   [smoker]    [junit4] 
   [smoker]    [junit4] Suite: org.apache.solr.internal.csv.CSVPrinterTest
   [smoker]    [junit4] Completed on J3 in 0.64s, 6 tests
   [smoker]    [junit4] 
   [smoker]    [junit4] Suite: org.apache.solr.servlet.SolrRequestParserTest
   [smoker]    [junit4] Completed on J1 in 2.75s, 10 tests
   [smoker]    [junit4] 
   [smoker]    [junit4] Suite: org.apache.solr.cloud.DeleteShardTest
   [smoker]    [junit4] IGNOR/A 0.00s J1 | DeleteShardTest.testDistribSearch
   [smoker]    [junit4]    > Assumption #1: 'slow' test group is disabled (@Slow())
   [smoker]    [junit4] Completed on J1 in 0.01s, 1 test, 1 skipped
   [smoker]    [junit4] 
   [smoker]    [junit4] Suite: org.apache.solr.schema.RequiredFieldsTest
   [smoker]    [junit4] Completed on J1 in 1.56s, 3 tests
   [smoker]    [junit4] 
   [smoker]    [junit4] Suite: org.apache.solr.core.TestSolrXmlPersistence
   [smoker]    [junit4] Completed on J3 in 8.58s, 8 tests
   [smoker]    [junit4] 
   [smoker]    [junit4] Suite: org.apache.solr.handler.component.DistributedFacetPivotSmallAdvancedTest
   [smoker]    [junit4] Completed on J2 in 20.79s, 1 test
   [smoker]    [junit4] 
   [smoker]    [junit4] Suite: org.apache.solr.cloud.MultiThreadedOCPTest
   [smoker]    [junit4] IGNOR/A 0.00s J2 | MultiThreadedOCPTest.testDistribSearch
   [smoker]    [junit4]    > Assumption #1: 'slow' test group is disabled (@Slow())
   [smoker]    [junit4] Completed on J2 in 0.00s, 1 test, 1 skipped
   [smoker]    [junit4] 
   [smoker]    [junit4] Suite: org.apache.solr.search.TestPseudoReturnFields
   [smoker]    [junit4] Completed on J2 in 1.93s, 14 tests
   [smoker]    [junit4] 
   [smoker]    [junit4] Suite: org.apache.solr.search.TestMissingGroups
   [smoker]    [junit4] Completed on J3 in 3.76s, 1 test
   [smoker]    [junit4] 
   [smoker]    [junit4] Suite: org.apache.solr.cloud.SolrXmlInZkTest
   [smoker]    [junit4] Completed on J1 in 9.19s, 7 tests
   [smoker]    [junit4] 
   [smoker]    [junit4] Suite: org.apache.solr.search.mlt.SimpleMLTQParserTest
   [smoker]    [junit4] Completed on J2 in 1.80s, 1 test
   [smoker]    [junit4] 
   [smoker]    [junit4] Suite: org.apache.solr.cloud.ExternalCollectionsTest
   [smoker]    [junit4] IGNOR/A 0.00s J2 | ExternalCollectionsTest.testDistribSearch
   [smoker]    [junit4]    > Assumption #1: 'slow' test group is disabled (@Slow())
   [smoker]    [junit4] Completed on J2 in 0.01s, 1 test, 1 skipped
   [smoker]    [junit4] 
   [smoker]    [junit4] Suite: org.apache.solr.schema.TestCollationField
   [smoker]    [junit4] Completed on J1 in 1.18s, 8 tests
   [smoker]    [junit4] 
   [smoker]    [junit4] Suite: org.apache.solr.search.similarities.TestSweetSpotSimilarityFactory
   [smoker]    [junit4] Completed on J1 in 1.02s, 3 tests
   [smoker]    [junit4] 
   [smoker]    [junit4] Suite: org.apache.solr.internal.csv.ExtendedBufferedReaderTest
   [smoker]    [junit4] Completed on J1 in 0.07s, 8 tests
   [smoker]    [junit4] 
   [smoker]    [junit4] Suite: org.apache.solr.cloud.CustomCollectionTest
   [smoker]    [junit4] IGNOR/A 0.00s J1 | CustomCollectionTest.testDistribSearch
   [smoker]    [junit4]    > Assumption #1: 'slow' test group is disabled (@Slow())
   [smoker]    [junit4] Completed on J1 in 0.01s, 1 test, 1 skipped
   [smoker]    [junit4] 
   [smoker]    [junit4] Suite: org.apache.solr.search.TestIndexSearcher
   [smoker]    [junit4] Completed on J3 in 3.25s, 2 tests
   [smoker]    [junit4] 
   [smoker]    [junit4] Suite: org.apache.solr.cloud.CollectionsAPIDistributedZkTest
   [smoker]    [junit4] IGNOR/A 0.00s J3 | CollectionsAPIDistributedZkTest.testDistribSearch
   [smoker]    [junit4]    > Assumption #1: 'slow' test group is disabled (@Slow())
   [smoker]    [junit4] Completed on J3 in 0.01s, 1 test, 1 skipped
   [smoker]    [junit4] 
   [smoker]    [junit4] Suite: org.apache.solr.search.similarities.TestNonDefinedSimilarityFactory
   [smoker]    [junit4] Completed on J1 in 1.28s, 3 tests
   [smoker]    [junit4] 
   [smoker]    [junit4] Suite: org.apache.solr.handler.component.DistributedExpandComponentTest
   [smoker]    [junit4] Completed on J0 in 26.99s, 1 test
   [smoker]    [junit4] 
   [smoker]    [junit4] Suite: org.apache.solr.handler.component.TermVectorComponentTest
   [smoker]    [junit4] Completed on J3 in 1.90s, 3 tests
   [smoker]    [junit4] 
   [smoker]    [junit4] Suite: org.apache.solr.handler.MoreLikeThisHandlerTest
   [smoker]    [junit4] Completed on J0 in 2.04s, 1 test
   [smoker]    [junit4] 
   [smoker]    [junit4] Suite: org.apache.solr.core.CoreContainerCoreInitFailuresTest
   [smoker]    [junit4] Completed on J3 in 1.72s, 2 tests
   [smoker]    [junit4] 
   [smoker]    [junit4] Suite: org.apache.solr.cloud.hdfs.HdfsBasicDistributedZk2Test
   [smoker]    [junit4] IGNOR/A 0.00s J3 | HdfsBasicDistributedZk2Test.testDistribSearch
   [smoker]    [junit4]    > Assumption #1: 'nightly' test group is disabled (@Nightly(value=))
   [smoker]    [junit4] Completed on J3 in 0.01s, 1 test, 1 skipped
   [smoker]    [junit4] 
   [smoker]    [junit4] Suite: org.apache.solr.schema.DateRangeFieldTest
   [smoker]    [junit4] Completed on J1 in 3.37s, 2 tests
   [smoker]    [junit4] 
   [smoker]    [junit4] Suite: org.apache.solr.cloud.OverseerCollectionProcessorTest
   [smoker]    [junit4] Completed on J2 in 6.51s, 14 tests
   [smoker]    [junit4] 
   [smoker]    [junit4] Suite: org.apache.solr.MinimalSchemaTest
   [smoker]    [junit4] Completed on J0 in 1.52s, 3 tests
   [smoker]    [junit4] 
   [smoker]    [junit4] Suite: org.apache.solr.handler.admin.InfoHandlerTest
   [smoker]    [junit4] Completed on J3 in 2.35s, 2 tests
   [smoker]    [junit4] 
   [smoker]    [junit4] Suite: org.apache.solr.handler.component.SpellCheckComponentTest
   [smoker]    [junit4] IGNOR/A 0.00s J3 | SpellCheckComponentTest.testExtendedResultsCount
   [smoker]    [junit4]    > Assumption #1: 'slow' test group is disabled (@Slow())
   [smoker]    [junit4] IGNOR/A 0.00s J3 | SpellCheckComponentTest.testPerDictionary
   [smoker]    [junit4]    > Assumption #1: 'slow' test group is disabled (@Slow())
   [smoker]    [junit4] IGNOR/A 0.00s J3 | SpellCheckComponentTest.test
   [smoker]    [junit4]    > Assumption #1: 'slow' test group is disabled (@Slow())
   [smoker]    [junit4] IGNOR/A 0.00s J3 | SpellCheckComponentTest.testCorrectSpelling
   [smoker]    [junit4]    > Assumption #1: 'slow' test group is disabled (@Slow())
   [smoker]    [junit4] IGNOR/A 0.00s J3 | SpellCheckComponentTest.testRebuildOnCommit
   [smoker]    [junit4]    > Assumption #1: 'slow' test group is disabled (@Slow())
   [smoker]    [junit4] IGNOR/A 0.00s J3 | SpellCheckComponentTest.testThresholdTokenFrequency
   [smoker]    [junit4]    > Assumption #1: 'slow' test group is disabled (@Slow())
   [smoker]    [junit4] IGNOR/A 0.00s J3 | SpellCheckComponentTest.testRelativeIndexDirLocation
   [smoker]    [junit4]    > Assumption #1: 'slow' test group is disabled (@Slow())
   [smoker]    [junit4] IGNOR/A 0.00s J3 | SpellCheckComponentTest.testReloadOnStart
   [smoker]    [junit4]    > Assumption #1: 'slow' test group is disabled (@Slow())
   [smoker]    [junit4] IGNOR/A 0.00s J3 | SpellCheckComponentTest.testCollate
   [smoker]    [junit4]    > Assumption #1: 'slow' test group is disabled (@Slow())
   [smoker]    [junit4] Completed on J3 in 0.04s, 9 tests, 9 skipped
   [smoker]    [junit4] 
   [smoker]    [junit4] Suite: org.apache.solr.update.DirectUpdateHandlerOptimizeTest
   [smoker]    [junit4] Completed on J1 in 2.46s, 1 test
   [smoker]    [junit4] 
   [smoker]    [junit4] Suite: org.apache.solr.SampleTest
   [smoker]    [junit4] Completed on J1 in 1.15s, 2 tests
   [smoker]    [junit4] 
   [smoker]    [junit4] Suite: org.apache.solr.search.TestExtendedDismaxParser
   [smoker]    [junit4] Completed on J0 in 4.30s, 18 tests
   [smoker]    [junit4] 
   [smoker]    [junit4] Suite: org.apache.solr.handler.component.TestPivotHelperCode
   [smoker]    [junit4] Completed on J0 in 0.05s, 3 tests
   [smoker]    [junit4] 
   [smoker]    [junit4] Suite: org.apache.solr.spelling.suggest.TestHighFrequencyDictionaryFactory
   [smoker]    [junit4] Completed on J3 in 3.67s, 1 test
   [smoker]    [junit4] 
   [smoker]    [junit4] Suite: org.apache.solr.rest.schema.TestFieldCollectionResource
   [smoker]    [junit4] Completed on J2 in 6.48s, 7 tests
   [smoker]    [junit4] 
   [smoker]    [junit4] Suite: org.apache.solr.util.CircularListTest
   [smoker]    [junit4] Completed on J2 in 0.09s, 1 test
   [smoker]    [junit4] 
   [smoker]    [junit4] Suite: org.apache.solr.cloud.DeleteLastCustomShardedReplicaTest
   [smoker]    [junit4] IGNOR/A 0.00s J2 | DeleteLastCustomShardedReplicaTest.testDistribSearch
   [smoker]    [junit4]    > Assumption #1: 'slow' test group is disabled (@Slow())
   [smoker]    [junit4] Completed on J2 in 0.01s, 1 test, 1 skipped
   [smoker]    [junit4] 
   [smoker]    [junit4] Suite: org.apache.solr.core.TestInitParams
   [smoker]    [junit4] Completed on J3 in 1.87s, 5 tests
   [smoker]    [junit4] 
   [smoker]    [junit4] Suite: org.apache.solr.update.TestIndexingPerformance
   [smoker]    [junit4] Completed on J2 in 2.29s, 1 test
   [smoker]    [junit4] 
   [smoker]    [junit4] Suite: org.apache.solr.analysis.TestLuceneMatchVersion
   [smoker]    [junit4] Completed on J2 in 0.84s, 1 test
   [smoker]    [junit4] 
   [smoker]    [junit4] Suite: org.apache.solr.response.TestCSVResponseWriter
   [smoker]    [junit4] Completed on J3 in 2.42s, 2 tests
   [smoker]    [junit4] 
   [smoker]    [junit4] Suite: org.apache.solr.update.processor.ParsingFieldUpdateProcessorsTest
   [smoker]    [junit4] Completed on J0 in 4.73s, 33 tests
   [smoker]    [junit4] 
   [smoker]    [junit4] Suite: org.apache.solr.spelling.SpellPossibilityIteratorTest
   [smoker]    [junit4] Completed on J3 in 0.29s, 3 tests
   [smoker]    [junit4] 
   [smoker]    [junit4] Suite: org.apache.solr.cloud.LeaderElectionTest
   [smoker]    [junit4] IGNOR/A 0.00s J3 | LeaderElectionTest.testCancelElection
   [smoker]    [junit4]    > Assumption #1: 'slow' test group is disabled (@Slow())
   [smoker]    [junit4] IGNOR/A 0.00s J3 | LeaderElectionTest.testBasic
   [smoker]    [junit4]    > Assumption #1: 'slow' test group is disabled (@Slow())
   [smoker]    [junit4] IGNOR/A 0.00s J3 | LeaderElectionTest.testElection
   [smoker]    [junit4]    > Assumption #1: 'slow' test group is disabled (@Slow())
   [smoker]    [junit4] IGNOR/A 0.00s J3 | LeaderElectionTest.testStressElection
   [smoker]    [junit4]    > Assumption #1: 'slow' test group is disabled (@Slow())
   [smoker]    [junit4] IGNOR/A 0.00s J3 | LeaderElectionTest.testParallelElection
   [smoker]    [junit4]    > Assumption #1: 'slow' test group is disabled (@Slow())
   [smoker]    [junit4] Completed on J3 in 0.01s, 5 tests, 5 skipped
   [smoker]    [junit4] 
   [smoker]    [junit4] Suite: org.apache.solr.TestTrie
   [smoker]    [junit4] Completed on J0 in 1.54s, 8 tests
   [smoker]    [junit4] 
   [smoker]    [junit4] Suite: org.apache.solr.cloud.ReplicationFactorTest
   [smoker]    [junit4] IGNOR/A 0.00s J0 | ReplicationFactorTest.testDistribSearch
   [smoker]    [junit4]    > Assumption #1: 'slow' test group is disabled (@Slow())
   [smoker]    [junit4] Completed on J0 in 0.01s, 1 test, 1 skipped
   [smoker]    [junit4] 
   [smoker]    [junit4] Suite: org.apache.solr.schema.DocValuesMultiTest
   [smoker]    [junit4] Completed on J3 in 2.14s, 4 tests
   [smoker]    [junit4] 
   [smoker]    [junit4] Suite: org.apache.solr.cloud.TestRequestStatusCollectionAPI
   [smoker]    [junit4] IGNOR/A 0.00s J3 | TestRequestStatusCollectionAPI.testDistribSearch
   [smoker]    [junit4]    > Assumption #1: 'slow' test group is disabled (@Slow())
   [smoker]    [junit4] Completed on J3 in 0.01s, 1 test, 1 skipped
   [smoker]    [junit4] 
   [smoker]    [junit4] Suite: org.apache.solr.handler.component.TestExpandComponent
   [smoker]    [junit4] Completed on J0 in 1.66s, 1 test
   [smoker]    [junit4] 
   [smoker]    [junit4] Suite: org.apache.solr.update.TestDocBasedVersionConstraints
   [smoker]    [junit4] Completed on J2 in 3.82s, 6 tests
   [smoker]    [junit4] 
   [smoker]    [junit4] Suite: org.apache.solr.core.TestQuerySenderListener
   [smoker]    [junit4] Completed on J2 in 1.97s, 3 tests
   [smoker]    [junit4] 
   [smoker]    [junit4] Suite: org.apache.solr.cloud.BasicDistributedZkTest
   [smoker]    [junit4] IGNOR/A 0.00s J2 | BasicDistributedZkTest.testDistribSearch
   [smoker]    [junit4]    > Assumption #1: 'slow' test group is disabled (@Slow())
   [smoker]    [junit4] Completed on J2 in 0.01s, 1 test, 1 skipped
   [smoker]    [junit4] 
   [smoker]    [junit4] Suite: org.apache.solr.cloud.BasicDistributedZk2Test
   [smoker]    [junit4] IGNOR/A 0.00s J2 | BasicDistributedZk2Test.testDistribSearch
   [smoker]    [junit4]    > Assumption #1: 'slow' test group is disabled (@Slow())
   [smoker]    [junit4] Completed on J2 in 0.01s, 1 test, 1 skipped
   [smoker]    [junit4] 
   [smoker]    [junit4] Suite: org.apache.solr.cloud.UnloadDistributedZkTest
   [smoker]    [junit4] IGNOR/A 0.00s J2 | UnloadDistributedZkTest.testDistribSearch
   [smoker]    [junit4]    > Assumption #1: 'slow' test group is disabled (@Slow())
   [smoker]    [junit4] Completed on J2 in 0.01s, 1 test, 1 skipped
   [smoker]    [junit4] 
   [smoker]    [junit4] Suite: org.apache.solr.cloud.SyncSliceTest
   [smoker]    [junit4] IGNOR/A 0.00s J2 | SyncSliceTest.testDistribSearch
   [smoker]    [junit4]    > Assumption #1: 'slow' test group is disabled (@Slow())
   [smoker]    [junit4] Completed on J2 in 0.01s, 1 test, 1 skipped
   [smoker]    [junit4] 
   [smoker]    [junit4] Suite: org.apache.solr.cloud.OverseerTest
   [smoker]    [junit4] IGNOR/A 0.00s J2 | OverseerTest.testPlaceholders
   [smoker]    [junit4]    > Assumption #1: 'slow' test group is disabled (@Slow())
   [smoker]    [junit4] IGNOR/A 0.00s J2 | OverseerTest.testReplay
   [smoker]    [junit4]    > Assumption #1: 'slow' test group is disabled (@Slow())
   [smoker]    [junit4] IGNOR/A 0.00s J2 | OverseerTest.testBadQueueItem
   [smoker]    [junit4]    > Assumption #1: 'slow' test group is disabled (@Slow())
   [smoker]    [junit4] IGNOR/A 0.00s J2 | OverseerTest.testOverseerFailure
   [smoker]    [junit4]    > Assumption #1: 'slow' test group is disabled (@Slow())
   [smoker]    [junit4] IGNOR/A 0.00s J2 | OverseerTest.testShardAssignment
   [smoker]    [junit4]    > Assumption #1: 'slow' test group is disabled (@Slow())
   [smoker]    [junit4] IGNOR/A 0.00s J2 | OverseerTest.testStateChange
   [smoker]    [junit4]    > Assumption #1: 'slow' test group is disabled (@Slow())
   [smoker]    [junit4] IGNOR/A 0.00s J2 | OverseerTest.testShardAssignmentBigger
   [smoker]    [junit4]    > Assumption #1: 'slow' test group is disabled (@Slow())
   [smoker]    [junit4] IGNOR/A 0.00s J2 | OverseerTest.testShardLeaderChange
   [smoker]    [junit4]    > Assumption #1: 'slow' test group is disabled (@Slow())
   [smoker]    [junit4] IGNOR/A 0.00s J2 | OverseerTest.testDoubleAssignment
   [smoker]    [junit4]    > Assumption #1: 'slow' test group is disabled (@Slow())
   [smoker]    [junit4] Completed on J2 in 0.03s, 9 tests, 9 skipped
   [smoker]    [junit4] 
   [smoker]    [junit4] Suite: org.apache.solr.cloud.LeaderElectionIntegrationTest
   [smoker]    [junit4] IGNOR/A 0.00s J2 | LeaderElectionIntegrationTest.testSimpleSliceLeaderElection
   [smoker]    [junit4]    > Assumption #1: 'slow' test group is disabled (@Slow())
   [smoker]    [junit4] IGNOR/A 0.00s J2 | LeaderElectionIntegrationTest.testLeaderElectionAfterClientTimeout
   [smoker]    [junit4]    > Assumption #1: 'slow' test group is disabled (@Slow())
   [smoker]    [junit4] Completed on J2 in 0.01s, 2 tests, 2 skipped
   [smoker]    [junit4] 
   [smoker]    [junit4] Suite: org.apache.

[...truncated too long message...]

.solr.schema.TestCloudSchemaless
   [smoker]    [junit4] IGNOR/A 0.00s J2 | TestCloudSchemaless.testDistribSearch
   [smoker]    [junit4]    > Assumption #1: 'slow' test group is disabled (@Slow())
   [smoker]    [junit4] Completed on J2 in 0.01s, 1 test, 1 skipped
   [smoker]    [junit4] 
   [smoker]    [junit4] Suite: org.apache.solr.schema.TestSchemaManager
   [smoker]    [junit4] Completed on J2 in 0.91s, 1 test
   [smoker]    [junit4] 
   [smoker]    [junit4] Suite: org.apache.solr.schema.TestCollationFieldDocValues
   [smoker]    [junit4] Completed on J0 in 1.18s, 8 tests
   [smoker]    [junit4] 
   [smoker]    [junit4] Suite: org.apache.solr.search.CursorMarkTest
   [smoker]    [junit4] Completed on J0 in 1.48s, 4 tests
   [smoker]    [junit4] 
   [smoker]    [junit4] Suite: org.apache.solr.search.RankQueryTest
   [smoker]    [junit4] Completed on J0 in 1.80s, 1 test
   [smoker]    [junit4] 
   [smoker]    [junit4] Suite: org.apache.solr.search.TestAddFieldRealTimeGet
   [smoker]    [junit4] Completed on J0 in 0.96s, 1 test
   [smoker]    [junit4] 
   [smoker]    [junit4] Suite: org.apache.solr.search.TestCollapseQParserPlugin
   [smoker]    [junit4] Completed on J0 in 1.82s, 2 tests
   [smoker]    [junit4] 
   [smoker]    [junit4] Suite: org.apache.solr.search.TestComplexPhraseQParserPlugin
   [smoker]    [junit4] Completed on J0 in 2.72s, 6 tests
   [smoker]    [junit4] 
   [smoker]    [junit4] Suite: org.apache.solr.rest.schema.analysis.TestManagedStopFilterFactory
   [smoker]    [junit4] Completed on J3 in 16.04s, 2 tests
   [smoker]    [junit4] 
   [smoker]    [junit4] Suite: org.apache.solr.search.TestFieldSortValues
   [smoker]    [junit4] Completed on J0 in 1.99s, 1 test
   [smoker]    [junit4] 
   [smoker]    [junit4] Suite: org.apache.solr.search.TestInitQParser
   [smoker]    [junit4] Completed on J3 in 1.73s, 1 test
   [smoker]    [junit4] 
   [smoker]    [junit4] Suite: org.apache.solr.search.TestNoOpRegenerator
   [smoker]    [junit4] Completed on J0 in 0.74s, 1 test
   [smoker]    [junit4] 
   [smoker]    [junit4] Suite: org.apache.solr.search.TestRecoveryHdfs
   [smoker]    [junit4] Completed on J0 in 0.04s, 10 tests, 10 skipped
   [smoker]    [junit4] 
   [smoker]    [junit4] Suite: org.apache.solr.search.TestOverriddenPrefixQueryForCustomFieldType
   [smoker]    [junit4] Completed on J3 in 0.85s, 2 tests
   [smoker]    [junit4] 
   [smoker]    [junit4] Suite: org.apache.solr.search.TestSimpleQParserPlugin
   [smoker]    [junit4] Completed on J0 in 0.83s, 16 tests
   [smoker]    [junit4] 
   [smoker]    [junit4] Suite: org.apache.solr.search.TestStandardQParsers
   [smoker]    [junit4] Completed on J0 in 0.02s, 1 test
   [smoker]    [junit4] 
   [smoker]    [junit4] Suite: org.apache.solr.search.function.TestOrdValues
   [smoker]    [junit4] Completed on J0 in 0.43s, 5 tests
   [smoker]    [junit4] 
   [smoker]    [junit4] Suite: org.apache.solr.search.TestSolr4Spatial2
   [smoker]    [junit4] Completed on J3 in 1.22s, 2 tests
   [smoker]    [junit4] 
   [smoker]    [junit4] Suite: org.apache.solr.spelling.suggest.TestBlendedInfixSuggestions
   [smoker]    [junit4] Completed on J3 in 1.19s, 3 tests
   [smoker]    [junit4] 
   [smoker]    [junit4] Suite: org.apache.solr.search.join.BJQParserTest
   [smoker]    [junit4] Completed on J0 in 1.93s, 9 tests
   [smoker]    [junit4] 
   [smoker]    [junit4] Suite: org.apache.solr.spelling.suggest.TestFreeTextSuggestions
   [smoker]    [junit4] Completed on J3 in 0.61s, 1 test
   [smoker]    [junit4] 
   [smoker]    [junit4] Suite: org.apache.solr.store.blockcache.BlockCacheTest
   [smoker]    [junit4] Completed on J0 in 0.88s, 2 tests
   [smoker]    [junit4] 
   [smoker]    [junit4] Suite: org.apache.solr.store.hdfs.HdfsDirectoryTest
   [smoker]    [junit4] Completed on J0 in 0.04s, 4 tests, 4 skipped
   [smoker]    [junit4] 
   [smoker]    [junit4] Suite: org.apache.solr.update.AddBlockUpdateTest
   [smoker]    [junit4] Completed on J0 in 2.37s, 6 tests
   [smoker]    [junit4] 
   [smoker]    [junit4] Suite: org.apache.solr.update.TestExceedMaxTermLength
   [smoker]    [junit4] Completed on J0 in 1.04s, 2 tests
   [smoker]    [junit4] 
   [smoker]    [junit4] Suite: org.apache.solr.search.AnalyticsMergeStrategyTest
   [smoker]    [junit4] Completed on J2 in 26.00s, 1 test
   [smoker]    [junit4] 
   [smoker]    [junit4] Suite: org.apache.solr.update.processor.PreAnalyzedUpdateProcessorTest
   [smoker]    [junit4] Completed on J0 in 4.30s, 2 tests
   [smoker]    [junit4] 
   [smoker]    [junit4] Suite: org.apache.solr.store.blockcache.BlockDirectoryTest
   [smoker]    [junit4] Completed on J3 in 9.79s, 4 tests
   [smoker]    [junit4] 
   [smoker]    [junit4] Suite: org.apache.solr.update.processor.UUIDUpdateProcessorFallbackTest
   [smoker]    [junit4] Completed on J2 in 2.62s, 1 test
   [smoker]    [junit4] 
   [smoker]    [junit4] Suite: org.apache.solr.rest.schema.TestManagedSchemaDynamicFieldResource
   [smoker]    [junit4] Completed on J1 in 67.42s, 10 tests
   [smoker]    [junit4] 
   [smoker]    [junit4] 
   [smoker]    [junit4] Tests with failures:
   [smoker]    [junit4]   - org.apache.solr.highlight.HighlighterTest.testTwoFieldHighlight
   [smoker]    [junit4]   - org.apache.solr.highlight.HighlighterTest.testTermVecHighlight
   [smoker]    [junit4]   - org.apache.solr.highlight.HighlighterTest.testTermVecMultiValuedHighlight2
   [smoker]    [junit4]   - org.apache.solr.highlight.HighlighterTest.testSubwordWildcardHighlightWithTermOffsets2
   [smoker]    [junit4]   - org.apache.solr.highlight.HighlighterTest.testDisMaxHighlight
   [smoker]    [junit4]   - org.apache.solr.highlight.HighlighterTest.testVariableFragsize
   [smoker]    [junit4]   - org.apache.solr.highlight.HighlighterTest.testSubwordWildcardHighlightWithTermOffsets
   [smoker]    [junit4]   - org.apache.solr.highlight.HighlighterTest.testLongFragment
   [smoker]    [junit4]   - org.apache.solr.highlight.HighlighterTest.testTermVecMultiValuedHighlight
   [smoker]    [junit4] 
   [smoker]    [junit4] 
   [smoker]    [junit4] JVM J0:     2.60 ..   558.19 =   555.59s
   [smoker]    [junit4] JVM J1:     3.09 ..   577.00 =   573.91s
   [smoker]    [junit4] JVM J2:     2.60 ..   560.73 =   558.13s
   [smoker]    [junit4] JVM J3:     2.61 ..   558.66 =   556.05s
   [smoker]    [junit4] Execution time total: 9 minutes 37 seconds
   [smoker]    [junit4] Tests summary: 450 suites, 1841 tests, 9 errors, 182 ignored (146 assumptions)
   [smoker] 
   [smoker] BUILD FAILED
   [smoker] /usr/home/jenkins/jenkins-slave/workspace/Lucene-Solr-SmokeRelease-5.x/lucene/build/smokeTestRelease/tmp/unpack/solr-5.0.0/solr/build.xml:189: The following error occurred while executing this line:
   [smoker] /usr/home/jenkins/jenkins-slave/workspace/Lucene-Solr-SmokeRelease-5.x/lucene/build/smokeTestRelease/tmp/unpack/solr-5.0.0/solr/common-build.xml:508: The following error occurred while executing this line:
   [smoker] /usr/home/jenkins/jenkins-slave/workspace/Lucene-Solr-SmokeRelease-5.x/lucene/build/smokeTestRelease/tmp/unpack/solr-5.0.0/lucene/common-build.xml:1363: The following error occurred while executing this line:
   [smoker] /usr/home/jenkins/jenkins-slave/workspace/Lucene-Solr-SmokeRelease-5.x/lucene/build/smokeTestRelease/tmp/unpack/solr-5.0.0/lucene/common-build.xml:970: There were test failures: 450 suites, 1841 tests, 9 errors, 182 ignored (146 assumptions)
   [smoker] 
   [smoker] Total time: 10 minutes 10 seconds
   [smoker] 
   [smoker] 
   [smoker] Traceback (most recent call last):
   [smoker]   File "/usr/home/jenkins/jenkins-slave/workspace/Lucene-Solr-SmokeRelease-5.x/dev-tools/scripts/smokeTestRelease.py", line 1527, in <module>
   [smoker]     main()
   [smoker]   File "/usr/home/jenkins/jenkins-slave/workspace/Lucene-Solr-SmokeRelease-5.x/dev-tools/scripts/smokeTestRelease.py", line 1472, in main
   [smoker]     smokeTest(c.java, c.url, c.revision, c.version, c.tmp_dir, c.is_signed, ' '.join(c.test_args))
   [smoker]   File "/usr/home/jenkins/jenkins-slave/workspace/Lucene-Solr-SmokeRelease-5.x/dev-tools/scripts/smokeTestRelease.py", line 1517, in smokeTest
   [smoker]     unpackAndVerify(java, 'solr', tmpDir, 'solr-%s-src.tgz' % version, svnRevision, version, testArgs, baseURL)
   [smoker]   File "/usr/home/jenkins/jenkins-slave/workspace/Lucene-Solr-SmokeRelease-5.x/dev-tools/scripts/smokeTestRelease.py", line 616, in unpackAndVerify
   [smoker]     verifyUnpacked(java, project, artifact, unpackPath, svnRevision, version, testArgs, tmpDir, baseURL)
   [smoker]   File "/usr/home/jenkins/jenkins-slave/workspace/Lucene-Solr-SmokeRelease-5.x/dev-tools/scripts/smokeTestRelease.py", line 734, in verifyUnpacked
   [smoker]     java.run_java7('ant clean test -Dtests.slow=false %s' % testArgs, '%s/test.log' % unpackPath)
   [smoker]   File "/usr/home/jenkins/jenkins-slave/workspace/Lucene-Solr-SmokeRelease-5.x/dev-tools/scripts/smokeTestRelease.py", line 1303, in run_java
   [smoker]     run('%s; %s' % (cmd_prefix, cmd), logfile)
   [smoker]   File "/usr/home/jenkins/jenkins-slave/workspace/Lucene-Solr-SmokeRelease-5.x/dev-tools/scripts/smokeTestRelease.py", line 541, in run
   [smoker]     raise RuntimeError('command "%s" failed; see log file %s' % (command, logPath))
   [smoker] RuntimeError: command "export JAVA_HOME="/home/jenkins/tools/java/latest1.7" PATH="/home/jenkins/tools/java/latest1.7/bin:$PATH" JAVACMD="/home/jenkins/tools/java/latest1.7/bin/java"; ant clean test -Dtests.slow=false -Dtests.jettyConnector=Socket -Dtests.multiplier=1 -Dtests.slow=false" failed; see log file /usr/home/jenkins/jenkins-slave/workspace/Lucene-Solr-SmokeRelease-5.x/lucene/build/smokeTestRelease/tmp/unpack/solr-5.0.0/test.log

BUILD FAILED
/usr/home/jenkins/jenkins-slave/workspace/Lucene-Solr-SmokeRelease-5.x/build.xml:410: exec returned: 1

Total time: 63 minutes 25 seconds
Build step 'Invoke Ant' marked build as failure
Email was triggered for: Failure
Sending email for trigger: Failure



Mime
View raw message