lucene-dev mailing list archives

Site index · List index
Message view « Date » · « Thread »
Top « Date » · « Thread »
From Apache Jenkins Server <jenk...@builds.apache.org>
Subject [JENKINS] Lucene-Solr-NightlyTests-5.x - Build # 717 - Failure
Date Mon, 29 Dec 2014 03:57:49 GMT
Build: https://builds.apache.org/job/Lucene-Solr-NightlyTests-5.x/717/

1 tests failed.
REGRESSION:  org.apache.solr.cloud.CollectionsAPIDistributedZkTest.testDistribSearch

Error Message:
Error from server at http://127.0.0.1:54363: Error CREATEing SolrCore 'halfcollection_shard1_replica1': Unable to create core [halfcollection_shard1_replica1] Caused by: Could not get shard id for core: halfcollection_shard1_replica1

Stack Trace:
org.apache.solr.client.solrj.impl.HttpSolrServer$RemoteSolrException: Error from server at http://127.0.0.1:54363: Error CREATEing SolrCore 'halfcollection_shard1_replica1': Unable to create core [halfcollection_shard1_replica1] Caused by: Could not get shard id for core: halfcollection_shard1_replica1
	at org.apache.solr.client.solrj.impl.HttpSolrServer.executeMethod(HttpSolrServer.java:566)
	at org.apache.solr.client.solrj.impl.HttpSolrServer.request(HttpSolrServer.java:213)
	at org.apache.solr.client.solrj.impl.HttpSolrServer.request(HttpSolrServer.java:209)
	at org.apache.solr.cloud.CollectionsAPIDistributedZkTest.testErrorHandling(CollectionsAPIDistributedZkTest.java:452)
	at org.apache.solr.cloud.CollectionsAPIDistributedZkTest.doTest(CollectionsAPIDistributedZkTest.java:201)
	at org.apache.solr.BaseDistributedSearchTestCase.testDistribSearch(BaseDistributedSearchTestCase.java:869)
	at sun.reflect.NativeMethodAccessorImpl.invoke0(Native Method)
	at sun.reflect.NativeMethodAccessorImpl.invoke(NativeMethodAccessorImpl.java:57)
	at sun.reflect.DelegatingMethodAccessorImpl.invoke(DelegatingMethodAccessorImpl.java:43)
	at java.lang.reflect.Method.invoke(Method.java:606)
	at com.carrotsearch.randomizedtesting.RandomizedRunner.invoke(RandomizedRunner.java:1618)
	at com.carrotsearch.randomizedtesting.RandomizedRunner$6.evaluate(RandomizedRunner.java:827)
	at com.carrotsearch.randomizedtesting.RandomizedRunner$7.evaluate(RandomizedRunner.java:863)
	at com.carrotsearch.randomizedtesting.RandomizedRunner$8.evaluate(RandomizedRunner.java:877)
	at com.carrotsearch.randomizedtesting.rules.SystemPropertiesRestoreRule$1.evaluate(SystemPropertiesRestoreRule.java:53)
	at org.apache.lucene.util.TestRuleSetupTeardownChained$1.evaluate(TestRuleSetupTeardownChained.java:50)
	at org.apache.lucene.util.AbstractBeforeAfterRule$1.evaluate(AbstractBeforeAfterRule.java:46)
	at com.carrotsearch.randomizedtesting.rules.SystemPropertiesInvariantRule$1.evaluate(SystemPropertiesInvariantRule.java:55)
	at org.apache.lucene.util.TestRuleThreadAndTestName$1.evaluate(TestRuleThreadAndTestName.java:49)
	at org.apache.lucene.util.TestRuleIgnoreAfterMaxFailures$1.evaluate(TestRuleIgnoreAfterMaxFailures.java:65)
	at org.apache.lucene.util.TestRuleMarkFailure$1.evaluate(TestRuleMarkFailure.java:48)
	at com.carrotsearch.randomizedtesting.rules.StatementAdapter.evaluate(StatementAdapter.java:36)
	at com.carrotsearch.randomizedtesting.ThreadLeakControl$StatementRunner.run(ThreadLeakControl.java:365)
	at com.carrotsearch.randomizedtesting.ThreadLeakControl.forkTimeoutingTask(ThreadLeakControl.java:798)
	at com.carrotsearch.randomizedtesting.ThreadLeakControl$3.evaluate(ThreadLeakControl.java:458)
	at com.carrotsearch.randomizedtesting.RandomizedRunner.runSingleTest(RandomizedRunner.java:836)
	at com.carrotsearch.randomizedtesting.RandomizedRunner$3.evaluate(RandomizedRunner.java:738)
	at com.carrotsearch.randomizedtesting.RandomizedRunner$4.evaluate(RandomizedRunner.java:772)
	at com.carrotsearch.randomizedtesting.RandomizedRunner$5.evaluate(RandomizedRunner.java:783)
	at com.carrotsearch.randomizedtesting.rules.StatementAdapter.evaluate(StatementAdapter.java:36)
	at com.carrotsearch.randomizedtesting.rules.SystemPropertiesRestoreRule$1.evaluate(SystemPropertiesRestoreRule.java:53)
	at org.apache.lucene.util.AbstractBeforeAfterRule$1.evaluate(AbstractBeforeAfterRule.java:46)
	at org.apache.lucene.util.TestRuleStoreClassName$1.evaluate(TestRuleStoreClassName.java:42)
	at com.carrotsearch.randomizedtesting.rules.SystemPropertiesInvariantRule$1.evaluate(SystemPropertiesInvariantRule.java:55)
	at com.carrotsearch.randomizedtesting.rules.NoShadowingOrOverridesOnMethodsRule$1.evaluate(NoShadowingOrOverridesOnMethodsRule.java:39)
	at com.carrotsearch.randomizedtesting.rules.NoShadowingOrOverridesOnMethodsRule$1.evaluate(NoShadowingOrOverridesOnMethodsRule.java:39)
	at com.carrotsearch.randomizedtesting.rules.StatementAdapter.evaluate(StatementAdapter.java:36)
	at com.carrotsearch.randomizedtesting.rules.StatementAdapter.evaluate(StatementAdapter.java:36)
	at com.carrotsearch.randomizedtesting.rules.StatementAdapter.evaluate(StatementAdapter.java:36)
	at org.apache.lucene.util.TestRuleAssertionsRequired$1.evaluate(TestRuleAssertionsRequired.java:54)
	at org.apache.lucene.util.TestRuleMarkFailure$1.evaluate(TestRuleMarkFailure.java:48)
	at org.apache.lucene.util.TestRuleIgnoreAfterMaxFailures$1.evaluate(TestRuleIgnoreAfterMaxFailures.java:65)
	at org.apache.lucene.util.TestRuleIgnoreTestSuites$1.evaluate(TestRuleIgnoreTestSuites.java:55)
	at com.carrotsearch.randomizedtesting.rules.StatementAdapter.evaluate(StatementAdapter.java:36)
	at com.carrotsearch.randomizedtesting.ThreadLeakControl$StatementRunner.run(ThreadLeakControl.java:365)
	at java.lang.Thread.run(Thread.java:745)




Build Log:
[...truncated 10173 lines...]
   [junit4] Suite: org.apache.solr.cloud.CollectionsAPIDistributedZkTest
   [junit4]   2> Creating dataDir: /usr/home/jenkins/jenkins-slave/workspace/Lucene-Solr-NightlyTests-5.x/solr/build/solr-core/test/J3/temp/solr.cloud.CollectionsAPIDistributedZkTest-9A497961AA667343-001/init-core-data-001
   [junit4]   2> 998245 T3707 oas.SolrTestCaseJ4.buildSSLConfig Randomized ssl (false) and clientAuth (false)
   [junit4]   2> 998246 T3707 oas.BaseDistributedSearchTestCase.initHostContext Setting hostContext system property: /
   [junit4]   2> 998252 T3707 oas.SolrTestCaseJ4.setUp ###Starting testDistribSearch
   [junit4]   2> 998253 T3707 oasc.ZkTestServer.run STARTING ZK TEST SERVER
   [junit4]   1> client port:0.0.0.0/0.0.0.0:0
   [junit4]   2> 998254 T3708 oasc.ZkTestServer$ZKServerMain.runFromConfig Starting server
   [junit4]   2> 998354 T3707 oasc.ZkTestServer.run start zk server on port:36713
   [junit4]   2> 998355 T3707 oascc.SolrZkClient.createZkCredentialsToAddAutomatically Using default ZkCredentialsProvider
   [junit4]   2> 998356 T3707 oascc.ConnectionManager.waitForConnected Waiting for client to connect to ZooKeeper
   [junit4]   2> 998360 T3715 oascc.ConnectionManager.process Watcher org.apache.solr.common.cloud.ConnectionManager@5dbfa9a1 name:ZooKeeperConnection Watcher:127.0.0.1:36713 got event WatchedEvent state:SyncConnected type:None path:null path:null type:None
   [junit4]   2> 998360 T3707 oascc.ConnectionManager.waitForConnected Client is connected to ZooKeeper
   [junit4]   2> 998360 T3707 oascc.SolrZkClient.createZkACLProvider Using default ZkACLProvider
   [junit4]   2> 998361 T3707 oascc.SolrZkClient.makePath makePath: /solr
   [junit4]   2> 998363 T3707 oascc.SolrZkClient.createZkCredentialsToAddAutomatically Using default ZkCredentialsProvider
   [junit4]   2> 998364 T3707 oascc.ConnectionManager.waitForConnected Waiting for client to connect to ZooKeeper
   [junit4]   2> 998365 T3718 oascc.ConnectionManager.process Watcher org.apache.solr.common.cloud.ConnectionManager@507a3331 name:ZooKeeperConnection Watcher:127.0.0.1:36713/solr got event WatchedEvent state:SyncConnected type:None path:null path:null type:None
   [junit4]   2> 998366 T3707 oascc.ConnectionManager.waitForConnected Client is connected to ZooKeeper
   [junit4]   2> 998366 T3707 oascc.SolrZkClient.createZkACLProvider Using default ZkACLProvider
   [junit4]   2> 998366 T3707 oascc.SolrZkClient.makePath makePath: /collections/collection1
   [junit4]   2> 998368 T3707 oascc.SolrZkClient.makePath makePath: /collections/collection1/shards
   [junit4]   2> 998370 T3707 oascc.SolrZkClient.makePath makePath: /collections/control_collection
   [junit4]   2> 998371 T3707 oascc.SolrZkClient.makePath makePath: /collections/control_collection/shards
   [junit4]   2> 998373 T3707 oasc.AbstractZkTestCase.putConfig put /usr/home/jenkins/jenkins-slave/workspace/Lucene-Solr-NightlyTests-5.x/solr/core/src/test-files/solr/collection1/conf/solrconfig-tlog.xml to /configs/conf1/solrconfig.xml
   [junit4]   2> 998374 T3707 oascc.SolrZkClient.makePath makePath: /configs/conf1/solrconfig.xml
   [junit4]   2> 998376 T3707 oasc.AbstractZkTestCase.putConfig put /usr/home/jenkins/jenkins-slave/workspace/Lucene-Solr-NightlyTests-5.x/solr/core/src/test-files/solr/collection1/conf/schema.xml to /configs/conf1/schema.xml
   [junit4]   2> 998377 T3707 oascc.SolrZkClient.makePath makePath: /configs/conf1/schema.xml
   [junit4]   2> 998479 T3707 oasc.AbstractZkTestCase.putConfig put /usr/home/jenkins/jenkins-slave/workspace/Lucene-Solr-NightlyTests-5.x/solr/core/src/test-files/solr/collection1/conf/solrconfig.snippet.randomindexconfig.xml to /configs/conf1/solrconfig.snippet.randomindexconfig.xml
   [junit4]   2> 998480 T3707 oascc.SolrZkClient.makePath makePath: /configs/conf1/solrconfig.snippet.randomindexconfig.xml
   [junit4]   2> 998482 T3707 oasc.AbstractZkTestCase.putConfig put /usr/home/jenkins/jenkins-slave/workspace/Lucene-Solr-NightlyTests-5.x/solr/core/src/test-files/solr/collection1/conf/stopwords.txt to /configs/conf1/stopwords.txt
   [junit4]   2> 998483 T3707 oascc.SolrZkClient.makePath makePath: /configs/conf1/stopwords.txt
   [junit4]   2> 998484 T3707 oasc.AbstractZkTestCase.putConfig put /usr/home/jenkins/jenkins-slave/workspace/Lucene-Solr-NightlyTests-5.x/solr/core/src/test-files/solr/collection1/conf/protwords.txt to /configs/conf1/protwords.txt
   [junit4]   2> 998485 T3707 oascc.SolrZkClient.makePath makePath: /configs/conf1/protwords.txt
   [junit4]   2> 998487 T3707 oasc.AbstractZkTestCase.putConfig put /usr/home/jenkins/jenkins-slave/workspace/Lucene-Solr-NightlyTests-5.x/solr/core/src/test-files/solr/collection1/conf/currency.xml to /configs/conf1/currency.xml
   [junit4]   2> 998487 T3707 oascc.SolrZkClient.makePath makePath: /configs/conf1/currency.xml
   [junit4]   2> 998489 T3707 oasc.AbstractZkTestCase.putConfig put /usr/home/jenkins/jenkins-slave/workspace/Lucene-Solr-NightlyTests-5.x/solr/core/src/test-files/solr/collection1/conf/enumsConfig.xml to /configs/conf1/enumsConfig.xml
   [junit4]   2> 998490 T3707 oascc.SolrZkClient.makePath makePath: /configs/conf1/enumsConfig.xml
   [junit4]   2> 998491 T3707 oasc.AbstractZkTestCase.putConfig put /usr/home/jenkins/jenkins-slave/workspace/Lucene-Solr-NightlyTests-5.x/solr/core/src/test-files/solr/collection1/conf/open-exchange-rates.json to /configs/conf1/open-exchange-rates.json
   [junit4]   2> 998492 T3707 oascc.SolrZkClient.makePath makePath: /configs/conf1/open-exchange-rates.json
   [junit4]   2> 998494 T3707 oasc.AbstractZkTestCase.putConfig put /usr/home/jenkins/jenkins-slave/workspace/Lucene-Solr-NightlyTests-5.x/solr/core/src/test-files/solr/collection1/conf/mapping-ISOLatin1Accent.txt to /configs/conf1/mapping-ISOLatin1Accent.txt
   [junit4]   2> 998494 T3707 oascc.SolrZkClient.makePath makePath: /configs/conf1/mapping-ISOLatin1Accent.txt
   [junit4]   2> 998496 T3707 oasc.AbstractZkTestCase.putConfig put /usr/home/jenkins/jenkins-slave/workspace/Lucene-Solr-NightlyTests-5.x/solr/core/src/test-files/solr/collection1/conf/old_synonyms.txt to /configs/conf1/old_synonyms.txt
   [junit4]   2> 998497 T3707 oascc.SolrZkClient.makePath makePath: /configs/conf1/old_synonyms.txt
   [junit4]   2> 998498 T3707 oasc.AbstractZkTestCase.putConfig put /usr/home/jenkins/jenkins-slave/workspace/Lucene-Solr-NightlyTests-5.x/solr/core/src/test-files/solr/collection1/conf/synonyms.txt to /configs/conf1/synonyms.txt
   [junit4]   2> 998499 T3707 oascc.SolrZkClient.makePath makePath: /configs/conf1/synonyms.txt
   [junit4]   2> Using new style solr.xml
   [junit4]   2> 999703 T3707 oejs.Server.doStart jetty-8.1.10.v20130312
   [junit4]   2> 999708 T3707 oejs.AbstractConnector.doStart Started SocketConnector@127.0.0.1:41116
   [junit4]   2> 999708 T3707 oass.SolrDispatchFilter.init SolrDispatchFilter.init()sun.misc.Launcher$AppClassLoader@3c56b64c
   [junit4]   2> 999708 T3707 oasc.SolrResourceLoader.locateSolrHome JNDI not configured for solr (NoInitialContextEx)
   [junit4]   2> 999709 T3707 oasc.SolrResourceLoader.locateSolrHome using system property solr.solr.home: /usr/home/jenkins/jenkins-slave/workspace/Lucene-Solr-NightlyTests-5.x/solr/build/solr-core/test/J3/temp/solr.cloud.CollectionsAPIDistributedZkTest-9A497961AA667343-001/tempDir-002
   [junit4]   2> 999709 T3707 oasc.SolrResourceLoader.<init> new SolrResourceLoader for directory: '/usr/home/jenkins/jenkins-slave/workspace/Lucene-Solr-NightlyTests-5.x/solr/build/solr-core/test/J3/temp/solr.cloud.CollectionsAPIDistributedZkTest-9A497961AA667343-001/tempDir-002/'
   [junit4]   2> 999738 T3707 oasc.ConfigSolr.fromFile Loading container configuration from /usr/home/jenkins/jenkins-slave/workspace/Lucene-Solr-NightlyTests-5.x/solr/build/solr-core/test/J3/temp/solr.cloud.CollectionsAPIDistributedZkTest-9A497961AA667343-001/tempDir-002/solr.xml
   [junit4]   2> 999779 T3707 oasc.CorePropertiesLocator.<init> Config-defined core root directory: /usr/home/jenkins/jenkins-slave/workspace/Lucene-Solr-NightlyTests-5.x/solr/build/solr-core/test/J3/temp/solr.cloud.CollectionsAPIDistributedZkTest-9A497961AA667343-001/tempDir-002
   [junit4]   2> 999780 T3707 oasc.CoreContainer.<init> New CoreContainer 2029163648
   [junit4]   2> 999780 T3707 oasc.CoreContainer.load Loading cores into CoreContainer [instanceDir=/usr/home/jenkins/jenkins-slave/workspace/Lucene-Solr-NightlyTests-5.x/solr/build/solr-core/test/J3/temp/solr.cloud.CollectionsAPIDistributedZkTest-9A497961AA667343-001/tempDir-002/]
   [junit4]   2> 999781 T3707 oashc.HttpShardHandlerFactory.getParameter Setting socketTimeout to: 90000
   [junit4]   2> 999781 T3707 oashc.HttpShardHandlerFactory.getParameter Setting urlScheme to: 
   [junit4]   2> 999781 T3707 oashc.HttpShardHandlerFactory.getParameter Setting connTimeout to: 15000
   [junit4]   2> 999781 T3707 oashc.HttpShardHandlerFactory.getParameter Setting maxConnectionsPerHost to: 20
   [junit4]   2> 999782 T3707 oashc.HttpShardHandlerFactory.getParameter Setting maxConnections to: 10000
   [junit4]   2> 999782 T3707 oashc.HttpShardHandlerFactory.getParameter Setting corePoolSize to: 0
   [junit4]   2> 999782 T3707 oashc.HttpShardHandlerFactory.getParameter Setting maximumPoolSize to: 2147483647
   [junit4]   2> 999782 T3707 oashc.HttpShardHandlerFactory.getParameter Setting maxThreadIdleTime to: 5
   [junit4]   2> 999782 T3707 oashc.HttpShardHandlerFactory.getParameter Setting sizeOfQueue to: -1
   [junit4]   2> 999783 T3707 oashc.HttpShardHandlerFactory.getParameter Setting fairnessPolicy to: false
   [junit4]   2> 999783 T3707 oasu.UpdateShardHandler.<init> Creating UpdateShardHandler HTTP client with params: socketTimeout=340000&connTimeout=45000&retry=false
   [junit4]   2> 999783 T3707 oasl.LogWatcher.createWatcher SLF4J impl is org.slf4j.impl.Log4jLoggerFactory
   [junit4]   2> 999784 T3707 oasl.LogWatcher.newRegisteredLogWatcher Registering Log Listener [Log4j (org.slf4j.impl.Log4jLoggerFactory)]
   [junit4]   2> 999784 T3707 oasc.CoreContainer.load Host Name: 127.0.0.1
   [junit4]   2> 999784 T3707 oasc.ZkContainer.initZooKeeper Zookeeper client=127.0.0.1:36713/solr
   [junit4]   2> 999784 T3707 oasc.ZkController.checkChrootPath zkHost includes chroot
   [junit4]   2> 999785 T3707 oascc.SolrZkClient.createZkCredentialsToAddAutomatically Using default ZkCredentialsProvider
   [junit4]   2> 999785 T3707 oascc.ConnectionManager.waitForConnected Waiting for client to connect to ZooKeeper
   [junit4]   2> 999787 T3730 oascc.ConnectionManager.process Watcher org.apache.solr.common.cloud.ConnectionManager@499662ba name:ZooKeeperConnection Watcher:127.0.0.1:36713 got event WatchedEvent state:SyncConnected type:None path:null path:null type:None
   [junit4]   2> 999788 T3707 oascc.ConnectionManager.waitForConnected Client is connected to ZooKeeper
   [junit4]   2> 999788 T3707 oascc.SolrZkClient.createZkACLProvider Using default ZkACLProvider
   [junit4]   2> 999789 T3707 oascc.ConnectionManager.waitForConnected Waiting for client to connect to ZooKeeper
   [junit4]   2> 999790 T3733 oascc.ConnectionManager.process Watcher org.apache.solr.common.cloud.ConnectionManager@6fe71d67 name:ZooKeeperConnection Watcher:127.0.0.1:36713/solr got event WatchedEvent state:SyncConnected type:None path:null path:null type:None
   [junit4]   2> 999791 T3707 oascc.ConnectionManager.waitForConnected Client is connected to ZooKeeper
   [junit4]   2> 999792 T3707 oascc.SolrZkClient.makePath makePath: /overseer/queue
   [junit4]   2> 999794 T3707 oascc.SolrZkClient.makePath makePath: /overseer/collection-queue-work
   [junit4]   2> 999796 T3707 oascc.SolrZkClient.makePath makePath: /overseer/collection-map-running
   [junit4]   2> 999798 T3707 oascc.SolrZkClient.makePath makePath: /overseer/collection-map-completed
   [junit4]   2> 999800 T3707 oascc.SolrZkClient.makePath makePath: /overseer/collection-map-failure
   [junit4]   2> 999802 T3707 oascc.SolrZkClient.makePath makePath: /live_nodes
   [junit4]   2> 999803 T3707 oasc.ZkController.createEphemeralLiveNode Register node as live in ZooKeeper:/live_nodes/127.0.0.1:41116_
   [junit4]   2> 999803 T3707 oascc.SolrZkClient.makePath makePath: /live_nodes/127.0.0.1:41116_
   [junit4]   2> 999805 T3707 oascc.SolrZkClient.makePath makePath: /overseer_elect
   [junit4]   2> 999807 T3707 oascc.SolrZkClient.makePath makePath: /overseer_elect/election
   [junit4]   2> 999808 T3707 oasc.Overseer.close Overseer (id=null) closing
   [junit4]   2> 999809 T3707 oasc.OverseerElectionContext.runLeaderProcess I am going to be the leader 127.0.0.1:41116_
   [junit4]   2> 999810 T3707 oascc.SolrZkClient.makePath makePath: /overseer_elect/leader
   [junit4]   2> 999811 T3707 oasc.Overseer.start Overseer (id=93049332006387715-127.0.0.1:41116_-n_0000000000) starting
   [junit4]   2> 999813 T3707 oascc.SolrZkClient.makePath makePath: /overseer/queue-work
   [junit4]   2> 999819 T3707 oasc.OverseerAutoReplicaFailoverThread.<init> Starting OverseerAutoReplicaFailoverThread autoReplicaFailoverWorkLoopDelay=10000 autoReplicaFailoverWaitAfterExpiration=10000 autoReplicaFailoverBadNodeExpiration=60000
   [junit4]   2> 999820 T3735 oasc.OverseerCollectionProcessor.run Process current queue of collection creations
   [junit4]   2> 999820 T3707 oascc.SolrZkClient.makePath makePath: /clusterstate.json
   [junit4]   2> 999822 T3707 oascc.SolrZkClient.makePath makePath: /aliases.json
   [junit4]   2> 999823 T3707 oascc.ZkStateReader.createClusterStateWatchersAndUpdate Updating cluster state from ZooKeeper... 
   [junit4]   2> 999826 T3734 oasc.Overseer$ClusterStateUpdater.run Starting to work on the main queue
   [junit4]   2> 999828 T3707 oasc.CorePropertiesLocator.discover Looking for core definitions underneath /usr/home/jenkins/jenkins-slave/workspace/Lucene-Solr-NightlyTests-5.x/solr/build/solr-core/test/J3/temp/solr.cloud.CollectionsAPIDistributedZkTest-9A497961AA667343-001/tempDir-002
   [junit4]   2> 1000987 T3707 oasc.CorePropertiesLocator.discoverUnder Found core conf in /usr/home/jenkins/jenkins-slave/workspace/Lucene-Solr-NightlyTests-5.x/solr/build/solr-core/test/J3/temp/solr.cloud.CollectionsAPIDistributedZkTest-9A497961AA667343-001/tempDir-002/conf/
   [junit4]   2> 1001062 T3707 oasc.CorePropertiesLocator.discover Found 1 core definitions
   [junit4]   2> 1001063 T3707 oass.SolrDispatchFilter.init user.dir=/usr/home/jenkins/jenkins-slave/workspace/Lucene-Solr-NightlyTests-5.x/solr/build/solr-core/test/J3
   [junit4]   2> 1001063 T3707 oass.SolrDispatchFilter.init SolrDispatchFilter.init() done
   [junit4]   2> 1001064 T3707 oascc.SolrZkClient.createZkCredentialsToAddAutomatically Using default ZkCredentialsProvider
   [junit4]   2> 1001065 T3707 oascc.ConnectionManager.waitForConnected Waiting for client to connect to ZooKeeper
   [junit4]   2> 1001066 T3740 oascc.ConnectionManager.process Watcher org.apache.solr.common.cloud.ConnectionManager@64980060 name:ZooKeeperConnection Watcher:127.0.0.1:36713/solr got event WatchedEvent state:SyncConnected type:None path:null path:null type:None
   [junit4]   2> 1001066 T3707 oascc.ConnectionManager.waitForConnected Client is connected to ZooKeeper
   [junit4]   2> 1001066 T3707 oascc.SolrZkClient.createZkACLProvider Using default ZkACLProvider
   [junit4]   2> 1001067 T3707 oascc.ZkStateReader.createClusterStateWatchersAndUpdate Updating cluster state from ZooKeeper... 
   [junit4]   2> 1001069 T3707 oasc.ChaosMonkey.monkeyLog monkey: init - expire sessions:false cause connection loss:false
   [junit4]   2> 1001069 T3707 oasc.AbstractFullDistribZkTestBase.createJettys Creating collection1 with stateFormat=2
   [junit4]   2> 1001069 T3707 oascc.SolrZkClient.createZkCredentialsToAddAutomatically Using default ZkCredentialsProvider
   [junit4]   2> 1001069 T3707 oascc.ConnectionManager.waitForConnected Waiting for client to connect to ZooKeeper
   [junit4]   2> 1001071 T3743 oascc.ConnectionManager.process Watcher org.apache.solr.common.cloud.ConnectionManager@27cc1d1 name:ZooKeeperConnection Watcher:127.0.0.1:36713/solr got event WatchedEvent state:SyncConnected type:None path:null path:null type:None
   [junit4]   2> 1001071 T3707 oascc.ConnectionManager.waitForConnected Client is connected to ZooKeeper
   [junit4]   2> 1001071 T3707 oascc.SolrZkClient.createZkACLProvider Using default ZkACLProvider
   [junit4]   2> 1001072 T3733 oasc.DistributedQueue$LatchWatcher.process NodeChildrenChanged fired on path /overseer/queue state SyncConnected
   [junit4]   2> 1001074 T3734 oasc.Overseer$ClusterStateUpdater.run processMessage: queueSize: 0, message = {
   [junit4]   2> 	  "operation":"create",
   [junit4]   2> 	  "name":"collection1",
   [junit4]   2> 	  "numShards":"2",
   [junit4]   2> 	  "stateFormat":2} current state version: 0
   [junit4]   2> 1001074 T3734 oasco.ClusterStateMutator.createCollection building a new cName: collection1
   [junit4]   2> 1001075 T3734 oasco.ZkStateWriter.writePendingUpdates going to create_collection /collections/collection1/state.json
   [junit4]   2> 1001076 T3733 oascc.ZkStateReader$2.process A cluster state change: WatchedEvent state:SyncConnected type:NodeDataChanged path:/clusterstate.json, has occurred - updating... (live nodes size: 1)
   [junit4]   2> 1001076 T3740 oascc.ZkStateReader$2.process A cluster state change: WatchedEvent state:SyncConnected type:NodeDataChanged path:/clusterstate.json, has occurred - updating... (live nodes size: 1)
   [junit4]   2> 1002387 T3707 oasc.AbstractFullDistribZkTestBase.createJettys create jetty 1
   [junit4]   2> 1002388 T3707 oejs.Server.doStart jetty-8.1.10.v20130312
   [junit4]   2> 1002390 T3707 oejs.AbstractConnector.doStart Started SocketConnector@127.0.0.1:54363
   [junit4]   2> 1002391 T3707 oass.SolrDispatchFilter.init SolrDispatchFilter.init()sun.misc.Launcher$AppClassLoader@3c56b64c
   [junit4]   2> 1002391 T3707 oasc.SolrResourceLoader.locateSolrHome JNDI not configured for solr (NoInitialContextEx)
   [junit4]   2> 1002392 T3707 oasc.SolrResourceLoader.locateSolrHome using system property solr.solr.home: /usr/home/jenkins/jenkins-slave/workspace/Lucene-Solr-NightlyTests-5.x/solr/build/solr-core/test/J3/temp/solr.cloud.CollectionsAPIDistributedZkTest-9A497961AA667343-001/tempDir-003
   [junit4]   2> 1002392 T3707 oasc.SolrResourceLoader.<init> new SolrResourceLoader for directory: '/usr/home/jenkins/jenkins-slave/workspace/Lucene-Solr-NightlyTests-5.x/solr/build/solr-core/test/J3/temp/solr.cloud.CollectionsAPIDistributedZkTest-9A497961AA667343-001/tempDir-003/'
   [junit4]   2> 1002427 T3707 oasc.ConfigSolr.fromFile Loading container configuration from /usr/home/jenkins/jenkins-slave/workspace/Lucene-Solr-NightlyTests-5.x/solr/build/solr-core/test/J3/temp/solr.cloud.CollectionsAPIDistributedZkTest-9A497961AA667343-001/tempDir-003/solr.xml
   [junit4]   2> 1002474 T3707 oasc.CorePropertiesLocator.<init> Config-defined core root directory: /usr/home/jenkins/jenkins-slave/workspace/Lucene-Solr-NightlyTests-5.x/solr/build/solr-core/test/J3/temp/solr.cloud.CollectionsAPIDistributedZkTest-9A497961AA667343-001/tempDir-003
   [junit4]   2> 1002475 T3707 oasc.CoreContainer.<init> New CoreContainer 1074993821
   [junit4]   2> 1002475 T3707 oasc.CoreContainer.load Loading cores into CoreContainer [instanceDir=/usr/home/jenkins/jenkins-slave/workspace/Lucene-Solr-NightlyTests-5.x/solr/build/solr-core/test/J3/temp/solr.cloud.CollectionsAPIDistributedZkTest-9A497961AA667343-001/tempDir-003/]
   [junit4]   2> 1002476 T3707 oashc.HttpShardHandlerFactory.getParameter Setting socketTimeout to: 90000
   [junit4]   2> 1002476 T3707 oashc.HttpShardHandlerFactory.getParameter Setting urlScheme to: 
   [junit4]   2> 1002476 T3707 oashc.HttpShardHandlerFactory.getParameter Setting connTimeout to: 15000
   [junit4]   2> 1002477 T3707 oashc.HttpShardHandlerFactory.getParameter Setting maxConnectionsPerHost to: 20
   [junit4]   2> 1002477 T3707 oashc.HttpShardHandlerFactory.getParameter Setting maxConnections to: 10000
   [junit4]   2> 1002477 T3707 oashc.HttpShardHandlerFactory.getParameter Setting corePoolSize to: 0
   [junit4]   2> 1002477 T3707 oashc.HttpShardHandlerFactory.getParameter Setting maximumPoolSize to: 2147483647
   [junit4]   2> 1002478 T3707 oashc.HttpShardHandlerFactory.getParameter Setting maxThreadIdleTime to: 5
   [junit4]   2> 1002478 T3707 oashc.HttpShardHandlerFactory.getParameter Setting sizeOfQueue to: -1
   [junit4]   2> 1002478 T3707 oashc.HttpShardHandlerFactory.getParameter Setting fairnessPolicy to: false
   [junit4]   2> 1002479 T3707 oasu.UpdateShardHandler.<init> Creating UpdateShardHandler HTTP client with params: socketTimeout=340000&connTimeout=45000&retry=false
   [junit4]   2> 1002479 T3707 oasl.LogWatcher.createWatcher SLF4J impl is org.slf4j.impl.Log4jLoggerFactory
   [junit4]   2> 1002479 T3707 oasl.LogWatcher.newRegisteredLogWatcher Registering Log Listener [Log4j (org.slf4j.impl.Log4jLoggerFactory)]
   [junit4]   2> 1002480 T3707 oasc.CoreContainer.load Host Name: 127.0.0.1
   [junit4]   2> 1002480 T3707 oasc.ZkContainer.initZooKeeper Zookeeper client=127.0.0.1:36713/solr
   [junit4]   2> 1002480 T3707 oasc.ZkController.checkChrootPath zkHost includes chroot
   [junit4]   2> 1002480 T3707 oascc.SolrZkClient.createZkCredentialsToAddAutomatically Using default ZkCredentialsProvider
   [junit4]   2> 1002481 T3707 oascc.ConnectionManager.waitForConnected Waiting for client to connect to ZooKeeper
   [junit4]   2> 1002483 T3755 oascc.ConnectionManager.process Watcher org.apache.solr.common.cloud.ConnectionManager@5235a513 name:ZooKeeperConnection Watcher:127.0.0.1:36713 got event WatchedEvent state:SyncConnected type:None path:null path:null type:None
   [junit4]   2> 1002484 T3707 oascc.ConnectionManager.waitForConnected Client is connected to ZooKeeper
   [junit4]   2> 1002484 T3707 oascc.SolrZkClient.createZkACLProvider Using default ZkACLProvider
   [junit4]   2> 1002486 T3707 oascc.ConnectionManager.waitForConnected Waiting for client to connect to ZooKeeper
   [junit4]   2> 1002487 T3758 oascc.ConnectionManager.process Watcher org.apache.solr.common.cloud.ConnectionManager@6467b724 name:ZooKeeperConnection Watcher:127.0.0.1:36713/solr got event WatchedEvent state:SyncConnected type:None path:null path:null type:None
   [junit4]   2> 1002487 T3707 oascc.ConnectionManager.waitForConnected Client is connected to ZooKeeper
   [junit4]   2> 1002491 T3707 oascc.ZkStateReader.createClusterStateWatchersAndUpdate Updating cluster state from ZooKeeper... 
   [junit4]   2> 1003495 T3707 oasc.ZkController.createEphemeralLiveNode Register node as live in ZooKeeper:/live_nodes/127.0.0.1:54363_
   [junit4]   2> 1003496 T3707 oascc.SolrZkClient.makePath makePath: /live_nodes/127.0.0.1:54363_
   [junit4]   2> 1003499 T3707 oasc.Overseer.close Overseer (id=null) closing
   [junit4]   2> 1003504 T3707 oasc.CorePropertiesLocator.discover Looking for core definitions underneath /usr/home/jenkins/jenkins-slave/workspace/Lucene-Solr-NightlyTests-5.x/solr/build/solr-core/test/J3/temp/solr.cloud.CollectionsAPIDistributedZkTest-9A497961AA667343-001/tempDir-003
   [junit4]   2> 1003543 T3707 oasc.CorePropertiesLocator.discoverUnder Found core conf in /usr/home/jenkins/jenkins-slave/workspace/Lucene-Solr-NightlyTests-5.x/solr/build/solr-core/test/J3/temp/solr.cloud.CollectionsAPIDistributedZkTest-9A497961AA667343-001/tempDir-003/conf/
   [junit4]   2> 1004514 T3707 oasc.CorePropertiesLocator.discover Found 1 core definitions
   [junit4]   2> 1004515 T3707 oass.SolrDispatchFilter.init user.dir=/usr/home/jenkins/jenkins-slave/workspace/Lucene-Solr-NightlyTests-5.x/solr/build/solr-core/test/J3
   [junit4]   2> 1004515 T3707 oass.SolrDispatchFilter.init SolrDispatchFilter.init() done
   [junit4]   2> 1005410 T3707 oasc.AbstractFullDistribZkTestBase.createJettys create jetty 2
   [junit4]   2> 1005411 T3707 oejs.Server.doStart jetty-8.1.10.v20130312
   [junit4]   2> 1005413 T3707 oejs.AbstractConnector.doStart Started SocketConnector@127.0.0.1:58247
   [junit4]   2> 1005414 T3707 oass.SolrDispatchFilter.init SolrDispatchFilter.init()sun.misc.Launcher$AppClassLoader@3c56b64c
   [junit4]   2> 1005414 T3707 oasc.SolrResourceLoader.locateSolrHome JNDI not configured for solr (NoInitialContextEx)
   [junit4]   2> 1005414 T3707 oasc.SolrResourceLoader.locateSolrHome using system property solr.solr.home: ../../../../../../../../../../../usr/home/jenkins/jenkins-slave/workspace/Lucene-Solr-NightlyTests-5.x/solr/build/solr-core/test/J3/temp/solr.cloud.CollectionsAPIDistributedZkTest-9A497961AA667343-001/tempDir-004
   [junit4]   2> 1005415 T3707 oasc.SolrResourceLoader.<init> new SolrResourceLoader for directory: '../../../../../../../../../../../usr/home/jenkins/jenkins-slave/workspace/Lucene-Solr-NightlyTests-5.x/solr/build/solr-core/test/J3/temp/solr.cloud.CollectionsAPIDistributedZkTest-9A497961AA667343-001/tempDir-004/'
   [junit4]   2> 1005444 T3707 oasc.ConfigSolr.fromFile Loading container configuration from /usr/home/jenkins/jenkins-slave/workspace/Lucene-Solr-NightlyTests-5.x/solr/build/solr-core/test/J3/../../../../../../../../../../../usr/home/jenkins/jenkins-slave/workspace/Lucene-Solr-NightlyTests-5.x/solr/build/solr-core/test/J3/temp/solr.cloud.CollectionsAPIDistributedZkTest-9A497961AA667343-001/tempDir-004/solr.xml
   [junit4]   2> 1005514 T3707 oasc.CorePropertiesLocator.<init> Config-defined core root directory: /usr/home/jenkins/jenkins-slave/workspace/Lucene-Solr-NightlyTests-5.x/solr/build/solr-core/test/J3/../../../../../../../../../../../usr/home/jenkins/jenkins-slave/workspace/Lucene-Solr-NightlyTests-5.x/solr/build/solr-core/test/J3/temp/solr.cloud.CollectionsAPIDistributedZkTest-9A497961AA667343-001/tempDir-004
   [junit4]   2> 1005514 T3707 oasc.CoreContainer.<init> New CoreContainer 1058489530
   [junit4]   2> 1005515 T3707 oasc.CoreContainer.load Loading cores into CoreContainer [instanceDir=../../../../../../../../../../../usr/home/jenkins/jenkins-slave/workspace/Lucene-Solr-NightlyTests-5.x/solr/build/solr-core/test/J3/temp/solr.cloud.CollectionsAPIDistributedZkTest-9A497961AA667343-001/tempDir-004/]
   [junit4]   2> 1005515 T3707 oashc.HttpShardHandlerFactory.getParameter Setting socketTimeout to: 90000
   [junit4]   2> 1005516 T3707 oashc.HttpShardHandlerFactory.getParameter Setting urlScheme to: 
   [junit4]   2> 1005516 T3707 oashc.HttpShardHandlerFactory.getParameter Setting connTimeout to: 15000
   [junit4]   2> 1005516 T3707 oashc.HttpShardHandlerFactory.getParameter Setting maxConnectionsPerHost to: 20
   [junit4]   2> 1005516 T3707 oashc.HttpShardHandlerFactory.getParameter Setting maxConnections to: 10000
   [junit4]   2> 1005517 T3707 oashc.HttpShardHandlerFactory.getParameter Setting corePoolSize to: 0
   [junit4]   2> 1005517 T3707 oashc.HttpShardHandlerFactory.getParameter Setting maximumPoolSize to: 2147483647
   [junit4]   2> 1005517 T3707 oashc.HttpShardHandlerFactory.getParameter Setting maxThreadIdleTime to: 5
   [junit4]   2> 1005517 T3707 oashc.HttpShardHandlerFactory.getParameter Setting sizeOfQueue to: -1
   [junit4]   2> 1005517 T3707 oashc.HttpShardHandlerFactory.getParameter Setting fairnessPolicy to: false
   [junit4]   2> 1005518 T3707 oasu.UpdateShardHandler.<init> Creating UpdateShardHandler HTTP client with params: socketTimeout=340000&connTimeout=45000&retry=false
   [junit4]   2> 1005518 T3707 oasl.LogWatcher.createWatcher SLF4J impl is org.slf4j.impl.Log4jLoggerFactory
   [junit4]   2> 1005519 T3707 oasl.LogWatcher.newRegisteredLogWatcher Registering Log Listener [Log4j (org.slf4j.impl.Log4jLoggerFactory)]
   [junit4]   2> 1005519 T3707 oasc.CoreContainer.load Host Name: 127.0.0.1
   [junit4]   2> 1005519 T3707 oasc.ZkContainer.initZooKeeper Zookeeper client=127.0.0.1:36713/solr
   [junit4]   2> 1005519 T3707 oasc.ZkController.checkChrootPath zkHost includes chroot
   [junit4]   2> 1005519 T3707 oascc.SolrZkClient.createZkCredentialsToAddAutomatically Using default ZkCredentialsProvider
   [junit4]   2> 1005520 T3707 oascc.ConnectionManager.waitForConnected Waiting for client to connect to ZooKeeper
   [junit4]   2> 1005522 T3771 oascc.ConnectionManager.process Watcher org.apache.solr.common.cloud.ConnectionManager@60cd49f5 name:ZooKeeperConnection Watcher:127.0.0.1:36713 got event WatchedEvent state:SyncConnected type:None path:null path:null type:None
   [junit4]   2> 1005523 T3707 oascc.ConnectionManager.waitForConnected Client is connected to ZooKeeper
   [junit4]   2> 1005523 T3707 oascc.SolrZkClient.createZkACLProvider Using default ZkACLProvider
   [junit4]   2> 1005525 T3707 oascc.ConnectionManager.waitForConnected Waiting for client to connect to ZooKeeper
   [junit4]   2> 1005526 T3774 oascc.ConnectionManager.process Watcher org.apache.solr.common.cloud.ConnectionManager@7072c8fb name:ZooKeeperConnection Watcher:127.0.0.1:36713/solr got event WatchedEvent state:SyncConnected type:None path:null path:null type:None
   [junit4]   2> 1005526 T3707 oascc.ConnectionManager.waitForConnected Client is connected to ZooKeeper
   [junit4]   2> 1005530 T3707 oascc.ZkStateReader.createClusterStateWatchersAndUpdate Updating cluster state from ZooKeeper... 
   [junit4]   2> 1006535 T3707 oasc.ZkController.createEphemeralLiveNode Register node as live in ZooKeeper:/live_nodes/127.0.0.1:58247_
   [junit4]   2> 1006536 T3707 oascc.SolrZkClient.makePath makePath: /live_nodes/127.0.0.1:58247_
   [junit4]   2> 1006539 T3707 oasc.Overseer.close Overseer (id=null) closing
   [junit4]   2> 1006543 T3707 oasc.CorePropertiesLocator.discover Looking for core definitions underneath /usr/home/jenkins/jenkins-slave/workspace/Lucene-Solr-NightlyTests-5.x/solr/build/solr-core/test/J3/../../../../../../../../../../../usr/home/jenkins/jenkins-slave/workspace/Lucene-Solr-NightlyTests-5.x/solr/build/solr-core/test/J3/temp/solr.cloud.CollectionsAPIDistributedZkTest-9A497961AA667343-001/tempDir-004
   [junit4]   2> 1007964 T3707 oasc.CorePropertiesLocator.discoverUnder Found core conf in /usr/home/jenkins/jenkins-slave/workspace/Lucene-Solr-NightlyTests-5.x/solr/build/solr-core/test/J3/../../../../../../../../../../../usr/home/jenkins/jenkins-slave/workspace/Lucene-Solr-NightlyTests-5.x/solr/build/solr-core/test/J3/temp/solr.cloud.CollectionsAPIDistributedZkTest-9A497961AA667343-001/tempDir-004/conf/
   [junit4]   2> 1008029 T3707 oasc.CorePropertiesLocator.discover Found 1 core definitions
   [junit4]   2> 1008030 T3707 oass.SolrDispatchFilter.init user.dir=/usr/home/jenkins/jenkins-slave/workspace/Lucene-Solr-NightlyTests-5.x/solr/build/solr-core/test/J3
   [junit4]   2> 1008030 T3707 oass.SolrDispatchFilter.init SolrDispatchFilter.init() done
   [junit4]   2> 1009404 T3707 oasc.AbstractFullDistribZkTestBase.createJettys create jetty 3
   [junit4]   2> 1009404 T3707 oejs.Server.doStart jetty-8.1.10.v20130312
   [junit4]   2> 1009407 T3707 oejs.AbstractConnector.doStart Started SocketConnector@127.0.0.1:53096
   [junit4]   2> 1009407 T3707 oass.SolrDispatchFilter.init SolrDispatchFilter.init()sun.misc.Launcher$AppClassLoader@3c56b64c
   [junit4]   2> 1009408 T3707 oasc.SolrResourceLoader.locateSolrHome JNDI not configured for solr (NoInitialContextEx)
   [junit4]   2> 1009408 T3707 oasc.SolrResourceLoader.locateSolrHome using system property solr.solr.home: ../../../../../../../../../../../usr/home/jenkins/jenkins-slave/workspace/Lucene-Solr-NightlyTests-5.x/solr/build/solr-core/test/J3/temp/solr.cloud.CollectionsAPIDistributedZkTest-9A497961AA667343-001/tempDir-005
   [junit4]   2> 1009408 T3707 oasc.SolrResourceLoader.<init> new SolrResourceLoader for directory: '../../../../../../../../../../../usr/home/jenkins/jenkins-slave/workspace/Lucene-Solr-NightlyTests-5.x/solr/build/solr-core/test/J3/temp/solr.cloud.CollectionsAPIDistributedZkTest-9A497961AA667343-001/tempDir-005/'
   [junit4]   2> 1009444 T3707 oasc.ConfigSolr.fromFile Loading container configuration from /usr/home/jenkins/jenkins-slave/workspace/Lucene-Solr-NightlyTests-5.x/solr/build/solr-core/test/J3/../../../../../../../../../../../usr/home/jenkins/jenkins-slave/workspace/Lucene-Solr-NightlyTests-5.x/solr/build/solr-core/test/J3/temp/solr.cloud.CollectionsAPIDistributedZkTest-9A497961AA667343-001/tempDir-005/solr.xml
   [junit4]   2> 1009496 T3707 oasc.CorePropertiesLocator.<init> Config-defined core root directory: /usr/home/jenkins/jenkins-slave/workspace/Lucene-Solr-NightlyTests-5.x/solr/build/solr-core/test/J3/../../../../../../../../../../../usr/home/jenkins/jenkins-slave/workspace/Lucene-Solr-NightlyTests-5.x/solr/build/solr-core/test/J3/temp/solr.cloud.CollectionsAPIDistributedZkTest-9A497961AA667343-001/tempDir-005
   [junit4]   2> 1009497 T3707 oasc.CoreContainer.<init> New CoreContainer 1820147627
   [junit4]   2> 1009497 T3707 oasc.CoreContainer.load Loading cores into CoreContainer [instanceDir=../../../../../../../../../../../usr/home/jenkins/jenkins-slave/workspace/Lucene-Solr-NightlyTests-5.x/solr/build/solr-core/test/J3/temp/solr.cloud.CollectionsAPIDistributedZkTest-9A497961AA667343-001/tempDir-005/]
   [junit4]   2> 1009498 T3707 oashc.HttpShardHandlerFactory.getParameter Setting socketTimeout to: 90000
   [junit4]   2> 1009498 T3707 oashc.HttpShardHandlerFactory.getParameter Setting urlScheme to: 
   [junit4]   2> 1009498 T3707 oashc.HttpShardHandlerFactory.getParameter Setting connTimeout to: 15000
   [junit4]   2> 1009499 T3707 oashc.HttpShardHandlerFactory.getParameter Setting maxConnectionsPerHost to: 20
   [junit4]   2> 1009499 T3707 oashc.HttpShardHandlerFactory.getParameter Setting maxConnections to: 10000
   [junit4]   2> 1009499 T3707 oashc.HttpShardHandlerFactory.getParameter Setting corePoolSize to: 0
   [junit4]   2> 1009499 T3707 oashc.HttpShardHandlerFactory.getParameter Setting maximumPoolSize to: 2147483647
   [junit4]   2> 1009499 T3707 oashc.HttpShardHandlerFactory.getParameter Setting maxThreadIdleTime to: 5
   [junit4]   2> 1009500 T3707 oashc.HttpShardHandlerFactory.getParameter Setting sizeOfQueue to: -1
   [junit4]   2> 1009500 T3707 oashc.HttpShardHandlerFactory.getParameter Setting fairnessPolicy to: false
   [junit4]   2> 1009500 T3707 oasu.UpdateShardHandler.<init> Creating UpdateShardHandler HTTP client with params: socketTimeout=340000&connTimeout=45000&retry=false
   [junit4]   2> 1009501 T3707 oasl.LogWatcher.createWatcher SLF4J impl is org.slf4j.impl.Log4jLoggerFactory
   [junit4]   2> 1009501 T3707 oasl.LogWatcher.newRegisteredLogWatcher Registering Log Listener [Log4j (org.slf4j.impl.Log4jLoggerFactory)]
   [junit4]   2> 1009501 T3707 oasc.CoreContainer.load Host Name: 127.0.0.1
   [junit4]   2> 1009501 T3707 oasc.ZkContainer.initZooKeeper Zookeeper client=127.0.0.1:36713/solr
   [junit4]   2> 1009502 T3707 oasc.ZkController.checkChrootPath zkHost includes chroot
   [junit4]   2> 1009502 T3707 oascc.SolrZkClient.createZkCredentialsToAddAutomatically Using default ZkCredentialsProvider
   [junit4]   2> 1009503 T3707 oascc.ConnectionManager.waitForConnected Waiting for client to connect to ZooKeeper
   [junit4]   2> 1009504 T3787 oascc.ConnectionManager.process Watcher org.apache.solr.common.cloud.ConnectionManager@25786ec4 name:ZooKeeperConnection Watcher:127.0.0.1:36713 got event WatchedEvent state:SyncConnected type:None path:null path:null type:None
   [junit4]   2> 1009505 T3707 oascc.ConnectionManager.waitForConnected Client is connected to ZooKeeper
   [junit4]   2> 1009505 T3707 oascc.SolrZkClient.createZkACLProvider Using default ZkACLProvider
   [junit4]   2> 1009507 T3707 oascc.ConnectionManager.waitForConnected Waiting for client to connect to ZooKeeper
   [junit4]   2> 1009508 T3790 oascc.ConnectionManager.process Watcher org.apache.solr.common.cloud.ConnectionManager@6d592e85 name:ZooKeeperConnection Watcher:127.0.0.1:36713/solr got event WatchedEvent state:SyncConnected type:None path:null path:null type:None
   [junit4]   2> 1009508 T3707 oascc.ConnectionManager.waitForConnected Client is connected to ZooKeeper
   [junit4]   2> 1009511 T3707 oascc.ZkStateReader.createClusterStateWatchersAndUpdate Updating cluster state from ZooKeeper... 
   [junit4]   2> 1010515 T3707 oasc.ZkController.createEphemeralLiveNode Register node as live in ZooKeeper:/live_nodes/127.0.0.1:53096_
   [junit4]   2> 1010516 T3707 oascc.SolrZkClient.makePath makePath: /live_nodes/127.0.0.1:53096_
   [junit4]   2> 1010519 T3707 oasc.Overseer.close Overseer (id=null) closing
   [junit4]   2> 1010524 T3707 oasc.CorePropertiesLocator.discover Looking for core definitions underneath /usr/home/jenkins/jenkins-slave/workspace/Lucene-Solr-NightlyTests-5.x/solr/build/solr-core/test/J3/../../../../../../../../../../../usr/home/jenkins/jenkins-slave/workspace/Lucene-Solr-NightlyTests-5.x/solr/build/solr-core/test/J3/temp/solr.cloud.CollectionsAPIDistributedZkTest-9A497961AA667343-001/tempDir-005
   [junit4]   2> 1011745 T3707 oasc.CorePropertiesLocator.discoverUnder Found core conf in /usr/home/jenkins/jenkins-slave/workspace/Lucene-Solr-NightlyTests-5.x/solr/build/solr-core/test/J3/../../../../../../../../../../../usr/home/jenkins/jenkins-slave/workspace/Lucene-Solr-NightlyTests-5.x/solr/build/solr-core/test/J3/temp/solr.cloud.CollectionsAPIDistributedZkTest-9A497961AA667343-001/tempDir-005/conf/
   [junit4]   2> 1011871 T3707 oasc.CorePropertiesLocator.discover Found 1 core definitions
   [junit4]   2> 1011872 T3707 oass.SolrDispatchFilter.init user.dir=/usr/home/jenkins/jenkins-slave/workspace/Lucene-Solr-NightlyTests-5.x/solr/build/solr-core/test/J3
   [junit4]   2> 1011872 T3707 oass.SolrDispatchFilter.init SolrDispatchFilter.init() done
   [junit4]   2> 1012773 T3707 oasc.AbstractFullDistribZkTestBase.createJettys create jetty 4
   [junit4]   2> 1012774 T3707 oejs.Server.doStart jetty-8.1.10.v20130312
   [junit4]   2> 1012777 T3707 oejs.AbstractConnector.doStart Started SocketConnector@127.0.0.1:61959
   [junit4]   2> 1012777 T3707 oass.SolrDispatchFilter.init SolrDispatchFilter.init()sun.misc.Launcher$AppClassLoader@3c56b64c
   [junit4]   2> 1012777 T3707 oasc.SolrResourceLoader.locateSolrHome JNDI not configured for solr (NoInitialContextEx)
   [junit4]   2> 1012778 T3707 oasc.SolrResourceLoader.locateSolrHome using system property solr.solr.home: ../../../../../../../../../../../usr/home/jenkins/jenkins-slave/workspace/Lucene-Solr-NightlyTests-5.x/solr/build/solr-core/test/J3/temp/solr.cloud.CollectionsAPIDistributedZkTest-9A497961AA667343-001/tempDir-006
   [junit4]   2> 1012778 T3707 oasc.SolrResourceLoader.<init> new SolrResourceLoader for directory: '../../../../../../../../../../../usr/home/jenkins/jenkins-slave/workspace/Lucene-Solr-NightlyTests-5.x/solr/build/solr-core/test/J3/temp/solr.cloud.CollectionsAPIDistributedZkTest-9A497961AA667343-001/tempDir-006/'
   [junit4]   2> 1012808 T3707 oasc.ConfigSolr.fromFile Loading container configuration from /usr/home/jenkins/jenkins-slave/workspace/Lucene-Solr-NightlyTests-5.x/solr/build/solr-core/test/J3/../../../../../../../../../../../usr/home/jenkins/jenkins-slave/workspace/Lucene-Solr-NightlyTests-5.x/solr/build/solr-core/test/J3/temp/solr.cloud.CollectionsAPIDistributedZkTest-9A497961AA667343-001/tempDir-006/solr.xml
   [junit4]   2> 1012850 T3707 oasc.CorePropertiesLocator.<init> Config-defined core root directory: /usr/home/jenkins/jenkins-slave/workspace/Lucene-Solr-NightlyTests-5.x/solr/build/solr-core/test/J3/../../../../../../../../../../../usr/home/jenkins/jenkins-slave/workspace/Lucene-Solr-NightlyTests-5.x/solr/build/solr-core/test/J3/temp/solr.cloud.CollectionsAPIDistributedZkTest-9A497961AA667343-001/tempDir-006
   [junit4]   2> 1012850 T3707 oasc.CoreContainer.<init> New CoreContainer 1394835040
   [junit4]   2> 1012851 T3707 oasc.CoreContainer.load Loading cores into CoreContainer [instanceDir=../../../../../../../../../../../usr/home/jenkins/jenkins-slave/workspace/Lucene-Solr-NightlyTests-5.x/solr/build/solr-core/test/J3/temp/solr.cloud.CollectionsAPIDistributedZkTest-9A497961AA667343-001/tempDir-006/]
   [junit4]   2> 1012851 T3707 oashc.HttpShardHandlerFactory.getParameter Setting socketTimeout to: 90000
   [junit4]   2> 1012852 T3707 oashc.HttpShardHandlerFactory.getParameter Setting urlScheme to: 
   [junit4]   2> 1012852 T3707 oashc.HttpShardHandlerFactory.getParameter Setting connTimeout to: 15000
   [junit4]   2> 1012852 T3707 oashc.HttpShardHandlerFactory.getParameter Setting maxConnectionsPerHost to: 20
   [junit4]   2> 1012852 T3707 oashc.HttpShardHandlerFactory.getParameter Setting maxConnections to: 10000
   [junit4]   2> 1012853 T3707 oashc.HttpShardHandlerFactory.getParameter Setting corePoolSize to: 0
   [junit4]   2> 1012853 T3707 oashc.HttpShardHandlerFactory.getParameter Setting maximumPoolSize to: 2147483647
   [junit4]   2> 1012853 T3707 oashc.HttpShardHandlerFactory.getParameter Setting maxThreadIdleTime to: 5
   [junit4]   2> 1012853 T3707 oashc.HttpShardHandlerFactory.getParameter Setting sizeOfQueue to: -1
   [junit4]   2> 1012854 T3707 oashc.HttpShardHandlerFactory.getParameter Setting fairnessPolicy to: false
   [junit4]   2> 1012854 T3707 oasu.UpdateShardHandler.<init> Creating UpdateShardHandler HTTP client with params: socketTimeout=340000&connTimeout=45000&retry=false
   [junit4]   2> 1012854 T3707 oasl.LogWatcher.createWatcher SLF4J impl is org.slf4j.impl.Log4jLoggerFactory
   [junit4]   2> 1012855 T3707 oasl.LogWatcher.newRegisteredLogWatcher Registering Log Listener [Log4j (org.slf4j.impl.Log4jLoggerFactory)]
   [junit4]   2> 1012855 T3707 oasc.CoreContainer.load Host Name: 127.0.0.1
   [junit4]   2> 1012855 T3707 oasc.ZkContainer.initZooKeeper Zookeeper client=127.0.0.1:36713/solr
   [junit4]   2> 1012855 T3707 oasc.ZkController.checkChrootPath zkHost includes chroot
   [junit4]   2> 1012856 T3707 oascc.SolrZkClient.createZkCredentialsToAddAutomatically Using default ZkCredentialsProvider
   [junit4]   2> 1012856 T3707 oascc.ConnectionManager.waitForConnected Waiting for client to connect to ZooKeeper
   [junit4]   2> 1012858 T3803 oascc.ConnectionManager.process Watcher org.apache.solr.common.cloud.ConnectionManager@4c3e4c97 name:ZooKeeperConnection Watcher:127.0.0.1:36713 got event WatchedEvent state:SyncConnected type:None path:null path:null type:None
   [junit4]   2> 1012858 T3707 oascc.ConnectionManager.waitForConnected Client is connected to ZooKeeper
   [junit4]   2> 1012859 T3707 oascc.SolrZkClient.createZkACLProvider Using default ZkACLProvider
   [junit4]   2> 1012860 T3707 oascc.ConnectionManager.waitForConnected Waiting for client to connect to ZooKeeper
   [junit4]   2> 1012861 T3806 oascc.ConnectionManager.process Watcher org.apache.solr.common.cloud.ConnectionManager@2baa8851 name:ZooKeeperConnection Watcher:127.0.0.1:36713/solr got event WatchedEvent state:SyncConnected type:None path:null path:null type:None
   [junit4]   2> 1012861 T3707 oascc.ConnectionManager.waitForConnected Client is connected to ZooKeeper
   [junit4]   2> 1012866 T3707 oascc.ZkStateReader.createClusterStateWatchersAndUpdate Updating cluster state from ZooKeeper... 
   [junit4]   2> 1013871 T3707 oasc.ZkController.createEphemeralLiveNode Register node as live in ZooKeeper:/live_nodes/127.0.0.1:61959_
   [junit4]   2> 1013872 T3707 oascc.SolrZkClient.makePath makePath: /live_nodes/127.0.0.1:61959_
   [junit4]   2> 1013875 T3707 oasc.Overseer.close Overseer (id=null) closing
   [junit4]   2> 1013879 T3707 oasc.CorePropertiesLocator.discover Looking for core definitions underneath /usr/home/jenkins/jenkins-slave/workspace/Lucene-Solr-NightlyTests-5.x/solr/build/solr-core/test/J3/../../../../../../../../../../../usr/home/jenkins/jenkins-slave/workspace/Lucene-Solr-NightlyTests-5.x/solr/build/solr-core/test/J3/temp/solr.cloud.CollectionsAPIDistributedZkTest-9A497961AA667343-001/tempDir-006
   [junit4]   2> 1015077 T3707 oasc.CorePropertiesLocator.discoverUnder Found core conf in /usr/home/jenkins/jenkins-slave/workspace/Lucene-Solr-NightlyTests-5.x/solr/build/solr-core/test/J3/../../../../../../../../../../../usr/home/jenkins/jenkins-slave/workspace/Lucene-Solr-NightlyTests-5.x/solr/build/solr-core/test/J3/temp/solr.cloud.CollectionsAPIDistributedZkTest-9A497961AA667343-001/tempDir-006/conf/
   [junit4]   2> 1015078 T3707 oasc.CorePropertiesLocator.discover Found 1 core definitions
   [junit4]   2> 1015079 T3707 oass.SolrDispatchFilter.init user.dir=/usr/home/jenkins/jenkins-slave/workspace/Lucene-Solr-NightlyTests-5.x/solr/build/solr-core/test/J3
   [junit4]   2> 1015079 T3707 oass.SolrDispatchFilter.init SolrDispatchFilter.init() done
   [junit4]   2> 1015083 T3748 oasha.CollectionsHandler.handleCreateAction Creating Collection : replicationFactor=2&wt=javabin&numShards=2&action=CREATE&version=2&name=nodes_used_collection
   [junit4]   2> 1015085 T3733 oasc.DistributedQueue$LatchWatcher.process NodeChildrenChanged fired on path /overseer/collection-queue-work state SyncConnected
   [junit4]   2> 1015085 T3735 oasc.OverseerCollectionProcessor.run Overseer Collection Processor: Get the message id:/overseer/collection-queue-work/qn-0000000000 message:{
   [junit4]   2> 	  "operation":"create",
   [junit4]   2> 	  "fromApi":"true",
   [junit4]   2> 	  "name":"nodes_used_collection",
   [junit4]   2> 	  "replicationFactor":"2",
   [junit4]   2> 	  "numShards":"2"}
   [junit4]   2> 1015086 T3808 oasc.OverseerCollectionProcessor.processMessage WARN OverseerCollectionProcessor.processMessage : create , {
   [junit4]   2> 	  "operation":"create",
   [junit4]   2> 	  "fromApi":"true",
   [junit4]   2> 	  "name":"nodes_used_collection",
   [junit4]   2> 	  "replicationFactor":"2",
   [junit4]   2> 	  "numShards":"2"}
   [junit4]   2> 1015087 T3808 oasc.OverseerCollectionProcessor.createConfNode Only one config set found in zk - using it:conf1
   [junit4]   2> 1015087 T3808 oasc.OverseerCollectionProcessor.createConfNode creating collections conf node /collections/nodes_used_collection 
   [junit4]   2> 1015087 T3808 oascc.SolrZkClient.makePath makePath: /collections/nodes_used_collection
   [junit4]   2> 1015090 T3733 oasc.DistributedQueue$LatchWatcher.process NodeChildrenChanged fired on path /overseer/queue state SyncConnected
   [junit4]   2> 1015090 T3734 oasc.Overseer$ClusterStateUpdater.run processMessage: queueSize: 1, message = {
   [junit4]   2> 	  "operation":"create",
   [junit4]   2> 	  "fromApi":"true",
   [junit4]   2> 	  "name":"nodes_used_collection",
   [junit4]   2> 	  "replicationFactor":"2",
   [junit4]   2> 	  "numShards":"2"} current state version: 1
   [junit4]   2> 1015091 T3734 oasco.ClusterStateMutator.createCollection building a new cName: nodes_used_collection
   [junit4]   2> 1015092 T3790 oascc.ZkStateReader$2.process A cluster state change: WatchedEvent state:SyncConnected type:NodeDataChanged path:/clusterstate.json, has occurred - updating... (live nodes size: 5)
   [junit4]   2> 1015092 T3758 oascc.ZkStateReader$2.process A cluster state change: WatchedEvent state:SyncConnected type:NodeDataChanged path:/clusterstate.json, has occurred - updating... (live nodes size: 5)
   [junit4]   2> 1015092 T3774 oascc.ZkStateReader$2.process A cluster state change: WatchedEvent state:SyncConnected type:NodeDataChanged path:/clusterstate.json, has occurred - updating... (live nodes size: 5)
   [junit4]   2> 1015092 T3733 oascc.ZkStateReader$2.process A cluster state change: WatchedEvent state:SyncConnected type:NodeDataChanged path:/clusterstate.json, has occurred - updating... (live nodes size: 5)
   [junit4]   2> 1015092 T3740 oascc.ZkStateReader$2.process A cluster state change: WatchedEvent state:SyncConnected type:NodeDataChanged path:/clusterstate.json, has occurred - updating... (live nodes size: 5)
   [junit4]   2> 1015092 T3806 oascc.ZkStateReader$2.process A cluster state change: WatchedEvent state:SyncConnected type:NodeDataChanged path:/clusterstate.json, has occurred - updating... (live nodes size: 5)
   [junit4]   2> 1015291 T3808 oasc.OverseerCollectionProcessor.createCollection Creating SolrCores for new collection nodes_used_collection, shardNames [shard1, shard2] , replicationFactor : 2
   [junit4]   2> 1015292 T3808 oasc.OverseerCollectionProcessor.createCollection Creating shard nodes_used_collection_shard1_replica1 as part of slice shard1 of collection nodes_used_collection on 127.0.0.1:54363_
   [junit4]   2> 1015292 T3808 oasc.OverseerCollectionProcessor.createCollection Creating shard nodes_used_collection_shard1_replica2 as part of slice shard1 of collection nodes_used_collection on 127.0.0.1:58247_
   [junit4]   2> 1015293 T3808 oasc.OverseerCollectionProcessor.createCollection Creating shard nodes_used_collection_shard2_replica1 as part of slice shard2 of collection nodes_used_collection on 127.0.0.1:41116_
   [junit4]   2> 1015293 T3808 oasc.OverseerCollectionProcessor.createCollection Creating shard nodes_used_collection_shard2_replica2 as part of slice shard2 of collection nodes_used_collection on 127.0.0.1:61959_
   [junit4]   2> 1015295 T3747 oasha.CoreAdminHandler.handleCreateAction core create command collection.configName=conf1&wt=javabin&numShards=2&collection=nodes_used_collection&qt=/admin/cores&shard=shard1&action=CREATE&version=2&name=nodes_used_collection_shard1_replica1
   [junit4]   2> 1015295 T3762 oasha.CoreAdminHandler.handleCreateAction core create command collection.configName=conf1&wt=javabin&numShards=2&collection=nodes_used_collection&qt=/admin/cores&shard=shard1&action=CREATE&version=2&name=nodes_used_collection_shard1_replica2
   [junit4]   2> 1015296 T3721 oasha.CoreAdminHandler.handleCreateAction core create command collection.configName=conf1&wt=javabin&numShards=2&collection=nodes_used_collection&qt=/admin/cores&shard=shard2&action=CREATE&version=2&name=nodes_used_collection_shard2_replica1
   [junit4]   2> 1015297 T3794 oasha.CoreAdminHandler.handleCreateAction core create command collection.configName=conf1&wt=javabin&numShards=2&collection=nodes_used_collection&qt=/admin/cores&shard=shard2&action=CREATE&version=2&name=nodes_used_collection_shard2_replica2
   [junit4]   2> 1015297 T3747 oasc.ZkController.publish publishing core=nodes_used_collection_shard1_replica1 state=down collection=nodes_used_collection
   [junit4]   2> 1015298 T3747 oasc.ZkController.waitForCoreNodeName look for our core node name
   [junit4]   2> 1015298 T3733 oasc.DistributedQueue$LatchWatcher.process NodeChildrenChanged fired on path /overseer/queue state SyncConnected
   [junit4]   2> 1015299 T3734 oasc.Overseer$ClusterStateUpdater.run processMessage: queueSize: 1, message = {
   [junit4]   2> 	  "core":"nodes_used_collection_shard1_replica1",
   [junit4]   2> 	  "roles":null,
   [junit4]   2> 	  "base_url":"http://127.0.0.1:54363",
   [junit4]   2> 	  "numShards":"2",
   [junit4]   2> 	  "collection":"nodes_used_collection",
   [junit4]   2> 	  "shard":"shard1",
   [junit4]   2> 	  "node_name":"127.0.0.1:54363_",
   [junit4]   2> 	  "state":"down",
   [junit4]   2> 	  "operation":"state"} current state version: 2
   [junit4]   2> 1015299 T3721 oasc.ZkController.publish publishing core=nodes_used_collection_shard2_replica1 state=down collection=nodes_used_collection
   [junit4]   2> 1015300 T3734 oasco.ReplicaMutator.updateState Update state numShards=2 message={
   [junit4]   2> 	  "core":"nodes_used_collection_shard1_replica1",
   [junit4]   2> 	  "roles":null,
   [junit4]   2> 	  "base_url":"http://127.0.0.1:54363",
   [junit4]   2> 	  "numShards":"2",
   [junit4]   2> 	  "collection":"nodes_used_collection",
   [junit4]   2> 	  "shard":"shard1",
   [junit4]   2> 	  "node_name":"127.0.0.1:54363_",
   [junit4]   2> 	  "state":"down",
   [junit4]   2> 	  "operation":"state"}
   [junit4]   2> 1015300 T3762 oasc.ZkController.publish publishing core=nodes_used_collection_shard1_replica2 state=down collection=nodes_used_collection
   [junit4]   2> 1015300 T3721 oasc.ZkController.waitForCoreNodeName look for our core node name
   [junit4]   2> 1015300 T3794 oasc.ZkController.publish publishing core=nodes_used_collection_shard2_replica2 state=down collection=nodes_used_collection
   [junit4]   2> 1015301 T3762 oasc.ZkController.waitForCoreNodeName look for our core node name
   [junit4]   2> 1015301 T3794 oasc.ZkController.waitForCoreNodeName look for our core node name
   [junit4]   2> 1015302 T3734 oasc.Overseer$ClusterStateUpdater.run processMessage: queueSize: 3, message = {
   [junit4]   2> 	  "core":"nodes_used_collection_shard2_replica1",
   [junit4]   2> 	  "roles":null,
   [junit4]   2> 	  "base_url":"http://127.0.0.1:41116",
   [junit4]   2> 	  "numShards":"2",
   [junit4]   2> 	  "collection":"nodes_used_collection",
   [junit4]   2> 	  "shard":"shard2",
   [junit4]   2> 	  "node_name":"127.0.0.1:41116_",
   [junit4]   2> 	  "state":"down",
   [junit4]   2> 	  "operation":"state"} current state version: 2
   [junit4]   2> 1015302 T3734 oasco.ReplicaMutator.updateState Update state numShards=2 message={
   [junit4]   2> 	  "core":"nodes_used_collection_shard2_replica1",
   [junit4]   2> 	  "roles":null,
   [junit4]   2> 	  "base_url":"http://127.0.0.1:41116",
   [junit4]   2> 	  "numShards":"2",
   [junit4]   2> 	  "collection":"nodes_used_collection",
   [junit4]   2> 	  "shard":"shard2",
   [junit4]   2> 	  "node_name":"127.0.0.1:41116_",
   [junit4]   2> 	  "state":"down",
   [junit4]   2> 	  "operation":"state"}
   [junit4]   2> 1015304 T3733 oasc.DistributedQueue$LatchWatcher.process NodeChildrenChanged fired on path /overseer/queue state SyncConnected
   [junit4]   2> 1015304 T3734 oasc.Overseer$ClusterStateUpdater.run processMessage: queueSize: 3, message = {
   [junit4]   2> 	  "core":"nodes_used_collection_shard1_replica2",
   [junit4]   2> 	  "roles":null,
   [junit4]   2> 	  "base_url":"http://127.0.0.1:58247",
   [junit4]   2> 	  "numShards":"2",
   [junit4]   2> 	  "collection":"nodes_used_collection",
   [junit4]   2> 	  "shard":"shard1",
   [junit4]   2> 	  "node_name":"127.0.0.1:58247_",
   [junit4]   2> 	  "state":"down",
   [junit4]   2> 	  "operation":"state"} current state version: 2
   [junit4]   2> 1015304 T3734 oasco.ReplicaMutator.updateState Update state numShards=2 message={
   [junit4]   2> 	  "core":"nodes_used_collection_shard1_replica2",
   [junit4]   2> 	  "roles":null,
   [junit4]   2> 	  "base_url":"http://127.0.0.1:58247",
   [junit4]   2> 	  "numShards":"2",
   [junit4]   2> 	  "collection":"nodes_used_collection",
   [junit4]   2> 	  "shard":"shard1",
   [junit4]   2> 	  "node_name":"127.0.0.1:58247_",
   [junit4]   2> 	  "state":"down",
   [junit4]   2> 	  "operation":"state"}
   [junit4]   2> 1015306 T3734 oasc.Overseer$ClusterStateUpdater.run processMessage: queueSize: 1, message = {
   [junit4]   2> 	  "core":"nodes_used_collection_shard2_replica2",
   [junit4]   2> 	  "roles":null,
   [junit4]   2> 	  "base_url":"http://127.0.0.1:61959",
   [junit4]   2> 	  "numShards":"2",
   [junit4]   2> 	  "collection":"nodes_used_collection",
   [junit4]   2> 	  "shard":"shard2",
   [junit4]   2> 	  "node_name":"127.0.0.1:61959_",
   [junit4]   2> 	  "state":"down",
   [junit4]   2> 	  "operation":"state"} current state version: 2
   [junit4]   2> 1015307 T3734 oasco.ReplicaMutator.updateState Update state numShards=2 message={
   [junit4]   2> 	  "core":"nodes_used_collection_shard2_replica2",
   [junit4]   2> 	  "roles":null,
   [junit4]   2> 	  "base_url":"http://127.0.0.1:61959",
   [junit4]   2> 	  "numShards":"2",
   [junit4]   2> 	  "collection":"nodes_used_collection",
   [junit4]   2> 	  "shard":"shard2",
   [junit4]   2> 	  "node_name":"127.0.0.1:61959_",
   [junit4]   2> 	  "state":"down",
   [junit4]   2> 	  "operation":"state"}
   [junit4]   2> 1015308 T3733 oasc.DistributedQueue$LatchWatcher.process NodeChildrenChanged fired on path /overseer/queue state SyncConnected
   [junit4]   2> 1015309 T3758 oascc.ZkStateReader$2.process A cluster state change: WatchedEvent state:SyncConnected type:NodeDataChanged path:/clusterstate.json, has occurred - updating... (live nodes size: 5)
   [junit4]   2> 1015309 T3733 oascc.ZkStateReader$2.process A cluster state change: WatchedEvent state:SyncConnected type:NodeDataChanged path:/clusterstate.json, has occurred - updating... (live nodes size: 5)
   [junit4]   2> 1015309 T3774 oascc.ZkStateReader$2.process A cluster state change: WatchedEvent state:SyncConnected type:NodeDataChanged path:/clusterstate.json, has occurred - updating... (live nodes size: 5)
   [junit4]   2> 1015309 T3806 oascc.ZkStateReader$2.process A cluster state change: WatchedEvent state:SyncConnected type:NodeDataChanged path:/clusterstate.json, has occurred - updating... (live nodes size: 5)
   [junit4]   2> 1015309 T3740 oascc.ZkStateReader$2.process A cluster state change: WatchedEvent state:SyncConnected type:NodeDataChanged path:/clusterstate.json, has occurred - updating... (live nodes size: 5)
   [junit4]   2> 1015309 T3790 oascc.ZkStateReader$2.process A cluster state change: WatchedEvent state:SyncConnected type:NodeDataChanged path:/clusterstate.json, has occurred - updating... (live nodes size: 5)
   [junit4]   2> 1016298 T3747 oasc.ZkController.waitForShardId waiting to find shard id in clusterstate for nodes_used_collection_shard1_replica1
   [junit4]   2> 1016299 T3747 oasc.ZkController.createCollectionZkNode Check for collection zkNode:nodes_used_collection
   [junit4]   2> 1016299 T3747 oasc.ZkController.createCollectionZkNode Collection zkNode exists
   [junit4]   2> 1016300 T3747 oascc.ZkStateReader.readConfigName Load collection config from:/collections/nodes_used_collection
   [junit4]   2> 1016301 T3747 oascc.ZkStateReader.readConfigName path=/collections/nodes_used_collection configName=conf1 specified config exists in ZooKeeper
   [junit4]   2> 1016301 T3747 oasc.SolrResourceLoader.<init> new SolrResourceLoader for directory: '/usr/home/jenkins/jenkins-slave/workspace/Lucene-Solr-NightlyTests-5.x/solr/build/solr-core/test/J3/temp/solr.cloud.CollectionsAPIDistributedZkTest-9A497961AA667343-001/tempDir-003/nodes_used_collection_shard1_replica1/'
   [junit4]   2> 1016301 T3721 oasc.ZkController.waitForShardId waiting to find shard id in clusterstate for nodes_used_collection_shard2_replica1
   [junit4]   2> 1016301 T3762 oasc.ZkController.waitForShardId waiting to find shard id in clusterstate for nodes_used_collection_shard1_replica2
   [junit4]   2> 1016301 T3794 oasc.ZkController.waitForShardId waiting to find shard id in clusterstate for nodes_used_collection_shard2_replica2
   [junit4]   2> 1016302 T3762 oasc.ZkController.createCollectionZkNode Check for collection zkNode:nodes_used_collection
   [junit4]   2> 1016302 T3721 oasc.ZkController.createCollectionZkNode Check for collection zkNode:nodes_used_collection
   [junit4]   2> 1016302 T3794 oasc.ZkController.createCollectionZkNode Check for collection zkNode:nodes_used_collection
   [junit4]   2> 1016303 T3721 oasc.ZkController.createCollectionZkNode Collection zkNode exists
   [junit4]   2> 1016303 T3762 oasc.ZkController.createCollectionZkNode Collection zkNode exists
   [junit4]   2> 1016304 T3762 oascc.ZkStateReader.readConfigName Load collection config from:/collections/nodes_used_collection
   [junit4]   2> 1016304 T3794 oasc.ZkController.createCollectionZkNode Collection zkNode exists
   [junit4]   2> 1016304 T3721 oascc.ZkStateReader.readConfigName Load collection config from:/collections/nodes_used_collection
   [junit4]   2> 1016304 T3794 oascc.ZkStateReader.readConfigName Load collection config from:/collections/nodes_used_collection
   [junit4]   2> 1016305 T3762 oascc.ZkStateReader.readConfigName path=/collections/nodes_used_collection configName=conf1 specified config exists in ZooKeeper
   [junit4]   2> 1016305 T3762 oasc.SolrResourceLoader.<init> new SolrResourceLoader for directory: '../../../../../../../../../../../usr/home/jenkins/jenkins-slave/workspace/Lucene-Solr-NightlyTests-5.x/solr/build/solr-core/test/J3/temp/solr.cloud.CollectionsAPIDistributedZkTest-9A497961AA667343-001/tempDir-004/nodes_used_collection_shard1_replica2/'
   [junit4]   2> 1016305 T3721 oascc.ZkStateReader.readConfigName path=/collections/nodes_used_collection configName=conf1 specified config exists in ZooKeeper
   [junit4]   2> 1016306 T3794 oascc.ZkStateReader.readConfigName path=/collections/nodes_used_collection configName=conf1 specified config exists in ZooKeeper
   [junit4]   2> 1016306 T3721 oasc.SolrResourceLoader.<init> new SolrResourceLoader for directory: '/usr/home/jenkins/jenkins-slave/workspace/Lucene-Solr-NightlyTests-5.x/solr/build/solr-core/test/J3/temp/solr.cloud.CollectionsAPIDistributedZkTest-9A497961AA667343-001/tempDir-002/nodes_used_collection_shard2_replica1/'
   [junit4]   2> 1016306 T3794 oasc.SolrResourceLoader.<init> new SolrResourceLoader for directory: '../../../../../../../../../../../usr/home/jenkins/jenkins-slave/workspace/Lucene-Solr-NightlyTests-5.x/solr/build/solr-core/test/J3/temp/solr.cloud.CollectionsAPIDistributedZkTest-9A497961AA667343-001/tempDir-006/nodes_used_collection_shard2_replica2/'
   [junit4]   2> 1016343 T3747 oasc.ZkController.watchZKConfDir watch zkdir /configs/conf1
   [junit4]   2> 1016345 T3762 oasc.ZkController.watchZKConfDir watch zkdir /configs/conf1
   [junit4]   2> 1016348 T3794 oasc.ZkController.watchZKConfDir watch zkdir /configs/conf1
   [junit4]   2> 1016358 T3721 oasc.ZkController.watchZKConfDir watch zkdir /configs/conf1
   [junit4]   2> 1016363 T3794 oasc.Config.<init> loaded config solrconfig.xml with version 0 
   [junit4]   2> 1016363 T3747 oasc.Config.<init> loaded config solrconfig.xml with version 0 
   [junit4]   2> 1016363 T3721 oasc.Config.<init> loaded config solrconfig.xml with version 0 
   [junit4]   2> 1016364 T3762 oasc.Config.<init> loaded config solrconfig.xml with version 0 
   [junit4]   2> 1016429 T3794 oasc.SolrConfig.<init> Using Lucene MatchVersion: 5.0.0
   [junit4]   2> 1016430 T3747 oasc.SolrConfig.<init> Using Lucene MatchVersion: 5.0.0
   [junit4]   2> 1016438 T3721 oasc.SolrConfig.<init> Using Lucene MatchVersion: 5.0.0
   [junit4]   2> 1016439 T3762 oasc.SolrConfig.<init> Using Lucene MatchVersion: 5.0.0
   [junit4]   2> 1016472 T3747 oasc.SolrConfig.<init> Loaded SolrConfig: solrconfig.xml
   [junit4]   2> 1016472 T3794 oasc.SolrConfig.<init> Loaded SolrConfig: solrconfig.xml
   [junit4]   2> 1016512 T3721 oasc.SolrConfig.<init> Loaded SolrConfig: solrconfig.xml
   [junit4]   2> 1016513 T3762 oasc.SolrConfig.<init> Loaded SolrConfig: solrconfig.xml
   [junit4]   2> 1016513 T3721 oass.IndexSchema.readSchema Reading Solr Schema from /configs/conf1/schema.xml
   [junit4]   2> 1016524 T3721 oass.IndexSchema.readSchema [nodes_used_collection_shard2_replica1] Schema name=test
   [junit4]   2> 1016574 T3794 oass.IndexSchema.readSchema Reading Solr Schema from /configs/conf1/schema.xml
   [junit4]   2> 1016574 T3747 oass.IndexSchema.readSchema Reading Solr Schema from /configs/conf1/schema.xml
   [junit4]   2> 1016585 T3747 oass.IndexSchema.readSchema [nodes_used_collection_shard1_replica1] Schema name=test
   [junit4]   2> 1016586 T3794 oass.IndexSchema.readSchema [nodes_used_collection_shard2_replica2] Schema name=test
   [junit4]   2> 1016615 T3762 oass.IndexSchema.readSchema Reading Solr Schema from /configs/conf1/schema.xml
   [junit4]   2> 1016627 T3762 oass.IndexSchema.readSchema [nodes_used_collection_shard1_replica2] Schema name=test
   [junit4]   2> 1016958 T3721 oass.OpenExchangeRatesOrgProvider.init Initialized with rates=open-exchange-rates.json, refreshInterval=1440.
   [junit4]   2> 1016970 T3721 oass.IndexSchema.readSchema default search field in schema is text
   [junit4]   2> 1016973 T3721 oass.IndexSchema.readSchema unique key field: id
   [junit4]   2> 1016991 T3721 oass.FileExchangeRateProvider.reload Reloading exchange rates from file currency.xml
   [junit4]   2> 1016997 T3721 oass.FileExchangeRateProvider.reload Reloading exchange rates from file currency.xml
   [junit4]   2> 1017001 T3721 oass.OpenExchangeRatesOrgProvider.reload Reloading exchange rates from open-exchange-rates.json
   [junit4]   2> 1017003 T3721 oass.OpenExchangeRatesOrgProvider$OpenExchangeRates.<init> WARN Unknown key IMPORTANT NOTE
   [junit4]   2> 1017005 T3721 oass.OpenExchangeRatesOrgProvider$OpenExchangeRates.<init> WARN Expected key, got STRING
   [junit4]   2> 1017005 T3721 oass.OpenExchangeRatesOrgProvider.reload Reloading exchange rates from open-exchange-rates.json
   [junit4]   2> 1017006 T3721 oass.OpenExchangeRatesOrgProvider$OpenExchangeRates.<init> WARN Unknown key IMPORTANT NOTE
   [junit4]   2> 1017006 T3721 oass.OpenExchangeRatesOrgProvider$OpenExchangeRates.<init> WARN Expected key, got STRING
   [junit4]   2> 1017007 T3721 oasc.CoreContainer.create Creating SolrCore 'nodes_used_collection_shard2_replica1' using configuration from collection nodes_used_collection
   [junit4]   2> 1017007 T3721 oasc.SolrCore.initDirectoryFactory org.apache.solr.core.MockDirectoryFactory
   [junit4]   2> 1017007 T3721 oasc.SolrCore.<init> [nodes_used_collection_shard2_replica1] Opening new SolrCore at /usr/home/jenkins/jenkins-slave/workspace/Lucene-Solr-NightlyTests-5.x/solr/build/solr-core/test/J3/temp/solr.cloud.CollectionsAPIDistributedZkTest-9A497961AA667343-001/tempDir-002/nodes_used_collection_shard2_replica1/, dataDir=/usr/home/jenkins/jenkins-slave/workspace/Lucene-Solr-NightlyTests-5.x/solr/build/solr-core/test/J3/temp/solr.cloud.CollectionsAPIDistributedZkTest-9A497961AA667343-001/tempDir-002/nodes_used_collection_shard2_replica1/data/
   [junit4]   2> 1017008 T3721 oasc.JmxMonitoredMap.<init> JMX monitoring is enabled. Adding Solr mbeans to JMX Server: com.sun.jmx.mbeanserver.JmxMBeanServer@51215391
   [junit4]   2> 1017009 T3721 oasc.CachingDirectoryFactory.get return new directory for /usr/home/jenkins/jenkins-slave/workspace/Lucene-Solr-NightlyTests-5.x/solr/build/solr-core/test/J3/temp/solr.cloud.CollectionsAPIDistributedZkTest-9A497961AA667343-001/tempDir-002/nodes_used_collection_shard2_replica1/data
   [junit4]   2> 1017009 T3721 oasc.SolrCore.getNewIndexDir New index directory detected: old=null new=/usr/home/jenkins/jenkins-slave/workspace/Lucene-Solr-NightlyTests-5.x/solr/build/solr-core/test/J3/temp/solr.cloud.CollectionsAPIDistributedZkTest-9A497961AA667343-001/tempDir-002/nodes_used_collection_shard2_replica1/data/index/
   [junit4]   2> 1017010 T3721 oasc.SolrCore.initIndex WARN [nodes_used_collection_shard2_replica1] Solr index directory '/usr/home/jenkins/jenkins-slave/workspace/Lucene-Solr-NightlyTests-5.x/solr/build/solr-core/test/J3/temp/solr.cloud.CollectionsAPIDistributedZkTest-9A497961AA667343-001/tempDir-002/nodes_used_collection_shard2_replica1/data/index' doesn't exist. Creating new index...
   [junit4]   2> 1017010 T3721 oasc.CachingDirectoryFactory.get return new directory for /usr/home/jenkins/jenkins-slave/workspace/Lucene-Solr-NightlyTests-5.x/solr/build/solr-core/test/J3/temp/solr.cloud.CollectionsAPIDistributedZkTest-9A497961AA667343-001/tempDir-002/nodes_used_collection_shard2_replica1/data/index
   [junit4]   2> 1017011 T3721 oasu.RandomMergePolicy.<init> RandomMergePolicy wrapping class org.apache.lucene.index.LogByteSizeMergePolicy: [LogByteSizeMergePolicy: minMergeSize=1677721, mergeFactor=38, maxMergeSize=2147483648, maxMergeSizeForForcedMerge=9223372036854775807, calibrateSizeByDeletes=false, maxMergeDocs=2147483647, maxCFSSegmentSizeMB=1.455078125, noCFSRatio=1.0]
   [junit4]   2> 1017012 T3721 oasc.SolrDeletionPolicy.onCommit SolrDeletionPolicy.onCommit: commits: num=1
   [junit4]   2> 		commit{dir=MockDirectoryWrapper(NRTCachingDirectory(RAMDirectory@8b80e74 lockFactory=org.apache.lucene.store.SingleInstanceLockFactory@6bbce624; maxCacheMB=0.64453125 maxMergeSizeMB=0.4853515625)),segFN=segments_1,generation=1}
   [junit4]   2> 1017012 T3721 oasc.SolrDeletionPolicy.updateCommits newest commit generation = 1
   [junit4]   2> 1017017 T3721 oasup.UpdateRequestProcessorChain.init creating updateRequestProcessorChain "nodistrib"
   [junit4]   2> 1017018 T3721 oasup.UpdateRequestProcessorChain.init creating updateRequestProcessorChain "dedupe"
   [junit4]   2> 1017018 T3721 oasup.UpdateRequestProcessorChain.init inserting DistributedUpdateProcessorFactory into updateRequestProcessorChain "dedupe"
   [junit4]   2> 1017018 T3721 oasup.UpdateRequestProcessorChain.init creating updateRequestProcessorChain "stored_sig"
   [junit4]   2> 1017019 T3721 oasup.UpdateRequestProcessorChain.init inserting DistributedUpdateProcessorFactory into updateRequestProcessorChain "stored_sig"
   [junit4]   2> 1017019 T3721 oasup.UpdateRequestProcessorChain.init creating updateRequestProcessorChain "distrib-dup-test-chain-explicit"
   [junit4]   2> 1017020 T3721 oasup.UpdateRequestProcessorChain.init creating updateRequestProcessorChain "distrib-dup-test-chain-implicit"
   [junit4]   2> 1017020 T3721 oasup.UpdateRequestProcessorChain.init inserting DistributedUpdateProcessorFactory into updateRequestProcessorChain "distrib-dup-test-chain-implicit"
   [junit4]   2> 1017020 T3721 oasc.SolrCore.loadUpdateProcessorChains no updateRequestProcessorChain defined as default, creating implicit default
   [junit4]   2> 1017021 T3721 oasc.RequestHandlers.initHandlersFromConfig created /update: org.apache.solr.handler.UpdateRequestHandler
   [junit4]   2> 1017022 T3721 oasc.RequestHandlers.initHandlersFromConfig created /update/json: org.apache.solr.handler.UpdateRequestHandler
   [junit4]   2> 1017023 T3721 oasc.RequestHandlers.initHandlersFromConfig created /update/csv: org.apache.solr.handler.UpdateRequestHandler
   [junit4]   2> 1017023 T3721 oasc.RequestHandlers.initHandlersFromConfig created /update/json/docs: org.apache.solr.handler.UpdateRequestHandler
   [junit4]   2> 1017024 T3721 oasc.RequestHandlers.initHandlersFromConfig created /config: org.apache.solr.handler.SolrConfigHandler
   [junit4]   2> 1017024 T3721 oasc.RequestHandlers.initHandlersFromConfig created /schema: org.apache.solr.handler.SchemaHandler
   [junit4]   2> 1017025 T3721 oasc.RequestHandlers.initHandlersFromConfig created /replication: org.apache.solr.handler.ReplicationHandler
   [junit4]   2> 1017025 T3721 oasc.RequestHandlers.initHandlersFromConfig created /get: org.apache.solr.handler.RealTimeGetHandler
   [junit4]   2> 1017026 T3721 oasc.RequestHandlers.initHandlersFromConfig created /admin/luke: org.apache.solr.handler.admin.LukeRequestHandler
   [junit4]   2> 1017028 T3721 oasc.RequestHandlers.initHandlersFromConfig created /admin/system: org.apache.solr.handler.admin.SystemInfoHandler
   [junit4]   2> 1017028 T3721 oasc.RequestHandlers.initHandlersFromConfig created /admin/mbeans: org.apache.solr.handler.admin.SolrInfoMBeanHandler
   [junit4]   2> 1017029 T3721 oasc.RequestHandlers.initHandlersFromConfig created /admin/plugins: org.apache.solr.handler.admin.PluginInfoHandler
   [junit4]   2> 1017029 T3721 oasc.RequestHandlers.initHandlersFromConfig created /admin/threads: org.apache.solr.handler.admin.ThreadDumpHandler
   [junit4]   2> 1017030 T3721 oasc.RequestHandlers.initHandlersFromConfig created /admin/properties: org.apache.solr.handler.admin.PropertiesRequestHandler
   [junit4]   2> 1017030 T3747 oass.OpenExchangeRatesOrgProvider.init Initialized with rates=open-exchange-rates.json, refreshInterval=1440.
   [junit4]   2> 1017031 T3721 oasc.RequestHandlers.initHandlersFromConfig created /admin/logging: org.apache.solr.handler.admin.LoggingHandler
   [junit4]   2> 1017031 T3721 oasc.RequestHandlers.initHandlersFromConfig created /admin/ping: org.apache.solr.handler.PingRequestHandler
   [junit4]   2> 1017032 T3721 oasc.RequestHandlers.initHandlersFromConfig created standard: solr.StandardRequestHandler
   [junit4]   2> 1017033 T3721 oasc.RequestHandlers.initHandlersFromConfig created /admin/file: solr.admin.ShowFileRequestHandler
   [junit4]   2> 1017033 T3721 oasc.RequestHandlers.initHandlersFromConfig created /admin/fileedit: solr.admin.EditFileRequestHandler
   [junit4]   2> 1017037 T3747 oass.IndexSchema.readSchema default search field in schema is text
   [junit4]   2> 1017040 T3794 oass.OpenExchangeRatesOrgProvider.init Initialized with rates=open-exchange-rates.json, refreshInterval=1440.
   [junit4]   2> 1017040 T3747 oass.IndexSchema.readSchema unique key field: id
   [junit4]   2> 1017046 T3794 oass.IndexSchema.readSchema default search field in schema is text
   [junit4]   2> 1017049 T3794 oass.IndexSchema.readSchema unique key field: id
   [junit4]   2> 1017052 T3747 oass.FileExchangeRateProvider.reload Reloading exchange rates from file currency.xml
   [junit4]   2> 1017056 T3721 oashl.XMLLoader.init xsltCacheLifetimeSeconds=60
   [junit4]   2> 1017057 T3747 oass.FileExchangeRateProvider.reload Reloading exchange rates from file currency.xml
   [junit4]   2> 1017058 T3721 oashl.XMLLoader.init xsltCacheLifetimeSeconds=60
   [junit4]   2> 1017061 T3721 oashl.XMLLoader.init xsltCacheLifetimeSeconds=60
   [junit4]   2> 1017061 T3794 oass.FileExchangeRateProvider.reload Reloading exchange rates from file currency.xml
   [junit4]   2> 1017062 T3747 oass.OpenExchangeRatesOrgProvider.reload Reloading exchange rates from open-exchange-rates.json
   [junit4]   2> 1017063 T3747 oass.OpenExchangeRatesOrgProvider$OpenExchangeRates.<init> WARN Unknown key IMPORTANT NOTE
   [junit4]   2> 1017063 T3747 oass.OpenExchangeRatesOrgProvider$OpenExchangeRates.<init> WARN Expected key, got STRING
   [junit4]   2> 1017063 T3721 oashl.XMLLoader.init xsltCacheLifetimeSeconds=60
   [junit4]   2> 1017063 T3747 oass.OpenExchangeRatesOrgProvider.reload Reloading exchange rates from open-exchange-rates.json
   [junit4]   2> 1017065 T3747 oass.OpenExchangeRatesOrgProvider$OpenExchangeRates.<init> WARN Unknown key IMPORTANT NOTE
   [junit4]   2> 1017065 T3747 oass.OpenExchangeRatesOrgProvider$OpenExchangeRates.<init> WARN Expected key, got STRING
   [junit4]   2> 1017065 T3747 oasc.CoreContainer.create Creating SolrCore 'nodes_used_collection_shard1_replica1' using configuration from collection nodes_used_collection
   [junit4]   2> 1017066 T3794 oass.FileExchangeRateProvider.reload Reloading exchange rates from file currency.xml
   [junit4]   2> 1017066 T3747 oasc.SolrCore.initDirectoryFactory org.apache.solr.core.MockDirectoryFactory
   [junit4]   2> 1017066 T3747 oasc.SolrCore.<init> [nodes_used_collection_shard1_replica1] Opening new SolrCore at /usr/home/jenkins/jenkins-slave/workspace/Lucene-Solr-NightlyTests-5.x/solr/build/solr-core/test/J3/temp/solr.cloud.CollectionsAPIDistributedZkTest-9A497961AA667343-001/tempDir-003/nodes_used_collection_shard1_replica1/, dataDir=/usr/home/jenkins/jenkins-slave/workspace/Lucene-Solr-NightlyTests-5.x/solr/build/solr-core/test/J3/temp/solr.cloud.CollectionsAPIDistributedZkTest-9A497961AA667343-001/tempDir-003/nodes_used_collection_shard1_replica1/data/
   [junit4]   2> 1017067 T3747 oasc.JmxMonitoredMap.<init> JMX monitoring is enabled. Adding Solr mbeans to JMX Server: com.sun.jmx.mbeanserver.JmxMBeanServer@51215391
   [junit4]   2> 1017068 T3747 oasc.CachingDirectoryFactory.get return new directory for /usr/home/jenkins/jenkins-slave/workspace/Lucene-Solr-NightlyTests-5.x/solr/build/solr-core/test/J3/temp/solr.cloud.CollectionsAPIDistributedZkTest-9A497961AA667343-001/tempDir-003/nodes_used_collection_shard1_replica1/data
   [junit4]   2> 1017068 T3747 oasc.SolrCore.getNewIndexDir New index directory detected: old=null new=/usr/home/jenkins/jenkins-slave/workspace/Lucene-Solr-NightlyTests-5.x/solr/build/solr-core/test/J3/temp/solr.cloud.CollectionsAPIDistributedZkTest-9A497961AA667343-001/tempDir-003/nodes_used_collection_shard1_replica1/data/index/
   [junit4]   2> 1017069 T3747 oasc.SolrCore.initIndex WARN [nodes_used_collection_shard1_replica1] Solr index directory '/usr/home/jenkins/jenkins-slave/workspace/Lucene-Solr-NightlyTests-5.x/solr/build/solr-core/test/J3/temp/solr.cloud.CollectionsAPIDistributedZkTest-9A497961AA667343-001/tempDir-003/nodes_used_collection_shard1_replica1/data/index' doesn't exist. Creating new index...
   [junit4]   2> 1017070 T3747 oasc.CachingDirectoryFactory.get return new directory for /usr/home/jenkins/jenkins-slave/workspace/Lucene-Solr-NightlyTests-5.x/solr/build/solr-core/test/J3/temp/solr.cloud.CollectionsAPIDistributedZkTest-9A497961AA667343-001/tempDir-003/nodes_used_collection_shard1_replica1/data/index
   [junit4]   2> 1017070 T3721 oasu.CommitTracker.<init> Hard AutoCommit: disabled
   [junit4]   2> 1017070 T3747 oasu.RandomMergePolicy.<init> RandomMergePolicy wrapping class org.apache.lucene.index.LogByteSizeMergePolicy: [LogByteSizeMergePolicy: minMergeSize=1677721, mergeFactor=38, maxMergeSize=2147483648, maxMergeSizeForForcedMerge=9223372036854775807, calibrateSizeByDeletes=false, maxMergeDocs=2147483647, maxCFSSegmentSizeMB=1.455078125, noCFSRatio=1.0]
   [junit4]   2> 1017070 T3794 oass.OpenExchangeRatesOrgProvider.reload Reloading exchange rates from open-exchange-rates.json
   [junit4]   2> 1017070 T3721 oasu.CommitTracker.<init> Soft AutoCommit: disabled
   [junit4]   2> 1017071 T3747 oasc.SolrDeletionPolicy.onCommit SolrDeletionPolicy.onCommit: commits: num=1
   [junit4]   2> 		commit{dir=MockDirectoryWrapper(NRTCachingDirectory(RAMDirectory@7c3985 lockFactory=org.apache.lucene.store.SingleInstanceLockFactory@5ba44b02; maxCacheMB=0.64453125 maxMergeSizeMB=0.4853515625)),segFN=segments_1,generation=1}
   [junit4]   2> 1017072 T3721 oasu.RandomMergePolicy.<init> RandomMergePolicy wrapping class org.apache.lucene.index.LogByteSizeMergePolicy: [LogByteSizeMergePolicy: minMergeSize=1677721, mergeFactor=4, maxMergeSize=2147483648, maxMergeSizeForForcedMerge=9223372036854775807, calibrateSizeByDeletes=false, maxMergeDocs=2147483647, maxCFSSegmentSizeMB=8.796093022207999E12, noCFSRatio=0.0]
   [junit4]   2> 1017072 T3794 oass.OpenExchangeRatesOrgProvider$OpenExchangeRates.<init> WARN Unknown key IMPORTANT NOTE
   [junit4]   2> 1017072 T3747 oasc.SolrDeletionPolicy.updateCommits newest commit generation = 1
   [junit4]   2> 1017073 T3721 oasc.SolrDeletionPolicy.onInit SolrDeletionPolicy.onInit: commits: num=1
   [junit4]   2> 		commit{dir=MockDirectoryWrapper(NRTCachingDirectory(RAMDirectory@8b80e74 lockFactory=org.apache.lucene.store.SingleInstanceLockFactory@6bbce624; maxCacheMB=0.64453125 maxMergeSizeMB=0.4853515625)),segFN=segments_1,generation=1}
   [junit4]   2> 1017073 T3794 oass.OpenExchangeRatesOrgProvider$OpenExchangeRates.<init> WARN Expected key, got STRING
   [junit4]   2> 1017073 T3721 oasc.SolrDeletionPolicy.updateCommits newest commit generation = 1
   [junit4]   2> 1017074 T3794 oass.OpenExchangeRatesOrgProvider.reload Reloading exchange rates from open-exchange-rates.json
   [junit4]   2> 1017074 T3721 oass.SolrIndexSearcher.<init> Opening Searcher@f416524[nodes_used_collection_shard2_replica1] main
   [junit4]   2> 1017075 T3721 oascc.ZkStateReader.readConfigName Load collection config from:/collections/nodes_used_collection
   [junit4]   2> 1017075 T3794 oass.OpenExchangeRatesOrgProvider$OpenExchangeRates.<init> WARN Unknown key IMPORTANT NOTE
   [junit4]   2> 1017075 T3794 oass.OpenExchangeRatesOrgProvider$OpenExchangeRates.<init> WARN Expected key, got STRING
   [junit4]   2> 1017075 T3721 oascc.ZkStateReader.readConfigName path=/collections/nodes_used_collection configName=conf1 specified config exists in ZooKeeper
   [junit4]   2> 1017076 T3762 oass.OpenExchangeRatesOrgProvider.init Initialized with rates=open-exchange-rates.json, refreshInterval=1440.
   [junit4]   2> 1017076 T3721 oasr.ManagedResourceStorage.newStorageIO Setting up ZooKeeper-based storage for the RestManager with znodeBase: /configs/conf1
   [junit4]   2> 1017076 T3794 oasc.CoreContainer.create Creating SolrCore 'nodes_used_collection_shard2_replica2' using configuration from collection nodes_used_collection
   [junit4]   2> 1017077 T3721 oasr.ManagedResourceStorage$ZooKeeperStorageIO.configure Configured ZooKeeperStorageIO with znodeBase: /configs/conf1
   [junit4]   2> 1017077 T3794 oasc.SolrCore.initDirectoryFactory org.apache.solr.core.MockDirectoryFactory
   [junit4]   2> 1017077 T3721 oasr.RestManager.init Initializing RestManager with initArgs: {}
   [junit4]   2> 1017078 T3747 oasup.UpdateRequestProcessorChain.init creating updateRequestProcessorChain "nodistrib"
   [junit4]   2> 1017078 T3721 oasr.ManagedResourceStorage.load Reading _rest_managed.json using ZooKeeperStorageIO:path=/configs/conf1
   [junit4]   2> 1017078 T3794 oasc.SolrCore.<init> [nodes_used_collection_shard2_replica2] Opening new SolrCore at ../../../../../../../../../../../usr/home/jenkins/jenkins-slave/workspace/Lucene-Solr-NightlyTests-5.x/solr/build/solr-core/test/J3/temp/solr.cloud.CollectionsAPIDistributedZkTest-9A497961AA667343-001/tempDir-006/nodes_used_collection_shard2_replica2/, dataDir=/usr/home/jenkins/jenkins-slave/workspace/Lucene-Solr-NightlyTests-5.x/solr/build/solr-core/test/J3/../../../../../../../../../../../usr/home/jenkins/jenkins-slave/workspace/Lucene-Solr-NightlyTests-5.x/solr/build/solr-core/test/J3/temp/solr.cloud.CollectionsAPIDistributedZkTest-9A497961AA667343-001/tempDir-006/nodes_used_collection_shard2_replica2/data/
   [junit4]   2> 1017079 T3721 oasr.ManagedResourceStorage$ZooKeeperStorageIO.openInputStream No data found for znode /configs/conf1/_rest_managed.json
   [junit4]   2> 1017079 T3794 oasc.JmxMonitoredMap.<init> JMX monitoring is enabled. Adding Solr mbeans to JMX Server: com.sun.jmx.mbeanserver.JmxMBeanServer@51215391
   [junit4]   2> 1017078 T3747 oasup.UpdateRequestProcessorChain.init creating updateRequestProcessorChain "dedupe"
   [junit4]   2> 1017079 T3721 oasr.ManagedResourceStorage.load Loaded null at path _rest_managed.json using ZooKeeperStorageIO:path=/configs/conf1
   [junit4]   2> 1017080 T3794 oasc.CachingDirectoryFactory.get return new directory for /usr/home/jenkins/jenkins-slave/workspace/Lucene-Solr-NightlyTests-5.x/solr/build/solr-core/test/J3/../../../../../../../../../../../usr/home/jenkins/jenkins-slave/workspace/Lucene-Solr-NightlyTests-5.x/solr/build/solr-core/test/J3/temp/solr.cloud.CollectionsAPIDistributedZkTest-9A497961AA667343-001/tempDir-006/nodes_used_collection_shard2_replica2/data
   [junit4]   2> 1017080 T3721 oasr.RestManager.init Initializing 0 registered ManagedResources
   [junit4]   2> 1017080 T3747 oasup.UpdateRequestProcessorChain.init inserting DistributedUpdateProcessorFactory into updateRequestProcessorChain "dedupe"
   [junit4]   2> 1017081 T3721 oash.ReplicationHandler.inform Commits will be reserved for  10000
   [junit4]   2> 1017081 T3794 oasc.SolrCore.getNewIndexDir New index directory detected: old=null new=/usr/home/jenkins/jenkins-slave/workspace/Lucene-Solr-NightlyTests-5.x/solr/build/solr-core/test/J3/../../../../../../../../../../../usr/home/jenkins/jenkins-slave/workspace/Lucene-Solr-NightlyTests-5.x/solr/build/solr-core/test/J3/temp/solr.cloud.CollectionsAPIDistributedZkTest-9A497961AA667343-001/tempDir-006/nodes_used_collection_shard2_replica2/data/index/
   [junit4]   2> 1017082 T3721 oasc.CoreContainer.registerCore registering core: nodes_used_collection_shard2_replica1
   [junit4]   2> 1017082 T3813 oasc.SolrCore.registerSearcher [nodes_used_collection_shard2_replica1] Registered new searcher Searcher@f416524[nodes_used_collection_shard2_replica1] main{ExitableDirectoryReader(UninvertingDirectoryReader())}
   [junit4]   2> 1017082 T3762 oass.IndexSchema.readSchema default search field in schema is text
   [junit4]   2> 1017081 T3747 oasup.UpdateRequestProcessorChain.init creating updateRequestProcessorChain "stored_sig"
   [junit4]   2> 1017082 T3721 oasc.ZkController.register Register replica - core:nodes_used_collection_shard2_replica1 address:http://127.0.0.1:41116 collection:nodes_used_collection shard:shard2
   [junit4]   2> 1017082 T3794 oasc.SolrCore.initIndex WARN [nodes_used_collection_shard2_replica2] Solr index directory '/usr/home/jenkins/jenkins-slave/workspace/Lucene-Solr-NightlyTests-5.x/solr/build/solr-core/test/J3/../../../../../../../../../../../usr/home/jenkins/jenkins-slave/workspace/Lucene-Solr-NightlyTests-5.x/solr/build/solr-core/test/J3/temp/solr.cloud.CollectionsAPIDistributedZkTest-9A497961AA667343-001/tempDir-006/nodes_used_collection_shard2_replica2/data/index' doesn't exist. Creating new index...
   [junit4]   2> 1017083 T3747 oasup.UpdateRequestProcessorChain.init inserting DistributedUpdateProcessorFactory into updateRequestProcessorChain "stored_sig"
   [junit4]   2> 1017084 T3794 oasc.CachingDirectoryFactory.get return new directory for /usr/home/jenkins/jenkins-slave/workspace/Lucene-Solr-NightlyTests-5.x/solr/build/solr-core/test/J3/../../../../../../../../../../../usr/home/jenk

[...truncated too long message...]

oud.AbstractFullDistribZkTestBase.createCollection(AbstractFullDistribZkTestBase.java:1661)
   [junit4]    > 	at org.apache.solr.cloud.CollectionsAPIDistributedZkTest$1CollectionThread.run(CollectionsAPIDistributedZkTest.java:908)
   [junit4]    > Caused by: org.apache.solr.client.solrj.impl.HttpSolrServer$RemoteSolrException: Error from server at http://127.0.0.1:53096: Could not fully create collection: awholynewstresscollection_collection5_1
   [junit4]    > 	at org.apache.solr.client.solrj.impl.HttpSolrServer.executeMethod(HttpSolrServer.java:566)
   [junit4]    > 	at org.apache.solr.client.solrj.impl.HttpSolrServer.request(HttpSolrServer.java:213)
   [junit4]    > 	at org.apache.solr.client.solrj.impl.HttpSolrServer.request(HttpSolrServer.java:209)
   [junit4]    > 	at org.apache.solr.client.solrj.impl.LBHttpSolrServer.doRequest(LBHttpSolrServer.java:354)
   [junit4]    > 	at org.apache.solr.client.solrj.impl.LBHttpSolrServer.request(LBHttpSolrServer.java:313)
   [junit4]    > 	... 6 moreThrowable #6: com.carrotsearch.randomizedtesting.UncaughtExceptionError: Captured an uncaught exception in thread: Thread[id=4081, name=Thread-862, state=RUNNABLE, group=TGRP-CollectionsAPIDistributedZkTest]
   [junit4]    > Caused by: java.lang.RuntimeException: org.apache.solr.client.solrj.SolrServerException: No live SolrServers available to handle this request:[http://127.0.0.1:54363, http://127.0.0.1:53096, http://127.0.0.1:58247, http://127.0.0.1:41116, http://127.0.0.1:61959]
   [junit4]    > 	at __randomizedtesting.SeedInfo.seed([9A497961AA667343]:0)
   [junit4]    > 	at org.apache.solr.cloud.CollectionsAPIDistributedZkTest$1CollectionThread.run(CollectionsAPIDistributedZkTest.java:918)
   [junit4]    > Caused by: org.apache.solr.client.solrj.SolrServerException: No live SolrServers available to handle this request:[http://127.0.0.1:54363, http://127.0.0.1:53096, http://127.0.0.1:58247, http://127.0.0.1:41116, http://127.0.0.1:61959]
   [junit4]    > 	at org.apache.solr.client.solrj.impl.LBHttpSolrServer.request(LBHttpSolrServer.java:333)
   [junit4]    > 	at org.apache.solr.client.solrj.impl.CloudSolrServer.sendRequest(CloudSolrServer.java:1015)
   [junit4]    > 	at org.apache.solr.client.solrj.impl.CloudSolrServer.requestWithRetryOnStaleState(CloudSolrServer.java:793)
   [junit4]    > 	at org.apache.solr.client.solrj.impl.CloudSolrServer.request(CloudSolrServer.java:736)
   [junit4]    > 	at org.apache.solr.cloud.AbstractFullDistribZkTestBase.createCollection(AbstractFullDistribZkTestBase.java:1640)
   [junit4]    > 	at org.apache.solr.cloud.AbstractFullDistribZkTestBase.createCollection(AbstractFullDistribZkTestBase.java:1661)
   [junit4]    > 	at org.apache.solr.cloud.CollectionsAPIDistributedZkTest$1CollectionThread.run(CollectionsAPIDistributedZkTest.java:908)
   [junit4]    > Caused by: org.apache.solr.client.solrj.impl.HttpSolrServer$RemoteSolrException: Error from server at http://127.0.0.1:53096: Could not fully create collection: awholynewstresscollection_collection0_1
   [junit4]    > 	at org.apache.solr.client.solrj.impl.HttpSolrServer.executeMethod(HttpSolrServer.java:566)
   [junit4]    > 	at org.apache.solr.client.solrj.impl.HttpSolrServer.request(HttpSolrServer.java:213)
   [junit4]    > 	at org.apache.solr.client.solrj.impl.HttpSolrServer.request(HttpSolrServer.java:209)
   [junit4]    > 	at org.apache.solr.client.solrj.impl.LBHttpSolrServer.doRequest(LBHttpSolrServer.java:354)
   [junit4]    > 	at org.apache.solr.client.solrj.impl.LBHttpSolrServer.request(LBHttpSolrServer.java:313)
   [junit4]    > 	... 6 moreThrowable #7: com.carrotsearch.randomizedtesting.UncaughtExceptionError: Captured an uncaught exception in thread: Thread[id=4083, name=Thread-864, state=RUNNABLE, group=TGRP-CollectionsAPIDistributedZkTest]
   [junit4]    > Caused by: java.lang.RuntimeException: org.apache.solr.client.solrj.SolrServerException: No live SolrServers available to handle this request:[http://127.0.0.1:54363, http://127.0.0.1:53096, http://127.0.0.1:58247, http://127.0.0.1:41116, http://127.0.0.1:61959]
   [junit4]    > 	at __randomizedtesting.SeedInfo.seed([9A497961AA667343]:0)
   [junit4]    > 	at org.apache.solr.cloud.CollectionsAPIDistributedZkTest$1CollectionThread.run(CollectionsAPIDistributedZkTest.java:918)
   [junit4]    > Caused by: org.apache.solr.client.solrj.SolrServerException: No live SolrServers available to handle this request:[http://127.0.0.1:54363, http://127.0.0.1:53096, http://127.0.0.1:58247, http://127.0.0.1:41116, http://127.0.0.1:61959]
   [junit4]    > 	at org.apache.solr.client.solrj.impl.LBHttpSolrServer.request(LBHttpSolrServer.java:333)
   [junit4]    > 	at org.apache.solr.client.solrj.impl.CloudSolrServer.sendRequest(CloudSolrServer.java:1015)
   [junit4]    > 	at org.apache.solr.client.solrj.impl.CloudSolrServer.requestWithRetryOnStaleState(CloudSolrServer.java:793)
   [junit4]    > 	at org.apache.solr.client.solrj.impl.CloudSolrServer.request(CloudSolrServer.java:736)
   [junit4]    > 	at org.apache.solr.cloud.AbstractFullDistribZkTestBase.createCollection(AbstractFullDistribZkTestBase.java:1640)
   [junit4]    > 	at org.apache.solr.cloud.AbstractFullDistribZkTestBase.createCollection(AbstractFullDistribZkTestBase.java:1661)
   [junit4]    > 	at org.apache.solr.cloud.CollectionsAPIDistributedZkTest$1CollectionThread.run(CollectionsAPIDistributedZkTest.java:908)
   [junit4]    > Caused by: org.apache.solr.client.solrj.impl.HttpSolrServer$RemoteSolrException: Error from server at http://127.0.0.1:53096: Could not fully create collection: awholynewstresscollection_collection2_2
   [junit4]    > 	at org.apache.solr.client.solrj.impl.HttpSolrServer.executeMethod(HttpSolrServer.java:566)
   [junit4]    > 	at org.apache.solr.client.solrj.impl.HttpSolrServer.request(HttpSolrServer.java:213)
   [junit4]    > 	at org.apache.solr.client.solrj.impl.HttpSolrServer.request(HttpSolrServer.java:209)
   [junit4]    > 	at org.apache.solr.client.solrj.impl.LBHttpSolrServer.doRequest(LBHttpSolrServer.java:354)
   [junit4]    > 	at org.apache.solr.client.solrj.impl.LBHttpSolrServer.request(LBHttpSolrServer.java:313)
   [junit4]    > 	... 6 more
   [junit4]   2> 1989822 T3707 oas.SolrTestCaseJ4.deleteCore ###deleteCore
   [junit4]   2> NOTE: leaving temporary files on disk at: /usr/home/jenkins/jenkins-slave/workspace/Lucene-Solr-NightlyTests-5.x/solr/build/solr-core/test/J3/temp/solr.cloud.CollectionsAPIDistributedZkTest-9A497961AA667343-001
   [junit4]   2> NOTE: test params are: codec=Asserting(Lucene50): {other_tl1=TestBloomFilteredLucenePostings(BloomFilteringPostingsFormat(Lucene50(blocksize=128))), multiDefault=FST50, id=BlockTreeOrds(blocksize=128), a_t=FST50, _version_=TestBloomFilteredLucenePostings(BloomFilteringPostingsFormat(Lucene50(blocksize=128))), timestamp=FST50, a_i1=FST50, text=PostingsFormat(name=Memory doPackFST= false), intDefault=TestBloomFilteredLucenePostings(BloomFilteringPostingsFormat(Lucene50(blocksize=128))), range_facet_l=FST50}, docValues:{timestamp=DocValuesFormat(name=Memory)}, sim=RandomSimilarityProvider(queryNorm=false,coord=crazy): {}, locale=cs_CZ, timezone=Africa/Addis_Ababa
   [junit4]   2> NOTE: FreeBSD 9.1-RELEASE-p3 amd64/Oracle Corporation 1.7.0_65 (64-bit)/cpus=16,threads=1,free=132134400,total=374865920
   [junit4]   2> NOTE: All tests run in this JVM: [SystemInfoHandlerTest, TestFastOutputStream, TestIndexSearcher, TestSolrQueryParserResource, SSLMigrationTest, TestSchemaManager, TestSolrIndexConfig, TestGroupingSearch, TestConfigReload, UnloadDistributedZkTest, TestCloudManagedSchemaConcurrent, TestManagedResourceStorage, DocValuesMultiTest, TestJoin, TestSystemIdResolver, SuggesterWFSTTest, SoftAutoCommitTest, TestSolrXml, TestRestManager, DistributedDebugComponentTest, DistributedQueueTest, AnalysisAfterCoreReloadTest, SolrCoreTest, TestDynamicFieldResource, TestWriterPerf, TestSolrJ, CloudMLTQParserTest, TestPseudoReturnFields, UUIDFieldTest, TestConfigOverlay, BinaryUpdateRequestHandlerTest, ShardRoutingTest, TestValueSourceCache, TestManagedStopFilterFactory, HdfsUnloadDistributedZkTest, LeaderElectionTest, TestDynamicLoading, TestSurroundQueryParser, JsonLoaderTest, CoreMergeIndexesAdminHandlerTest, CSVRequestHandlerTest, CollectionsAPIDistributedZkTest]
   [junit4] Completed on J3 in 991.62s, 1 test, 1 error <<< FAILURES!

[...truncated 1006 lines...]
BUILD FAILED
/usr/home/jenkins/jenkins-slave/workspace/Lucene-Solr-NightlyTests-5.x/build.xml:536: The following error occurred while executing this line:
/usr/home/jenkins/jenkins-slave/workspace/Lucene-Solr-NightlyTests-5.x/build.xml:477: The following error occurred while executing this line:
/usr/home/jenkins/jenkins-slave/workspace/Lucene-Solr-NightlyTests-5.x/build.xml:61: The following error occurred while executing this line:
/usr/home/jenkins/jenkins-slave/workspace/Lucene-Solr-NightlyTests-5.x/extra-targets.xml:39: The following error occurred while executing this line:
/usr/home/jenkins/jenkins-slave/workspace/Lucene-Solr-NightlyTests-5.x/solr/build.xml:190: The following error occurred while executing this line:
/usr/home/jenkins/jenkins-slave/workspace/Lucene-Solr-NightlyTests-5.x/solr/common-build.xml:508: The following error occurred while executing this line:
/usr/home/jenkins/jenkins-slave/workspace/Lucene-Solr-NightlyTests-5.x/lucene/common-build.xml:1363: The following error occurred while executing this line:
/usr/home/jenkins/jenkins-slave/workspace/Lucene-Solr-NightlyTests-5.x/lucene/common-build.xml:970: There were test failures: 453 suites, 1855 tests, 1 error, 57 ignored (10 assumptions)

Total time: 183 minutes 36 seconds
Build step 'Invoke Ant' marked build as failure
Archiving artifacts
Sending artifact delta relative to Lucene-Solr-NightlyTests-5.x #716
Archived 5 artifacts
Archive block size is 32768
Received 0 blocks and 860315882 bytes
Compression is 0.0%
Took 2 min 52 sec
Recording test results
Email was triggered for: Failure
Sending email for trigger: Failure



Mime
View raw message