lucene-dev mailing list archives

Site index · List index
Message view « Date » · « Thread »
Top « Date » · « Thread »
From Apache Jenkins Server <jenk...@builds.apache.org>
Subject [JENKINS] Lucene-Solr-NightlyTests-5.x - Build # 714 - Still Failing
Date Thu, 25 Dec 2014 21:13:44 GMT
Build: https://builds.apache.org/job/Lucene-Solr-NightlyTests-5.x/714/

1 tests failed.
FAILED:  org.apache.solr.cloud.CollectionsAPIDistributedZkTest.testDistribSearch

Error Message:
Error from server at http://127.0.0.1:65319/t_/vu: java.lang.NullPointerException 

Stack Trace:
org.apache.solr.client.solrj.impl.HttpSolrServer$RemoteSolrException: Error from server at http://127.0.0.1:65319/t_/vu: java.lang.NullPointerException

	at org.apache.solr.client.solrj.impl.HttpSolrServer.executeMethod(HttpSolrServer.java:566)
	at org.apache.solr.client.solrj.impl.HttpSolrServer.request(HttpSolrServer.java:213)
	at org.apache.solr.client.solrj.impl.HttpSolrServer.request(HttpSolrServer.java:209)
	at org.apache.solr.cloud.CollectionsAPIDistributedZkTest.testErrorHandling(CollectionsAPIDistributedZkTest.java:452)
	at org.apache.solr.cloud.CollectionsAPIDistributedZkTest.doTest(CollectionsAPIDistributedZkTest.java:201)
	at org.apache.solr.BaseDistributedSearchTestCase.testDistribSearch(BaseDistributedSearchTestCase.java:869)
	at sun.reflect.NativeMethodAccessorImpl.invoke0(Native Method)
	at sun.reflect.NativeMethodAccessorImpl.invoke(NativeMethodAccessorImpl.java:57)
	at sun.reflect.DelegatingMethodAccessorImpl.invoke(DelegatingMethodAccessorImpl.java:43)
	at java.lang.reflect.Method.invoke(Method.java:606)
	at com.carrotsearch.randomizedtesting.RandomizedRunner.invoke(RandomizedRunner.java:1618)
	at com.carrotsearch.randomizedtesting.RandomizedRunner$6.evaluate(RandomizedRunner.java:827)
	at com.carrotsearch.randomizedtesting.RandomizedRunner$7.evaluate(RandomizedRunner.java:863)
	at com.carrotsearch.randomizedtesting.RandomizedRunner$8.evaluate(RandomizedRunner.java:877)
	at com.carrotsearch.randomizedtesting.rules.SystemPropertiesRestoreRule$1.evaluate(SystemPropertiesRestoreRule.java:53)
	at org.apache.lucene.util.TestRuleSetupTeardownChained$1.evaluate(TestRuleSetupTeardownChained.java:50)
	at org.apache.lucene.util.AbstractBeforeAfterRule$1.evaluate(AbstractBeforeAfterRule.java:46)
	at com.carrotsearch.randomizedtesting.rules.SystemPropertiesInvariantRule$1.evaluate(SystemPropertiesInvariantRule.java:55)
	at org.apache.lucene.util.TestRuleThreadAndTestName$1.evaluate(TestRuleThreadAndTestName.java:49)
	at org.apache.lucene.util.TestRuleIgnoreAfterMaxFailures$1.evaluate(TestRuleIgnoreAfterMaxFailures.java:65)
	at org.apache.lucene.util.TestRuleMarkFailure$1.evaluate(TestRuleMarkFailure.java:48)
	at com.carrotsearch.randomizedtesting.rules.StatementAdapter.evaluate(StatementAdapter.java:36)
	at com.carrotsearch.randomizedtesting.ThreadLeakControl$StatementRunner.run(ThreadLeakControl.java:365)
	at com.carrotsearch.randomizedtesting.ThreadLeakControl.forkTimeoutingTask(ThreadLeakControl.java:798)
	at com.carrotsearch.randomizedtesting.ThreadLeakControl$3.evaluate(ThreadLeakControl.java:458)
	at com.carrotsearch.randomizedtesting.RandomizedRunner.runSingleTest(RandomizedRunner.java:836)
	at com.carrotsearch.randomizedtesting.RandomizedRunner$3.evaluate(RandomizedRunner.java:738)
	at com.carrotsearch.randomizedtesting.RandomizedRunner$4.evaluate(RandomizedRunner.java:772)
	at com.carrotsearch.randomizedtesting.RandomizedRunner$5.evaluate(RandomizedRunner.java:783)
	at com.carrotsearch.randomizedtesting.rules.StatementAdapter.evaluate(StatementAdapter.java:36)
	at com.carrotsearch.randomizedtesting.rules.SystemPropertiesRestoreRule$1.evaluate(SystemPropertiesRestoreRule.java:53)
	at org.apache.lucene.util.AbstractBeforeAfterRule$1.evaluate(AbstractBeforeAfterRule.java:46)
	at org.apache.lucene.util.TestRuleStoreClassName$1.evaluate(TestRuleStoreClassName.java:42)
	at com.carrotsearch.randomizedtesting.rules.SystemPropertiesInvariantRule$1.evaluate(SystemPropertiesInvariantRule.java:55)
	at com.carrotsearch.randomizedtesting.rules.NoShadowingOrOverridesOnMethodsRule$1.evaluate(NoShadowingOrOverridesOnMethodsRule.java:39)
	at com.carrotsearch.randomizedtesting.rules.NoShadowingOrOverridesOnMethodsRule$1.evaluate(NoShadowingOrOverridesOnMethodsRule.java:39)
	at com.carrotsearch.randomizedtesting.rules.StatementAdapter.evaluate(StatementAdapter.java:36)
	at com.carrotsearch.randomizedtesting.rules.StatementAdapter.evaluate(StatementAdapter.java:36)
	at com.carrotsearch.randomizedtesting.rules.StatementAdapter.evaluate(StatementAdapter.java:36)
	at org.apache.lucene.util.TestRuleAssertionsRequired$1.evaluate(TestRuleAssertionsRequired.java:54)
	at org.apache.lucene.util.TestRuleMarkFailure$1.evaluate(TestRuleMarkFailure.java:48)
	at org.apache.lucene.util.TestRuleIgnoreAfterMaxFailures$1.evaluate(TestRuleIgnoreAfterMaxFailures.java:65)
	at org.apache.lucene.util.TestRuleIgnoreTestSuites$1.evaluate(TestRuleIgnoreTestSuites.java:55)
	at com.carrotsearch.randomizedtesting.rules.StatementAdapter.evaluate(StatementAdapter.java:36)
	at com.carrotsearch.randomizedtesting.ThreadLeakControl$StatementRunner.run(ThreadLeakControl.java:365)
	at java.lang.Thread.run(Thread.java:745)




Build Log:
[...truncated 10346 lines...]
   [junit4] Suite: org.apache.solr.cloud.CollectionsAPIDistributedZkTest
   [junit4]   2> Creating dataDir: /usr/home/jenkins/jenkins-slave/workspace/Lucene-Solr-NightlyTests-5.x/solr/build/solr-core/test/J3/temp/solr.cloud.CollectionsAPIDistributedZkTest-D0BBE4846841C4A4-001/init-core-data-001
   [junit4]   2> 1541292 T4401 oas.SolrTestCaseJ4.buildSSLConfig Randomized ssl (false) and clientAuth (false)
   [junit4]   2> 1541292 T4401 oas.BaseDistributedSearchTestCase.initHostContext Setting hostContext system property: /t_/vu
   [junit4]   2> 1541298 T4401 oas.SolrTestCaseJ4.setUp ###Starting testDistribSearch
   [junit4]   2> 1541299 T4401 oasc.ZkTestServer.run STARTING ZK TEST SERVER
   [junit4]   1> client port:0.0.0.0/0.0.0.0:0
   [junit4]   2> 1541300 T4402 oasc.ZkTestServer$ZKServerMain.runFromConfig Starting server
   [junit4]   2> 1541400 T4401 oasc.ZkTestServer.run start zk server on port:65310
   [junit4]   2> 1541401 T4401 oascc.SolrZkClient.createZkCredentialsToAddAutomatically Using default ZkCredentialsProvider
   [junit4]   2> 1541402 T4401 oascc.ConnectionManager.waitForConnected Waiting for client to connect to ZooKeeper
   [junit4]   2> 1541406 T4409 oascc.ConnectionManager.process Watcher org.apache.solr.common.cloud.ConnectionManager@7533c3e6 name:ZooKeeperConnection Watcher:127.0.0.1:65310 got event WatchedEvent state:SyncConnected type:None path:null path:null type:None
   [junit4]   2> 1541406 T4401 oascc.ConnectionManager.waitForConnected Client is connected to ZooKeeper
   [junit4]   2> 1541406 T4401 oascc.SolrZkClient.createZkACLProvider Using default ZkACLProvider
   [junit4]   2> 1541407 T4401 oascc.SolrZkClient.makePath makePath: /solr
   [junit4]   2> 1541409 T4401 oascc.SolrZkClient.createZkCredentialsToAddAutomatically Using default ZkCredentialsProvider
   [junit4]   2> 1541410 T4401 oascc.ConnectionManager.waitForConnected Waiting for client to connect to ZooKeeper
   [junit4]   2> 1541412 T4412 oascc.ConnectionManager.process Watcher org.apache.solr.common.cloud.ConnectionManager@41f66c55 name:ZooKeeperConnection Watcher:127.0.0.1:65310/solr got event WatchedEvent state:SyncConnected type:None path:null path:null type:None
   [junit4]   2> 1541412 T4401 oascc.ConnectionManager.waitForConnected Client is connected to ZooKeeper
   [junit4]   2> 1541412 T4401 oascc.SolrZkClient.createZkACLProvider Using default ZkACLProvider
   [junit4]   2> 1541412 T4401 oascc.SolrZkClient.makePath makePath: /collections/collection1
   [junit4]   2> 1541414 T4401 oascc.SolrZkClient.makePath makePath: /collections/collection1/shards
   [junit4]   2> 1541416 T4401 oascc.SolrZkClient.makePath makePath: /collections/control_collection
   [junit4]   2> 1541417 T4401 oascc.SolrZkClient.makePath makePath: /collections/control_collection/shards
   [junit4]   2> 1541419 T4401 oasc.AbstractZkTestCase.putConfig put /usr/home/jenkins/jenkins-slave/workspace/Lucene-Solr-NightlyTests-5.x/solr/core/src/test-files/solr/collection1/conf/solrconfig-tlog.xml to /configs/conf1/solrconfig.xml
   [junit4]   2> 1541420 T4401 oascc.SolrZkClient.makePath makePath: /configs/conf1/solrconfig.xml
   [junit4]   2> 1541422 T4401 oasc.AbstractZkTestCase.putConfig put /usr/home/jenkins/jenkins-slave/workspace/Lucene-Solr-NightlyTests-5.x/solr/core/src/test-files/solr/collection1/conf/schema.xml to /configs/conf1/schema.xml
   [junit4]   2> 1541423 T4401 oascc.SolrZkClient.makePath makePath: /configs/conf1/schema.xml
   [junit4]   2> 1541525 T4401 oasc.AbstractZkTestCase.putConfig put /usr/home/jenkins/jenkins-slave/workspace/Lucene-Solr-NightlyTests-5.x/solr/core/src/test-files/solr/collection1/conf/solrconfig.snippet.randomindexconfig.xml to /configs/conf1/solrconfig.snippet.randomindexconfig.xml
   [junit4]   2> 1541526 T4401 oascc.SolrZkClient.makePath makePath: /configs/conf1/solrconfig.snippet.randomindexconfig.xml
   [junit4]   2> 1541528 T4401 oasc.AbstractZkTestCase.putConfig put /usr/home/jenkins/jenkins-slave/workspace/Lucene-Solr-NightlyTests-5.x/solr/core/src/test-files/solr/collection1/conf/stopwords.txt to /configs/conf1/stopwords.txt
   [junit4]   2> 1541528 T4401 oascc.SolrZkClient.makePath makePath: /configs/conf1/stopwords.txt
   [junit4]   2> 1541530 T4401 oasc.AbstractZkTestCase.putConfig put /usr/home/jenkins/jenkins-slave/workspace/Lucene-Solr-NightlyTests-5.x/solr/core/src/test-files/solr/collection1/conf/protwords.txt to /configs/conf1/protwords.txt
   [junit4]   2> 1541531 T4401 oascc.SolrZkClient.makePath makePath: /configs/conf1/protwords.txt
   [junit4]   2> 1541533 T4401 oasc.AbstractZkTestCase.putConfig put /usr/home/jenkins/jenkins-slave/workspace/Lucene-Solr-NightlyTests-5.x/solr/core/src/test-files/solr/collection1/conf/currency.xml to /configs/conf1/currency.xml
   [junit4]   2> 1541533 T4401 oascc.SolrZkClient.makePath makePath: /configs/conf1/currency.xml
   [junit4]   2> 1541535 T4401 oasc.AbstractZkTestCase.putConfig put /usr/home/jenkins/jenkins-slave/workspace/Lucene-Solr-NightlyTests-5.x/solr/core/src/test-files/solr/collection1/conf/enumsConfig.xml to /configs/conf1/enumsConfig.xml
   [junit4]   2> 1541536 T4401 oascc.SolrZkClient.makePath makePath: /configs/conf1/enumsConfig.xml
   [junit4]   2> 1541538 T4401 oasc.AbstractZkTestCase.putConfig put /usr/home/jenkins/jenkins-slave/workspace/Lucene-Solr-NightlyTests-5.x/solr/core/src/test-files/solr/collection1/conf/open-exchange-rates.json to /configs/conf1/open-exchange-rates.json
   [junit4]   2> 1541538 T4401 oascc.SolrZkClient.makePath makePath: /configs/conf1/open-exchange-rates.json
   [junit4]   2> 1541540 T4401 oasc.AbstractZkTestCase.putConfig put /usr/home/jenkins/jenkins-slave/workspace/Lucene-Solr-NightlyTests-5.x/solr/core/src/test-files/solr/collection1/conf/mapping-ISOLatin1Accent.txt to /configs/conf1/mapping-ISOLatin1Accent.txt
   [junit4]   2> 1541541 T4401 oascc.SolrZkClient.makePath makePath: /configs/conf1/mapping-ISOLatin1Accent.txt
   [junit4]   2> 1541543 T4401 oasc.AbstractZkTestCase.putConfig put /usr/home/jenkins/jenkins-slave/workspace/Lucene-Solr-NightlyTests-5.x/solr/core/src/test-files/solr/collection1/conf/old_synonyms.txt to /configs/conf1/old_synonyms.txt
   [junit4]   2> 1541543 T4401 oascc.SolrZkClient.makePath makePath: /configs/conf1/old_synonyms.txt
   [junit4]   2> 1541545 T4401 oasc.AbstractZkTestCase.putConfig put /usr/home/jenkins/jenkins-slave/workspace/Lucene-Solr-NightlyTests-5.x/solr/core/src/test-files/solr/collection1/conf/synonyms.txt to /configs/conf1/synonyms.txt
   [junit4]   2> 1541546 T4401 oascc.SolrZkClient.makePath makePath: /configs/conf1/synonyms.txt
   [junit4]   2> Using old style solr.xml
   [junit4]   2> 1543081 T4401 oejs.Server.doStart jetty-8.1.10.v20130312
   [junit4]   2> 1543086 T4401 oejs.AbstractConnector.doStart Started SocketConnector@127.0.0.1:65313
   [junit4]   2> 1543087 T4401 oass.SolrDispatchFilter.init SolrDispatchFilter.init()sun.misc.Launcher$AppClassLoader@631d75b9
   [junit4]   2> 1543087 T4401 oasc.SolrResourceLoader.locateSolrHome JNDI not configured for solr (NoInitialContextEx)
   [junit4]   2> 1543087 T4401 oasc.SolrResourceLoader.locateSolrHome using system property solr.solr.home: /usr/home/jenkins/jenkins-slave/workspace/Lucene-Solr-NightlyTests-5.x/solr/build/solr-core/test/J3/temp/solr.cloud.CollectionsAPIDistributedZkTest-D0BBE4846841C4A4-001/tempDir-002
   [junit4]   2> 1543088 T4401 oasc.SolrResourceLoader.<init> new SolrResourceLoader for directory: '/usr/home/jenkins/jenkins-slave/workspace/Lucene-Solr-NightlyTests-5.x/solr/build/solr-core/test/J3/temp/solr.cloud.CollectionsAPIDistributedZkTest-D0BBE4846841C4A4-001/tempDir-002/'
   [junit4]   2> 1543132 T4401 oasc.ConfigSolr.fromFile Loading container configuration from /usr/home/jenkins/jenkins-slave/workspace/Lucene-Solr-NightlyTests-5.x/solr/build/solr-core/test/J3/temp/solr.cloud.CollectionsAPIDistributedZkTest-D0BBE4846841C4A4-001/tempDir-002/solr.xml
   [junit4]   2> 1543207 T4401 oasc.CoreContainer.<init> New CoreContainer 254007351
   [junit4]   2> 1543207 T4401 oasc.CoreContainer.load Loading cores into CoreContainer [instanceDir=/usr/home/jenkins/jenkins-slave/workspace/Lucene-Solr-NightlyTests-5.x/solr/build/solr-core/test/J3/temp/solr.cloud.CollectionsAPIDistributedZkTest-D0BBE4846841C4A4-001/tempDir-002/]
   [junit4]   2> 1543208 T4401 oashc.HttpShardHandlerFactory.getParameter Setting socketTimeout to: 120000
   [junit4]   2> 1543209 T4401 oashc.HttpShardHandlerFactory.getParameter Setting urlScheme to: null
   [junit4]   2> 1543209 T4401 oashc.HttpShardHandlerFactory.getParameter Setting connTimeout to: 15000
   [junit4]   2> 1543209 T4401 oashc.HttpShardHandlerFactory.getParameter Setting maxConnectionsPerHost to: 20
   [junit4]   2> 1543209 T4401 oashc.HttpShardHandlerFactory.getParameter Setting maxConnections to: 10000
   [junit4]   2> 1543209 T4401 oashc.HttpShardHandlerFactory.getParameter Setting corePoolSize to: 0
   [junit4]   2> 1543210 T4401 oashc.HttpShardHandlerFactory.getParameter Setting maximumPoolSize to: 2147483647
   [junit4]   2> 1543210 T4401 oashc.HttpShardHandlerFactory.getParameter Setting maxThreadIdleTime to: 5
   [junit4]   2> 1543210 T4401 oashc.HttpShardHandlerFactory.getParameter Setting sizeOfQueue to: -1
   [junit4]   2> 1543210 T4401 oashc.HttpShardHandlerFactory.getParameter Setting fairnessPolicy to: false
   [junit4]   2> 1543211 T4401 oasu.UpdateShardHandler.<init> Creating UpdateShardHandler HTTP client with params: socketTimeout=3400000&connTimeout=45000&retry=false
   [junit4]   2> 1543211 T4401 oasl.LogWatcher.createWatcher SLF4J impl is org.slf4j.impl.Log4jLoggerFactory
   [junit4]   2> 1543211 T4401 oasl.LogWatcher.newRegisteredLogWatcher Registering Log Listener [Log4j (org.slf4j.impl.Log4jLoggerFactory)]
   [junit4]   2> 1543211 T4401 oasc.CoreContainer.load Host Name: 127.0.0.1
   [junit4]   2> 1543212 T4401 oasc.ZkContainer.initZooKeeper Zookeeper client=127.0.0.1:65310/solr
   [junit4]   2> 1543212 T4401 oasc.ZkController.checkChrootPath zkHost includes chroot
   [junit4]   2> 1543212 T4401 oascc.SolrZkClient.createZkCredentialsToAddAutomatically Using default ZkCredentialsProvider
   [junit4]   2> 1543213 T4401 oascc.ConnectionManager.waitForConnected Waiting for client to connect to ZooKeeper
   [junit4]   2> 1543214 T4424 oascc.ConnectionManager.process Watcher org.apache.solr.common.cloud.ConnectionManager@67316da2 name:ZooKeeperConnection Watcher:127.0.0.1:65310 got event WatchedEvent state:SyncConnected type:None path:null path:null type:None
   [junit4]   2> 1543215 T4401 oascc.ConnectionManager.waitForConnected Client is connected to ZooKeeper
   [junit4]   2> 1543215 T4401 oascc.SolrZkClient.createZkACLProvider Using default ZkACLProvider
   [junit4]   2> 1543217 T4401 oascc.ConnectionManager.waitForConnected Waiting for client to connect to ZooKeeper
   [junit4]   2> 1543218 T4427 oascc.ConnectionManager.process Watcher org.apache.solr.common.cloud.ConnectionManager@6d2d03d7 name:ZooKeeperConnection Watcher:127.0.0.1:65310/solr got event WatchedEvent state:SyncConnected type:None path:null path:null type:None
   [junit4]   2> 1543218 T4401 oascc.ConnectionManager.waitForConnected Client is connected to ZooKeeper
   [junit4]   2> 1543219 T4401 oascc.SolrZkClient.makePath makePath: /overseer/queue
   [junit4]   2> 1543220 T4401 oascc.SolrZkClient.makePath makePath: /overseer/collection-queue-work
   [junit4]   2> 1543222 T4401 oascc.SolrZkClient.makePath makePath: /overseer/collection-map-running
   [junit4]   2> 1543223 T4401 oascc.SolrZkClient.makePath makePath: /overseer/collection-map-completed
   [junit4]   2> 1543225 T4401 oascc.SolrZkClient.makePath makePath: /overseer/collection-map-failure
   [junit4]   2> 1543226 T4401 oascc.SolrZkClient.makePath makePath: /live_nodes
   [junit4]   2> 1543227 T4401 oasc.ZkController.createEphemeralLiveNode Register node as live in ZooKeeper:/live_nodes/127.0.0.1:65313_t_%2Fvu
   [junit4]   2> 1543228 T4401 oascc.SolrZkClient.makePath makePath: /live_nodes/127.0.0.1:65313_t_%2Fvu
   [junit4]   2> 1543229 T4401 oascc.SolrZkClient.makePath makePath: /overseer_elect
   [junit4]   2> 1543230 T4401 oascc.SolrZkClient.makePath makePath: /overseer_elect/election
   [junit4]   2> 1543231 T4401 oasc.Overseer.close Overseer (id=null) closing
   [junit4]   2> 1543232 T4401 oasc.OverseerElectionContext.runLeaderProcess I am going to be the leader 127.0.0.1:65313_t_%2Fvu
   [junit4]   2> 1543233 T4401 oascc.SolrZkClient.makePath makePath: /overseer_elect/leader
   [junit4]   2> 1543234 T4401 oasc.Overseer.start Overseer (id=93030806391816195-127.0.0.1:65313_t_%2Fvu-n_0000000000) starting
   [junit4]   2> 1543235 T4401 oascc.SolrZkClient.makePath makePath: /overseer/queue-work
   [junit4]   2> 1543240 T4401 oasc.OverseerAutoReplicaFailoverThread.<init> Starting OverseerAutoReplicaFailoverThread autoReplicaFailoverWorkLoopDelay=10000 autoReplicaFailoverWaitAfterExpiration=30000 autoReplicaFailoverBadNodeExpiration=60000
   [junit4]   2> 1543241 T4429 oasc.OverseerCollectionProcessor.run Process current queue of collection creations
   [junit4]   2> 1543242 T4401 oascc.SolrZkClient.makePath makePath: /clusterstate.json
   [junit4]   2> 1543243 T4401 oascc.SolrZkClient.makePath makePath: /aliases.json
   [junit4]   2> 1543244 T4401 oascc.ZkStateReader.createClusterStateWatchersAndUpdate Updating cluster state from ZooKeeper... 
   [junit4]   2> 1543246 T4428 oasc.Overseer$ClusterStateUpdater.run Starting to work on the main queue
   [junit4]   2> 1543249 T4401 oass.SolrDispatchFilter.init user.dir=/usr/home/jenkins/jenkins-slave/workspace/Lucene-Solr-NightlyTests-5.x/solr/build/solr-core/test/J3
   [junit4]   2> 1543249 T4401 oass.SolrDispatchFilter.init SolrDispatchFilter.init() done
   [junit4]   2> 1543250 T4401 oascc.SolrZkClient.createZkCredentialsToAddAutomatically Using default ZkCredentialsProvider
   [junit4]   2> 1543250 T4401 oascc.ConnectionManager.waitForConnected Waiting for client to connect to ZooKeeper
   [junit4]   2> 1543251 T4434 oascc.ConnectionManager.process Watcher org.apache.solr.common.cloud.ConnectionManager@1fe17aae name:ZooKeeperConnection Watcher:127.0.0.1:65310/solr got event WatchedEvent state:SyncConnected type:None path:null path:null type:None
   [junit4]   2> 1543252 T4401 oascc.ConnectionManager.waitForConnected Client is connected to ZooKeeper
   [junit4]   2> 1543252 T4401 oascc.SolrZkClient.createZkACLProvider Using default ZkACLProvider
   [junit4]   2> 1543253 T4401 oascc.ZkStateReader.createClusterStateWatchersAndUpdate Updating cluster state from ZooKeeper... 
   [junit4]   2> 1543255 T4401 oasc.ChaosMonkey.monkeyLog monkey: init - expire sessions:false cause connection loss:false
   [junit4]   2> 1543255 T4401 oasc.AbstractFullDistribZkTestBase.createJettys Creating collection1 with stateFormat=2
   [junit4]   2> 1543255 T4401 oascc.SolrZkClient.createZkCredentialsToAddAutomatically Using default ZkCredentialsProvider
   [junit4]   2> 1543256 T4401 oascc.ConnectionManager.waitForConnected Waiting for client to connect to ZooKeeper
   [junit4]   2> 1543257 T4437 oascc.ConnectionManager.process Watcher org.apache.solr.common.cloud.ConnectionManager@3835075 name:ZooKeeperConnection Watcher:127.0.0.1:65310/solr got event WatchedEvent state:SyncConnected type:None path:null path:null type:None
   [junit4]   2> 1543257 T4401 oascc.ConnectionManager.waitForConnected Client is connected to ZooKeeper
   [junit4]   2> 1543257 T4401 oascc.SolrZkClient.createZkACLProvider Using default ZkACLProvider
   [junit4]   2> 1543258 T4427 oasc.DistributedQueue$LatchWatcher.process NodeChildrenChanged fired on path /overseer/queue state SyncConnected
   [junit4]   2> 1543260 T4428 oasc.Overseer$ClusterStateUpdater.run processMessage: queueSize: 0, message = {
   [junit4]   2> 	  "operation":"create",
   [junit4]   2> 	  "name":"collection1",
   [junit4]   2> 	  "numShards":"2",
   [junit4]   2> 	  "stateFormat":2} current state version: 0
   [junit4]   2> 1543260 T4428 oasco.ClusterStateMutator.createCollection building a new cName: collection1
   [junit4]   2> 1543261 T4428 oasco.ZkStateWriter.writePendingUpdates going to create_collection /collections/collection1/state.json
   [junit4]   2> 1543262 T4434 oascc.ZkStateReader$2.process A cluster state change: WatchedEvent state:SyncConnected type:NodeDataChanged path:/clusterstate.json, has occurred - updating... (live nodes size: 1)
   [junit4]   2> 1543262 T4427 oascc.ZkStateReader$2.process A cluster state change: WatchedEvent state:SyncConnected type:NodeDataChanged path:/clusterstate.json, has occurred - updating... (live nodes size: 1)
   [junit4]   2> 1544624 T4401 oasc.AbstractFullDistribZkTestBase.createJettys create jetty 1
   [junit4]   2> 1544624 T4401 oejs.Server.doStart jetty-8.1.10.v20130312
   [junit4]   2> 1544627 T4401 oejs.AbstractConnector.doStart Started SocketConnector@127.0.0.1:65319
   [junit4]   2> 1544628 T4401 oass.SolrDispatchFilter.init SolrDispatchFilter.init()sun.misc.Launcher$AppClassLoader@631d75b9
   [junit4]   2> 1544629 T4401 oasc.SolrResourceLoader.locateSolrHome JNDI not configured for solr (NoInitialContextEx)
   [junit4]   2> 1544629 T4401 oasc.SolrResourceLoader.locateSolrHome using system property solr.solr.home: /usr/home/jenkins/jenkins-slave/workspace/Lucene-Solr-NightlyTests-5.x/solr/build/solr-core/test/J3/temp/solr.cloud.CollectionsAPIDistributedZkTest-D0BBE4846841C4A4-001/tempDir-003
   [junit4]   2> 1544629 T4401 oasc.SolrResourceLoader.<init> new SolrResourceLoader for directory: '/usr/home/jenkins/jenkins-slave/workspace/Lucene-Solr-NightlyTests-5.x/solr/build/solr-core/test/J3/temp/solr.cloud.CollectionsAPIDistributedZkTest-D0BBE4846841C4A4-001/tempDir-003/'
   [junit4]   2> 1544673 T4401 oasc.ConfigSolr.fromFile Loading container configuration from /usr/home/jenkins/jenkins-slave/workspace/Lucene-Solr-NightlyTests-5.x/solr/build/solr-core/test/J3/temp/solr.cloud.CollectionsAPIDistributedZkTest-D0BBE4846841C4A4-001/tempDir-003/solr.xml
   [junit4]   2> 1544747 T4401 oasc.CoreContainer.<init> New CoreContainer 747528310
   [junit4]   2> 1544748 T4401 oasc.CoreContainer.load Loading cores into CoreContainer [instanceDir=/usr/home/jenkins/jenkins-slave/workspace/Lucene-Solr-NightlyTests-5.x/solr/build/solr-core/test/J3/temp/solr.cloud.CollectionsAPIDistributedZkTest-D0BBE4846841C4A4-001/tempDir-003/]
   [junit4]   2> 1544749 T4401 oashc.HttpShardHandlerFactory.getParameter Setting socketTimeout to: 120000
   [junit4]   2> 1544749 T4401 oashc.HttpShardHandlerFactory.getParameter Setting urlScheme to: null
   [junit4]   2> 1544750 T4401 oashc.HttpShardHandlerFactory.getParameter Setting connTimeout to: 15000
   [junit4]   2> 1544750 T4401 oashc.HttpShardHandlerFactory.getParameter Setting maxConnectionsPerHost to: 20
   [junit4]   2> 1544750 T4401 oashc.HttpShardHandlerFactory.getParameter Setting maxConnections to: 10000
   [junit4]   2> 1544751 T4401 oashc.HttpShardHandlerFactory.getParameter Setting corePoolSize to: 0
   [junit4]   2> 1544751 T4401 oashc.HttpShardHandlerFactory.getParameter Setting maximumPoolSize to: 2147483647
   [junit4]   2> 1544751 T4401 oashc.HttpShardHandlerFactory.getParameter Setting maxThreadIdleTime to: 5
   [junit4]   2> 1544751 T4401 oashc.HttpShardHandlerFactory.getParameter Setting sizeOfQueue to: -1
   [junit4]   2> 1544752 T4401 oashc.HttpShardHandlerFactory.getParameter Setting fairnessPolicy to: false
   [junit4]   2> 1544752 T4401 oasu.UpdateShardHandler.<init> Creating UpdateShardHandler HTTP client with params: socketTimeout=3400000&connTimeout=45000&retry=false
   [junit4]   2> 1544753 T4401 oasl.LogWatcher.createWatcher SLF4J impl is org.slf4j.impl.Log4jLoggerFactory
   [junit4]   2> 1544753 T4401 oasl.LogWatcher.newRegisteredLogWatcher Registering Log Listener [Log4j (org.slf4j.impl.Log4jLoggerFactory)]
   [junit4]   2> 1544753 T4401 oasc.CoreContainer.load Host Name: 127.0.0.1
   [junit4]   2> 1544754 T4401 oasc.ZkContainer.initZooKeeper Zookeeper client=127.0.0.1:65310/solr
   [junit4]   2> 1544754 T4401 oasc.ZkController.checkChrootPath zkHost includes chroot
   [junit4]   2> 1544754 T4401 oascc.SolrZkClient.createZkCredentialsToAddAutomatically Using default ZkCredentialsProvider
   [junit4]   2> 1544755 T4401 oascc.ConnectionManager.waitForConnected Waiting for client to connect to ZooKeeper
   [junit4]   2> 1544757 T4449 oascc.ConnectionManager.process Watcher org.apache.solr.common.cloud.ConnectionManager@6f09b493 name:ZooKeeperConnection Watcher:127.0.0.1:65310 got event WatchedEvent state:SyncConnected type:None path:null path:null type:None
   [junit4]   2> 1544758 T4401 oascc.ConnectionManager.waitForConnected Client is connected to ZooKeeper
   [junit4]   2> 1544758 T4401 oascc.SolrZkClient.createZkACLProvider Using default ZkACLProvider
   [junit4]   2> 1544760 T4401 oascc.ConnectionManager.waitForConnected Waiting for client to connect to ZooKeeper
   [junit4]   2> 1544761 T4452 oascc.ConnectionManager.process Watcher org.apache.solr.common.cloud.ConnectionManager@3b6c2fa8 name:ZooKeeperConnection Watcher:127.0.0.1:65310/solr got event WatchedEvent state:SyncConnected type:None path:null path:null type:None
   [junit4]   2> 1544761 T4401 oascc.ConnectionManager.waitForConnected Client is connected to ZooKeeper
   [junit4]   2> 1544765 T4401 oascc.ZkStateReader.createClusterStateWatchersAndUpdate Updating cluster state from ZooKeeper... 
   [junit4]   2> 1545865 T4401 oasc.ZkController.createEphemeralLiveNode Register node as live in ZooKeeper:/live_nodes/127.0.0.1:65319_t_%2Fvu
   [junit4]   2> 1545868 T4401 oascc.SolrZkClient.makePath makePath: /live_nodes/127.0.0.1:65319_t_%2Fvu
   [junit4]   2> 1545871 T4401 oasc.Overseer.close Overseer (id=null) closing
   [junit4]   2> 1545874 T4401 oass.SolrDispatchFilter.init user.dir=/usr/home/jenkins/jenkins-slave/workspace/Lucene-Solr-NightlyTests-5.x/solr/build/solr-core/test/J3
   [junit4]   2> 1545875 T4401 oass.SolrDispatchFilter.init SolrDispatchFilter.init() done
   [junit4]   2> 1546920 T4401 oasc.AbstractFullDistribZkTestBase.createJettys create jetty 2
   [junit4]   2> 1546921 T4401 oejs.Server.doStart jetty-8.1.10.v20130312
   [junit4]   2> 1546924 T4401 oejs.AbstractConnector.doStart Started SocketConnector@127.0.0.1:65324
   [junit4]   2> 1546924 T4401 oass.SolrDispatchFilter.init SolrDispatchFilter.init()sun.misc.Launcher$AppClassLoader@631d75b9
   [junit4]   2> 1546925 T4401 oasc.SolrResourceLoader.locateSolrHome JNDI not configured for solr (NoInitialContextEx)
   [junit4]   2> 1546925 T4401 oasc.SolrResourceLoader.locateSolrHome using system property solr.solr.home: ../../../../../../../../../../../usr/home/jenkins/jenkins-slave/workspace/Lucene-Solr-NightlyTests-5.x/solr/build/solr-core/test/J3/temp/solr.cloud.CollectionsAPIDistributedZkTest-D0BBE4846841C4A4-001/tempDir-004
   [junit4]   2> 1546925 T4401 oasc.SolrResourceLoader.<init> new SolrResourceLoader for directory: '../../../../../../../../../../../usr/home/jenkins/jenkins-slave/workspace/Lucene-Solr-NightlyTests-5.x/solr/build/solr-core/test/J3/temp/solr.cloud.CollectionsAPIDistributedZkTest-D0BBE4846841C4A4-001/tempDir-004/'
   [junit4]   2> 1546959 T4401 oasc.ConfigSolr.fromFile Loading container configuration from /usr/home/jenkins/jenkins-slave/workspace/Lucene-Solr-NightlyTests-5.x/solr/build/solr-core/test/J3/../../../../../../../../../../../usr/home/jenkins/jenkins-slave/workspace/Lucene-Solr-NightlyTests-5.x/solr/build/solr-core/test/J3/temp/solr.cloud.CollectionsAPIDistributedZkTest-D0BBE4846841C4A4-001/tempDir-004/solr.xml
   [junit4]   2> 1547019 T4401 oasc.CoreContainer.<init> New CoreContainer 315370305
   [junit4]   2> 1547019 T4401 oasc.CoreContainer.load Loading cores into CoreContainer [instanceDir=../../../../../../../../../../../usr/home/jenkins/jenkins-slave/workspace/Lucene-Solr-NightlyTests-5.x/solr/build/solr-core/test/J3/temp/solr.cloud.CollectionsAPIDistributedZkTest-D0BBE4846841C4A4-001/tempDir-004/]
   [junit4]   2> 1547020 T4401 oashc.HttpShardHandlerFactory.getParameter Setting socketTimeout to: 120000
   [junit4]   2> 1547020 T4401 oashc.HttpShardHandlerFactory.getParameter Setting urlScheme to: null
   [junit4]   2> 1547021 T4401 oashc.HttpShardHandlerFactory.getParameter Setting connTimeout to: 15000
   [junit4]   2> 1547021 T4401 oashc.HttpShardHandlerFactory.getParameter Setting maxConnectionsPerHost to: 20
   [junit4]   2> 1547021 T4401 oashc.HttpShardHandlerFactory.getParameter Setting maxConnections to: 10000
   [junit4]   2> 1547021 T4401 oashc.HttpShardHandlerFactory.getParameter Setting corePoolSize to: 0
   [junit4]   2> 1547022 T4401 oashc.HttpShardHandlerFactory.getParameter Setting maximumPoolSize to: 2147483647
   [junit4]   2> 1547022 T4401 oashc.HttpShardHandlerFactory.getParameter Setting maxThreadIdleTime to: 5
   [junit4]   2> 1547022 T4401 oashc.HttpShardHandlerFactory.getParameter Setting sizeOfQueue to: -1
   [junit4]   2> 1547022 T4401 oashc.HttpShardHandlerFactory.getParameter Setting fairnessPolicy to: false
   [junit4]   2> 1547023 T4401 oasu.UpdateShardHandler.<init> Creating UpdateShardHandler HTTP client with params: socketTimeout=3400000&connTimeout=45000&retry=false
   [junit4]   2> 1547023 T4401 oasl.LogWatcher.createWatcher SLF4J impl is org.slf4j.impl.Log4jLoggerFactory
   [junit4]   2> 1547023 T4401 oasl.LogWatcher.newRegisteredLogWatcher Registering Log Listener [Log4j (org.slf4j.impl.Log4jLoggerFactory)]
   [junit4]   2> 1547023 T4401 oasc.CoreContainer.load Host Name: 127.0.0.1
   [junit4]   2> 1547024 T4401 oasc.ZkContainer.initZooKeeper Zookeeper client=127.0.0.1:65310/solr
   [junit4]   2> 1547024 T4401 oasc.ZkController.checkChrootPath zkHost includes chroot
   [junit4]   2> 1547024 T4401 oascc.SolrZkClient.createZkCredentialsToAddAutomatically Using default ZkCredentialsProvider
   [junit4]   2> 1547025 T4401 oascc.ConnectionManager.waitForConnected Waiting for client to connect to ZooKeeper
   [junit4]   2> 1547026 T4465 oascc.ConnectionManager.process Watcher org.apache.solr.common.cloud.ConnectionManager@12b3c0a7 name:ZooKeeperConnection Watcher:127.0.0.1:65310 got event WatchedEvent state:SyncConnected type:None path:null path:null type:None
   [junit4]   2> 1547028 T4401 oascc.ConnectionManager.waitForConnected Client is connected to ZooKeeper
   [junit4]   2> 1547028 T4401 oascc.SolrZkClient.createZkACLProvider Using default ZkACLProvider
   [junit4]   2> 1547030 T4401 oascc.ConnectionManager.waitForConnected Waiting for client to connect to ZooKeeper
   [junit4]   2> 1547031 T4468 oascc.ConnectionManager.process Watcher org.apache.solr.common.cloud.ConnectionManager@3f70f1bc name:ZooKeeperConnection Watcher:127.0.0.1:65310/solr got event WatchedEvent state:SyncConnected type:None path:null path:null type:None
   [junit4]   2> 1547031 T4401 oascc.ConnectionManager.waitForConnected Client is connected to ZooKeeper
   [junit4]   2> 1547036 T4401 oascc.ZkStateReader.createClusterStateWatchersAndUpdate Updating cluster state from ZooKeeper... 
   [junit4]   2> 1548040 T4401 oasc.ZkController.createEphemeralLiveNode Register node as live in ZooKeeper:/live_nodes/127.0.0.1:65324_t_%2Fvu
   [junit4]   2> 1548041 T4401 oascc.SolrZkClient.makePath makePath: /live_nodes/127.0.0.1:65324_t_%2Fvu
   [junit4]   2> 1548045 T4401 oasc.Overseer.close Overseer (id=null) closing
   [junit4]   2> 1548049 T4401 oass.SolrDispatchFilter.init user.dir=/usr/home/jenkins/jenkins-slave/workspace/Lucene-Solr-NightlyTests-5.x/solr/build/solr-core/test/J3
   [junit4]   2> 1548050 T4401 oass.SolrDispatchFilter.init SolrDispatchFilter.init() done
   [junit4]   2> 1549379 T4401 oasc.AbstractFullDistribZkTestBase.createJettys create jetty 3
   [junit4]   2> 1549380 T4401 oejs.Server.doStart jetty-8.1.10.v20130312
   [junit4]   2> 1549383 T4401 oejs.AbstractConnector.doStart Started SocketConnector@127.0.0.1:65328
   [junit4]   2> 1549384 T4401 oass.SolrDispatchFilter.init SolrDispatchFilter.init()sun.misc.Launcher$AppClassLoader@631d75b9
   [junit4]   2> 1549384 T4401 oasc.SolrResourceLoader.locateSolrHome JNDI not configured for solr (NoInitialContextEx)
   [junit4]   2> 1549384 T4401 oasc.SolrResourceLoader.locateSolrHome using system property solr.solr.home: /usr/home/jenkins/jenkins-slave/workspace/Lucene-Solr-NightlyTests-5.x/solr/build/solr-core/test/J3/temp/solr.cloud.CollectionsAPIDistributedZkTest-D0BBE4846841C4A4-001/tempDir-005
   [junit4]   2> 1549384 T4401 oasc.SolrResourceLoader.<init> new SolrResourceLoader for directory: '/usr/home/jenkins/jenkins-slave/workspace/Lucene-Solr-NightlyTests-5.x/solr/build/solr-core/test/J3/temp/solr.cloud.CollectionsAPIDistributedZkTest-D0BBE4846841C4A4-001/tempDir-005/'
   [junit4]   2> 1549414 T4401 oasc.ConfigSolr.fromFile Loading container configuration from /usr/home/jenkins/jenkins-slave/workspace/Lucene-Solr-NightlyTests-5.x/solr/build/solr-core/test/J3/temp/solr.cloud.CollectionsAPIDistributedZkTest-D0BBE4846841C4A4-001/tempDir-005/solr.xml
   [junit4]   2> 1549488 T4401 oasc.CoreContainer.<init> New CoreContainer 384629651
   [junit4]   2> 1549489 T4401 oasc.CoreContainer.load Loading cores into CoreContainer [instanceDir=/usr/home/jenkins/jenkins-slave/workspace/Lucene-Solr-NightlyTests-5.x/solr/build/solr-core/test/J3/temp/solr.cloud.CollectionsAPIDistributedZkTest-D0BBE4846841C4A4-001/tempDir-005/]
   [junit4]   2> 1549490 T4401 oashc.HttpShardHandlerFactory.getParameter Setting socketTimeout to: 120000
   [junit4]   2> 1549490 T4401 oashc.HttpShardHandlerFactory.getParameter Setting urlScheme to: null
   [junit4]   2> 1549490 T4401 oashc.HttpShardHandlerFactory.getParameter Setting connTimeout to: 15000
   [junit4]   2> 1549490 T4401 oashc.HttpShardHandlerFactory.getParameter Setting maxConnectionsPerHost to: 20
   [junit4]   2> 1549491 T4401 oashc.HttpShardHandlerFactory.getParameter Setting maxConnections to: 10000
   [junit4]   2> 1549491 T4401 oashc.HttpShardHandlerFactory.getParameter Setting corePoolSize to: 0
   [junit4]   2> 1549491 T4401 oashc.HttpShardHandlerFactory.getParameter Setting maximumPoolSize to: 2147483647
   [junit4]   2> 1549491 T4401 oashc.HttpShardHandlerFactory.getParameter Setting maxThreadIdleTime to: 5
   [junit4]   2> 1549491 T4401 oashc.HttpShardHandlerFactory.getParameter Setting sizeOfQueue to: -1
   [junit4]   2> 1549492 T4401 oashc.HttpShardHandlerFactory.getParameter Setting fairnessPolicy to: false
   [junit4]   2> 1549492 T4401 oasu.UpdateShardHandler.<init> Creating UpdateShardHandler HTTP client with params: socketTimeout=3400000&connTimeout=45000&retry=false
   [junit4]   2> 1549492 T4401 oasl.LogWatcher.createWatcher SLF4J impl is org.slf4j.impl.Log4jLoggerFactory
   [junit4]   2> 1549493 T4401 oasl.LogWatcher.newRegisteredLogWatcher Registering Log Listener [Log4j (org.slf4j.impl.Log4jLoggerFactory)]
   [junit4]   2> 1549493 T4401 oasc.CoreContainer.load Host Name: 127.0.0.1
   [junit4]   2> 1549493 T4401 oasc.ZkContainer.initZooKeeper Zookeeper client=127.0.0.1:65310/solr
   [junit4]   2> 1549493 T4401 oasc.ZkController.checkChrootPath zkHost includes chroot
   [junit4]   2> 1549494 T4401 oascc.SolrZkClient.createZkCredentialsToAddAutomatically Using default ZkCredentialsProvider
   [junit4]   2> 1549494 T4401 oascc.ConnectionManager.waitForConnected Waiting for client to connect to ZooKeeper
   [junit4]   2> 1549496 T4481 oascc.ConnectionManager.process Watcher org.apache.solr.common.cloud.ConnectionManager@1c816ba6 name:ZooKeeperConnection Watcher:127.0.0.1:65310 got event WatchedEvent state:SyncConnected type:None path:null path:null type:None
   [junit4]   2> 1549497 T4401 oascc.ConnectionManager.waitForConnected Client is connected to ZooKeeper
   [junit4]   2> 1549497 T4401 oascc.SolrZkClient.createZkACLProvider Using default ZkACLProvider
   [junit4]   2> 1549498 T4401 oascc.ConnectionManager.waitForConnected Waiting for client to connect to ZooKeeper
   [junit4]   2> 1549499 T4484 oascc.ConnectionManager.process Watcher org.apache.solr.common.cloud.ConnectionManager@1f567217 name:ZooKeeperConnection Watcher:127.0.0.1:65310/solr got event WatchedEvent state:SyncConnected type:None path:null path:null type:None
   [junit4]   2> 1549500 T4401 oascc.ConnectionManager.waitForConnected Client is connected to ZooKeeper
   [junit4]   2> 1549503 T4401 oascc.ZkStateReader.createClusterStateWatchersAndUpdate Updating cluster state from ZooKeeper... 
   [junit4]   2> 1550506 T4401 oasc.ZkController.createEphemeralLiveNode Register node as live in ZooKeeper:/live_nodes/127.0.0.1:65328_t_%2Fvu
   [junit4]   2> 1550507 T4401 oascc.SolrZkClient.makePath makePath: /live_nodes/127.0.0.1:65328_t_%2Fvu
   [junit4]   2> 1550511 T4401 oasc.Overseer.close Overseer (id=null) closing
   [junit4]   2> 1550516 T4401 oass.SolrDispatchFilter.init user.dir=/usr/home/jenkins/jenkins-slave/workspace/Lucene-Solr-NightlyTests-5.x/solr/build/solr-core/test/J3
   [junit4]   2> 1550516 T4401 oass.SolrDispatchFilter.init SolrDispatchFilter.init() done
   [junit4]   2> 1552018 T4401 oasc.AbstractFullDistribZkTestBase.createJettys create jetty 4
   [junit4]   2> 1552018 T4401 oejs.Server.doStart jetty-8.1.10.v20130312
   [junit4]   2> 1552022 T4401 oejs.AbstractConnector.doStart Started SocketConnector@127.0.0.1:65332
   [junit4]   2> 1552022 T4401 oass.SolrDispatchFilter.init SolrDispatchFilter.init()sun.misc.Launcher$AppClassLoader@631d75b9
   [junit4]   2> 1552023 T4401 oasc.SolrResourceLoader.locateSolrHome JNDI not configured for solr (NoInitialContextEx)
   [junit4]   2> 1552023 T4401 oasc.SolrResourceLoader.locateSolrHome using system property solr.solr.home: /usr/home/jenkins/jenkins-slave/workspace/Lucene-Solr-NightlyTests-5.x/solr/build/solr-core/test/J3/temp/solr.cloud.CollectionsAPIDistributedZkTest-D0BBE4846841C4A4-001/tempDir-006
   [junit4]   2> 1552024 T4401 oasc.SolrResourceLoader.<init> new SolrResourceLoader for directory: '/usr/home/jenkins/jenkins-slave/workspace/Lucene-Solr-NightlyTests-5.x/solr/build/solr-core/test/J3/temp/solr.cloud.CollectionsAPIDistributedZkTest-D0BBE4846841C4A4-001/tempDir-006/'
   [junit4]   2> 1552084 T4401 oasc.ConfigSolr.fromFile Loading container configuration from /usr/home/jenkins/jenkins-slave/workspace/Lucene-Solr-NightlyTests-5.x/solr/build/solr-core/test/J3/temp/solr.cloud.CollectionsAPIDistributedZkTest-D0BBE4846841C4A4-001/tempDir-006/solr.xml
   [junit4]   2> 1552188 T4401 oasc.CoreContainer.<init> New CoreContainer 2062842262
   [junit4]   2> 1552189 T4401 oasc.CoreContainer.load Loading cores into CoreContainer [instanceDir=/usr/home/jenkins/jenkins-slave/workspace/Lucene-Solr-NightlyTests-5.x/solr/build/solr-core/test/J3/temp/solr.cloud.CollectionsAPIDistributedZkTest-D0BBE4846841C4A4-001/tempDir-006/]
   [junit4]   2> 1552190 T4401 oashc.HttpShardHandlerFactory.getParameter Setting socketTimeout to: 120000
   [junit4]   2> 1552191 T4401 oashc.HttpShardHandlerFactory.getParameter Setting urlScheme to: null
   [junit4]   2> 1552191 T4401 oashc.HttpShardHandlerFactory.getParameter Setting connTimeout to: 15000
   [junit4]   2> 1552191 T4401 oashc.HttpShardHandlerFactory.getParameter Setting maxConnectionsPerHost to: 20
   [junit4]   2> 1552192 T4401 oashc.HttpShardHandlerFactory.getParameter Setting maxConnections to: 10000
   [junit4]   2> 1552192 T4401 oashc.HttpShardHandlerFactory.getParameter Setting corePoolSize to: 0
   [junit4]   2> 1552192 T4401 oashc.HttpShardHandlerFactory.getParameter Setting maximumPoolSize to: 2147483647
   [junit4]   2> 1552193 T4401 oashc.HttpShardHandlerFactory.getParameter Setting maxThreadIdleTime to: 5
   [junit4]   2> 1552193 T4401 oashc.HttpShardHandlerFactory.getParameter Setting sizeOfQueue to: -1
   [junit4]   2> 1552193 T4401 oashc.HttpShardHandlerFactory.getParameter Setting fairnessPolicy to: false
   [junit4]   2> 1552194 T4401 oasu.UpdateShardHandler.<init> Creating UpdateShardHandler HTTP client with params: socketTimeout=3400000&connTimeout=45000&retry=false
   [junit4]   2> 1552194 T4401 oasl.LogWatcher.createWatcher SLF4J impl is org.slf4j.impl.Log4jLoggerFactory
   [junit4]   2> 1552195 T4401 oasl.LogWatcher.newRegisteredLogWatcher Registering Log Listener [Log4j (org.slf4j.impl.Log4jLoggerFactory)]
   [junit4]   2> 1552195 T4401 oasc.CoreContainer.load Host Name: 127.0.0.1
   [junit4]   2> 1552195 T4401 oasc.ZkContainer.initZooKeeper Zookeeper client=127.0.0.1:65310/solr
   [junit4]   2> 1552196 T4401 oasc.ZkController.checkChrootPath zkHost includes chroot
   [junit4]   2> 1552196 T4401 oascc.SolrZkClient.createZkCredentialsToAddAutomatically Using default ZkCredentialsProvider
   [junit4]   2> 1552197 T4401 oascc.ConnectionManager.waitForConnected Waiting for client to connect to ZooKeeper
   [junit4]   2> 1552199 T4497 oascc.ConnectionManager.process Watcher org.apache.solr.common.cloud.ConnectionManager@1648c35 name:ZooKeeperConnection Watcher:127.0.0.1:65310 got event WatchedEvent state:SyncConnected type:None path:null path:null type:None
   [junit4]   2> 1552200 T4401 oascc.ConnectionManager.waitForConnected Client is connected to ZooKeeper
   [junit4]   2> 1552200 T4401 oascc.SolrZkClient.createZkACLProvider Using default ZkACLProvider
   [junit4]   2> 1552202 T4401 oascc.ConnectionManager.waitForConnected Waiting for client to connect to ZooKeeper
   [junit4]   2> 1552203 T4500 oascc.ConnectionManager.process Watcher org.apache.solr.common.cloud.ConnectionManager@1ba42bf4 name:ZooKeeperConnection Watcher:127.0.0.1:65310/solr got event WatchedEvent state:SyncConnected type:None path:null path:null type:None
   [junit4]   2> 1552203 T4401 oascc.ConnectionManager.waitForConnected Client is connected to ZooKeeper
   [junit4]   2> 1552208 T4401 oascc.ZkStateReader.createClusterStateWatchersAndUpdate Updating cluster state from ZooKeeper... 
   [junit4]   2> 1553212 T4401 oasc.ZkController.createEphemeralLiveNode Register node as live in ZooKeeper:/live_nodes/127.0.0.1:65332_t_%2Fvu
   [junit4]   2> 1553213 T4401 oascc.SolrZkClient.makePath makePath: /live_nodes/127.0.0.1:65332_t_%2Fvu
   [junit4]   2> 1553217 T4401 oasc.Overseer.close Overseer (id=null) closing
   [junit4]   2> 1553221 T4401 oass.SolrDispatchFilter.init user.dir=/usr/home/jenkins/jenkins-slave/workspace/Lucene-Solr-NightlyTests-5.x/solr/build/solr-core/test/J3
   [junit4]   2> 1553222 T4401 oass.SolrDispatchFilter.init SolrDispatchFilter.init() done
   [junit4]   2> 1553225 T4445 oasha.CollectionsHandler.handleCreateAction Creating Collection : replicationFactor=2&version=2&action=CREATE&wt=javabin&numShards=2&name=nodes_used_collection
   [junit4]   2> 1553226 T4427 oasc.DistributedQueue$LatchWatcher.process NodeChildrenChanged fired on path /overseer/collection-queue-work state SyncConnected
   [junit4]   2> 1553227 T4429 oasc.OverseerCollectionProcessor.run Overseer Collection Processor: Get the message id:/overseer/collection-queue-work/qn-0000000000 message:{
   [junit4]   2> 	  "operation":"create",
   [junit4]   2> 	  "fromApi":"true",
   [junit4]   2> 	  "name":"nodes_used_collection",
   [junit4]   2> 	  "replicationFactor":"2",
   [junit4]   2> 	  "numShards":"2"}
   [junit4]   2> 1553228 T4502 oasc.OverseerCollectionProcessor.processMessage WARN OverseerCollectionProcessor.processMessage : create , {
   [junit4]   2> 	  "operation":"create",
   [junit4]   2> 	  "fromApi":"true",
   [junit4]   2> 	  "name":"nodes_used_collection",
   [junit4]   2> 	  "replicationFactor":"2",
   [junit4]   2> 	  "numShards":"2"}
   [junit4]   2> 1553229 T4502 oasc.OverseerCollectionProcessor.createConfNode Only one config set found in zk - using it:conf1
   [junit4]   2> 1553229 T4502 oasc.OverseerCollectionProcessor.createConfNode creating collections conf node /collections/nodes_used_collection 
   [junit4]   2> 1553230 T4502 oascc.SolrZkClient.makePath makePath: /collections/nodes_used_collection
   [junit4]   2> 1553232 T4427 oasc.DistributedQueue$LatchWatcher.process NodeChildrenChanged fired on path /overseer/queue state SyncConnected
   [junit4]   2> 1553233 T4428 oasc.Overseer$ClusterStateUpdater.run processMessage: queueSize: 1, message = {
   [junit4]   2> 	  "operation":"create",
   [junit4]   2> 	  "fromApi":"true",
   [junit4]   2> 	  "name":"nodes_used_collection",
   [junit4]   2> 	  "replicationFactor":"2",
   [junit4]   2> 	  "numShards":"2"} current state version: 1
   [junit4]   2> 1553234 T4428 oasco.ClusterStateMutator.createCollection building a new cName: nodes_used_collection
   [junit4]   2> 1553235 T4484 oascc.ZkStateReader$2.process A cluster state change: WatchedEvent state:SyncConnected type:NodeDataChanged path:/clusterstate.json, has occurred - updating... (live nodes size: 5)
   [junit4]   2> 1553235 T4434 oascc.ZkStateReader$2.process A cluster state change: WatchedEvent state:SyncConnected type:NodeDataChanged path:/clusterstate.json, has occurred - updating... (live nodes size: 5)
   [junit4]   2> 1553235 T4468 oascc.ZkStateReader$2.process A cluster state change: WatchedEvent state:SyncConnected type:NodeDataChanged path:/clusterstate.json, has occurred - updating... (live nodes size: 5)
   [junit4]   2> 1553235 T4452 oascc.ZkStateReader$2.process A cluster state change: WatchedEvent state:SyncConnected type:NodeDataChanged path:/clusterstate.json, has occurred - updating... (live nodes size: 5)
   [junit4]   2> 1553235 T4427 oascc.ZkStateReader$2.process A cluster state change: WatchedEvent state:SyncConnected type:NodeDataChanged path:/clusterstate.json, has occurred - updating... (live nodes size: 5)
   [junit4]   2> 1553235 T4500 oascc.ZkStateReader$2.process A cluster state change: WatchedEvent state:SyncConnected type:NodeDataChanged path:/clusterstate.json, has occurred - updating... (live nodes size: 5)
   [junit4]   2> 1553434 T4502 oasc.OverseerCollectionProcessor.createCollection Creating SolrCores for new collection nodes_used_collection, shardNames [shard1, shard2] , replicationFactor : 2
   [junit4]   2> 1553435 T4502 oasc.OverseerCollectionProcessor.createCollection Creating shard nodes_used_collection_shard1_replica1 as part of slice shard1 of collection nodes_used_collection on 127.0.0.1:65324_t_%2Fvu
   [junit4]   2> 1553436 T4502 oasc.OverseerCollectionProcessor.createCollection Creating shard nodes_used_collection_shard1_replica2 as part of slice shard1 of collection nodes_used_collection on 127.0.0.1:65319_t_%2Fvu
   [junit4]   2> 1553437 T4502 oasc.OverseerCollectionProcessor.createCollection Creating shard nodes_used_collection_shard2_replica1 as part of slice shard2 of collection nodes_used_collection on 127.0.0.1:65332_t_%2Fvu
   [junit4]   2> 1553440 T4456 oasha.CoreAdminHandler.handleCreateAction core create command qt=/admin/cores&collection=nodes_used_collection&version=2&action=CREATE&wt=javabin&numShards=2&shard=shard1&name=nodes_used_collection_shard1_replica1&collection.configName=conf1
   [junit4]   2> 1553440 T4440 oasha.CoreAdminHandler.handleCreateAction core create command qt=/admin/cores&collection=nodes_used_collection&version=2&action=CREATE&wt=javabin&numShards=2&shard=shard1&name=nodes_used_collection_shard1_replica2&collection.configName=conf1
   [junit4]   2> 1553440 T4502 oasc.OverseerCollectionProcessor.createCollection Creating shard nodes_used_collection_shard2_replica2 as part of slice shard2 of collection nodes_used_collection on 127.0.0.1:65328_t_%2Fvu
   [junit4]   2> 1553442 T4488 oasha.CoreAdminHandler.handleCreateAction core create command qt=/admin/cores&collection=nodes_used_collection&version=2&action=CREATE&wt=javabin&numShards=2&shard=shard2&name=nodes_used_collection_shard2_replica1&collection.configName=conf1
   [junit4]   2> 1553443 T4472 oasha.CoreAdminHandler.handleCreateAction core create command qt=/admin/cores&collection=nodes_used_collection&version=2&action=CREATE&wt=javabin&numShards=2&shard=shard2&name=nodes_used_collection_shard2_replica2&collection.configName=conf1
   [junit4]   2> 1553444 T4456 oasc.ZkController.publish publishing core=nodes_used_collection_shard1_replica1 state=down collection=nodes_used_collection
   [junit4]   2> 1553444 T4440 oasc.ZkController.publish publishing core=nodes_used_collection_shard1_replica2 state=down collection=nodes_used_collection
   [junit4]   2> 1553444 T4488 oasc.ZkController.publish publishing core=nodes_used_collection_shard2_replica1 state=down collection=nodes_used_collection
   [junit4]   2> 1553445 T4456 oasc.ZkController.waitForCoreNodeName look for our core node name
   [junit4]   2> 1553445 T4440 oasc.ZkController.waitForCoreNodeName look for our core node name
   [junit4]   2> 1553445 T4427 oasc.DistributedQueue$LatchWatcher.process NodeChildrenChanged fired on path /overseer/queue state SyncConnected
   [junit4]   2> 1553445 T4472 oasc.ZkController.publish publishing core=nodes_used_collection_shard2_replica2 state=down collection=nodes_used_collection
   [junit4]   2> 1553445 T4488 oasc.ZkController.waitForCoreNodeName look for our core node name
   [junit4]   2> 1553446 T4428 oasc.Overseer$ClusterStateUpdater.run processMessage: queueSize: 3, message = {
   [junit4]   2> 	  "collection":"nodes_used_collection",
   [junit4]   2> 	  "core":"nodes_used_collection_shard1_replica1",
   [junit4]   2> 	  "base_url":"http://127.0.0.1:65324/t_/vu",
   [junit4]   2> 	  "state":"down",
   [junit4]   2> 	  "roles":null,
   [junit4]   2> 	  "numShards":"2",
   [junit4]   2> 	  "shard":"shard1",
   [junit4]   2> 	  "node_name":"127.0.0.1:65324_t_%2Fvu",
   [junit4]   2> 	  "operation":"state"} current state version: 2
   [junit4]   2> 1553446 T4472 oasc.ZkController.waitForCoreNodeName look for our core node name
   [junit4]   2> 1553447 T4428 oasco.ReplicaMutator.updateState Update state numShards=2 message={
   [junit4]   2> 	  "collection":"nodes_used_collection",
   [junit4]   2> 	  "core":"nodes_used_collection_shard1_replica1",
   [junit4]   2> 	  "base_url":"http://127.0.0.1:65324/t_/vu",
   [junit4]   2> 	  "state":"down",
   [junit4]   2> 	  "roles":null,
   [junit4]   2> 	  "numShards":"2",
   [junit4]   2> 	  "shard":"shard1",
   [junit4]   2> 	  "node_name":"127.0.0.1:65324_t_%2Fvu",
   [junit4]   2> 	  "operation":"state"}
   [junit4]   2> 1553449 T4428 oasc.Overseer$ClusterStateUpdater.run processMessage: queueSize: 3, message = {
   [junit4]   2> 	  "collection":"nodes_used_collection",
   [junit4]   2> 	  "core":"nodes_used_collection_shard1_replica2",
   [junit4]   2> 	  "base_url":"http://127.0.0.1:65319/t_/vu",
   [junit4]   2> 	  "state":"down",
   [junit4]   2> 	  "roles":null,
   [junit4]   2> 	  "numShards":"2",
   [junit4]   2> 	  "shard":"shard1",
   [junit4]   2> 	  "node_name":"127.0.0.1:65319_t_%2Fvu",
   [junit4]   2> 	  "operation":"state"} current state version: 2
   [junit4]   2> 1553449 T4428 oasco.ReplicaMutator.updateState Update state numShards=2 message={
   [junit4]   2> 	  "collection":"nodes_used_collection",
   [junit4]   2> 	  "core":"nodes_used_collection_shard1_replica2",
   [junit4]   2> 	  "base_url":"http://127.0.0.1:65319/t_/vu",
   [junit4]   2> 	  "state":"down",
   [junit4]   2> 	  "roles":null,
   [junit4]   2> 	  "numShards":"2",
   [junit4]   2> 	  "shard":"shard1",
   [junit4]   2> 	  "node_name":"127.0.0.1:65319_t_%2Fvu",
   [junit4]   2> 	  "operation":"state"}
   [junit4]   2> 1553451 T4427 oasc.DistributedQueue$LatchWatcher.process NodeChildrenChanged fired on path /overseer/queue state SyncConnected
   [junit4]   2> 1553451 T4428 oasc.Overseer$ClusterStateUpdater.run processMessage: queueSize: 3, message = {
   [junit4]   2> 	  "collection":"nodes_used_collection",
   [junit4]   2> 	  "core":"nodes_used_collection_shard2_replica1",
   [junit4]   2> 	  "base_url":"http://127.0.0.1:65332/t_/vu",
   [junit4]   2> 	  "state":"down",
   [junit4]   2> 	  "roles":null,
   [junit4]   2> 	  "numShards":"2",
   [junit4]   2> 	  "shard":"shard2",
   [junit4]   2> 	  "node_name":"127.0.0.1:65332_t_%2Fvu",
   [junit4]   2> 	  "operation":"state"} current state version: 2
   [junit4]   2> 1553452 T4428 oasco.ReplicaMutator.updateState Update state numShards=2 message={
   [junit4]   2> 	  "collection":"nodes_used_collection",
   [junit4]   2> 	  "core":"nodes_used_collection_shard2_replica1",
   [junit4]   2> 	  "base_url":"http://127.0.0.1:65332/t_/vu",
   [junit4]   2> 	  "state":"down",
   [junit4]   2> 	  "roles":null,
   [junit4]   2> 	  "numShards":"2",
   [junit4]   2> 	  "shard":"shard2",
   [junit4]   2> 	  "node_name":"127.0.0.1:65332_t_%2Fvu",
   [junit4]   2> 	  "operation":"state"}
   [junit4]   2> 1553454 T4428 oasc.Overseer$ClusterStateUpdater.run processMessage: queueSize: 1, message = {
   [junit4]   2> 	  "collection":"nodes_used_collection",
   [junit4]   2> 	  "core":"nodes_used_collection_shard2_replica2",
   [junit4]   2> 	  "base_url":"http://127.0.0.1:65328/t_/vu",
   [junit4]   2> 	  "state":"down",
   [junit4]   2> 	  "roles":null,
   [junit4]   2> 	  "numShards":"2",
   [junit4]   2> 	  "shard":"shard2",
   [junit4]   2> 	  "node_name":"127.0.0.1:65328_t_%2Fvu",
   [junit4]   2> 	  "operation":"state"} current state version: 2
   [junit4]   2> 1553454 T4428 oasco.ReplicaMutator.updateState Update state numShards=2 message={
   [junit4]   2> 	  "collection":"nodes_used_collection",
   [junit4]   2> 	  "core":"nodes_used_collection_shard2_replica2",
   [junit4]   2> 	  "base_url":"http://127.0.0.1:65328/t_/vu",
   [junit4]   2> 	  "state":"down",
   [junit4]   2> 	  "roles":null,
   [junit4]   2> 	  "numShards":"2",
   [junit4]   2> 	  "shard":"shard2",
   [junit4]   2> 	  "node_name":"127.0.0.1:65328_t_%2Fvu",
   [junit4]   2> 	  "operation":"state"}
   [junit4]   2> 1553456 T4427 oasc.DistributedQueue$LatchWatcher.process NodeChildrenChanged fired on path /overseer/queue state SyncConnected
   [junit4]   2> 1553457 T4468 oascc.ZkStateReader$2.process A cluster state change: WatchedEvent state:SyncConnected type:NodeDataChanged path:/clusterstate.json, has occurred - updating... (live nodes size: 5)
   [junit4]   2> 1553457 T4500 oascc.ZkStateReader$2.process A cluster state change: WatchedEvent state:SyncConnected type:NodeDataChanged path:/clusterstate.json, has occurred - updating... (live nodes size: 5)
   [junit4]   2> 1553457 T4434 oascc.ZkStateReader$2.process A cluster state change: WatchedEvent state:SyncConnected type:NodeDataChanged path:/clusterstate.json, has occurred - updating... (live nodes size: 5)
   [junit4]   2> 1553457 T4484 oascc.ZkStateReader$2.process A cluster state change: WatchedEvent state:SyncConnected type:NodeDataChanged path:/clusterstate.json, has occurred - updating... (live nodes size: 5)
   [junit4]   2> 1553457 T4452 oascc.ZkStateReader$2.process A cluster state change: WatchedEvent state:SyncConnected type:NodeDataChanged path:/clusterstate.json, has occurred - updating... (live nodes size: 5)
   [junit4]   2> 1553457 T4427 oascc.ZkStateReader$2.process A cluster state change: WatchedEvent state:SyncConnected type:NodeDataChanged path:/clusterstate.json, has occurred - updating... (live nodes size: 5)
   [junit4]   2> 1554445 T4440 oasc.ZkController.waitForShardId waiting to find shard id in clusterstate for nodes_used_collection_shard1_replica2
   [junit4]   2> 1554445 T4456 oasc.ZkController.waitForShardId waiting to find shard id in clusterstate for nodes_used_collection_shard1_replica1
   [junit4]   2> 1554446 T4440 oasc.ZkController.createCollectionZkNode Check for collection zkNode:nodes_used_collection
   [junit4]   2> 1554446 T4488 oasc.ZkController.waitForShardId waiting to find shard id in clusterstate for nodes_used_collection_shard2_replica1
   [junit4]   2> 1554446 T4456 oasc.ZkController.createCollectionZkNode Check for collection zkNode:nodes_used_collection
   [junit4]   2> 1554447 T4440 oasc.ZkController.createCollectionZkNode Collection zkNode exists
   [junit4]   2> 1554447 T4472 oasc.ZkController.waitForShardId waiting to find shard id in clusterstate for nodes_used_collection_shard2_replica2
   [junit4]   2> 1554447 T4488 oasc.ZkController.createCollectionZkNode Check for collection zkNode:nodes_used_collection
   [junit4]   2> 1554448 T4472 oasc.ZkController.createCollectionZkNode Check for collection zkNode:nodes_used_collection
   [junit4]   2> 1554448 T4488 oasc.ZkController.createCollectionZkNode Collection zkNode exists
   [junit4]   2> 1554449 T4472 oasc.ZkController.createCollectionZkNode Collection zkNode exists
   [junit4]   2> 1554449 T4472 oascc.ZkStateReader.readConfigName Load collection config from:/collections/nodes_used_collection
   [junit4]   2> 1554447 T4440 oascc.ZkStateReader.readConfigName Load collection config from:/collections/nodes_used_collection
   [junit4]   2> 1554447 T4456 oasc.ZkController.createCollectionZkNode Collection zkNode exists
   [junit4]   2> 1554450 T4472 oascc.ZkStateReader.readConfigName path=/collections/nodes_used_collection configName=conf1 specified config exists in ZooKeeper
   [junit4]   2> 1554449 T4488 oascc.ZkStateReader.readConfigName Load collection config from:/collections/nodes_used_collection
   [junit4]   2> 1554450 T4472 oasc.SolrResourceLoader.<init> new SolrResourceLoader for directory: '/usr/home/jenkins/jenkins-slave/workspace/Lucene-Solr-NightlyTests-5.x/solr/build/solr-core/test/J3/temp/solr.cloud.CollectionsAPIDistributedZkTest-D0BBE4846841C4A4-001/tempDir-005/nodes_used_collection_shard2_replica2/'
   [junit4]   2> 1554450 T4440 oascc.ZkStateReader.readConfigName path=/collections/nodes_used_collection configName=conf1 specified config exists in ZooKeeper
   [junit4]   2> 1554450 T4456 oascc.ZkStateReader.readConfigName Load collection config from:/collections/nodes_used_collection
   [junit4]   2> 1554451 T4440 oasc.SolrResourceLoader.<init> new SolrResourceLoader for directory: '/usr/home/jenkins/jenkins-slave/workspace/Lucene-Solr-NightlyTests-5.x/solr/build/solr-core/test/J3/temp/solr.cloud.CollectionsAPIDistributedZkTest-D0BBE4846841C4A4-001/tempDir-003/nodes_used_collection_shard1_replica2/'
   [junit4]   2> 1554451 T4488 oascc.ZkStateReader.readConfigName path=/collections/nodes_used_collection configName=conf1 specified config exists in ZooKeeper
   [junit4]   2> 1554452 T4456 oascc.ZkStateReader.readConfigName path=/collections/nodes_used_collection configName=conf1 specified config exists in ZooKeeper
   [junit4]   2> 1554452 T4488 oasc.SolrResourceLoader.<init> new SolrResourceLoader for directory: '/usr/home/jenkins/jenkins-slave/workspace/Lucene-Solr-NightlyTests-5.x/solr/build/solr-core/test/J3/temp/solr.cloud.CollectionsAPIDistributedZkTest-D0BBE4846841C4A4-001/tempDir-006/nodes_used_collection_shard2_replica1/'
   [junit4]   2> 1554452 T4456 oasc.SolrResourceLoader.<init> new SolrResourceLoader for directory: '../../../../../../../../../../../usr/home/jenkins/jenkins-slave/workspace/Lucene-Solr-NightlyTests-5.x/solr/build/solr-core/test/J3/temp/solr.cloud.CollectionsAPIDistributedZkTest-D0BBE4846841C4A4-001/tempDir-004/nodes_used_collection_shard1_replica1/'
   [junit4]   2> 1554473 T4472 oasc.ZkController.watchZKConfDir watch zkdir /configs/conf1
   [junit4]   2> 1554476 T4472 oasc.Config.<init> loaded config solrconfig.xml with version 0 
   [junit4]   2> 1554478 T4456 oasc.ZkController.watchZKConfDir watch zkdir /configs/conf1
   [junit4]   2> 1554480 T4456 oasc.Config.<init> loaded config solrconfig.xml with version 0 
   [junit4]   2> 1554483 T4488 oasc.ZkController.watchZKConfDir watch zkdir /configs/conf1
   [junit4]   2> 1554485 T4488 oasc.Config.<init> loaded config solrconfig.xml with version 0 
   [junit4]   2> 1554488 T4440 oasc.ZkController.watchZKConfDir watch zkdir /configs/conf1
   [junit4]   2> 1554491 T4440 oasc.Config.<init> loaded config solrconfig.xml with version 0 
   [junit4]   2> 1554529 T4472 oasc.SolrConfig.<init> Using Lucene MatchVersion: 5.0.0
   [junit4]   2> 1554529 T4456 oasc.SolrConfig.<init> Using Lucene MatchVersion: 5.0.0
   [junit4]   2> 1554537 T4488 oasc.SolrConfig.<init> Using Lucene MatchVersion: 5.0.0
   [junit4]   2> 1554538 T4440 oasc.SolrConfig.<init> Using Lucene MatchVersion: 5.0.0
   [junit4]   2> 1554584 T4472 oasc.SolrConfig.<init> Loaded SolrConfig: solrconfig.xml
   [junit4]   2> 1554586 T4456 oasc.SolrConfig.<init> Loaded SolrConfig: solrconfig.xml
   [junit4]   2> 1554593 T4488 oasc.SolrConfig.<init> Loaded SolrConfig: solrconfig.xml
   [junit4]   2> 1554595 T4440 oasc.SolrConfig.<init> Loaded SolrConfig: solrconfig.xml
   [junit4]   2> 1554685 T4472 oass.IndexSchema.readSchema Reading Solr Schema from /configs/conf1/schema.xml
   [junit4]   2> 1554687 T4456 oass.IndexSchema.readSchema Reading Solr Schema from /configs/conf1/schema.xml
   [junit4]   2> 1554695 T4488 oass.IndexSchema.readSchema Reading Solr Schema from /configs/conf1/schema.xml
   [junit4]   2> 1554696 T4440 oass.IndexSchema.readSchema Reading Solr Schema from /configs/conf1/schema.xml
   [junit4]   2> 1554696 T4472 oass.IndexSchema.readSchema [nodes_used_collection_shard2_replica2] Schema name=test
   [junit4]   2> 1554698 T4456 oass.IndexSchema.readSchema [nodes_used_collection_shard1_replica1] Schema name=test
   [junit4]   2> 1554706 T4488 oass.IndexSchema.readSchema [nodes_used_collection_shard2_replica1] Schema name=test
   [junit4]   2> 1554707 T4440 oass.IndexSchema.readSchema [nodes_used_collection_shard1_replica2] Schema name=test
   [junit4]   2> 1555161 T4456 oass.OpenExchangeRatesOrgProvider.init Initialized with rates=open-exchange-rates.json, refreshInterval=1440.
   [junit4]   2> 1555161 T4488 oass.OpenExchangeRatesOrgProvider.init Initialized with rates=open-exchange-rates.json, refreshInterval=1440.
   [junit4]   2> 1555162 T4440 oass.OpenExchangeRatesOrgProvider.init Initialized with rates=open-exchange-rates.json, refreshInterval=1440.
   [junit4]   2> 1555167 T4472 oass.OpenExchangeRatesOrgProvider.init Initialized with rates=open-exchange-rates.json, refreshInterval=1440.
   [junit4]   2> 1555172 T4456 oass.IndexSchema.readSchema default search field in schema is text
   [junit4]   2> 1555173 T4440 oass.IndexSchema.readSchema default search field in schema is text
   [junit4]   2> 1555173 T4488 oass.IndexSchema.readSchema default search field in schema is text
   [junit4]   2> 1555174 T4472 oass.IndexSchema.readSchema default search field in schema is text
   [junit4]   2> 1555175 T4456 oass.IndexSchema.readSchema unique key field: id
   [junit4]   2> 1555176 T4440 oass.IndexSchema.readSchema unique key field: id
   [junit4]   2> 1555176 T4488 oass.IndexSchema.readSchema unique key field: id
   [junit4]   2> 1555177 T4472 oass.IndexSchema.readSchema unique key field: id
   [junit4]   2> 1555186 T4456 oass.FileExchangeRateProvider.reload Reloading exchange rates from file currency.xml
   [junit4]   2> 1555186 T4440 oass.FileExchangeRateProvider.reload Reloading exchange rates from file currency.xml
   [junit4]   2> 1555187 T4488 oass.FileExchangeRateProvider.reload Reloading exchange rates from file currency.xml
   [junit4]   2> 1555189 T4472 oass.FileExchangeRateProvider.reload Reloading exchange rates from file currency.xml
   [junit4]   2> 1555191 T4456 oass.FileExchangeRateProvider.reload Reloading exchange rates from file currency.xml
   [junit4]   2> 1555191 T4440 oass.FileExchangeRateProvider.reload Reloading exchange rates from file currency.xml
   [junit4]   2> 1555191 T4488 oass.FileExchangeRateProvider.reload Reloading exchange rates from file currency.xml
   [junit4]   2> 1555194 T4472 oass.FileExchangeRateProvider.reload Reloading exchange rates from file currency.xml
   [junit4]   2> 1555195 T4456 oass.OpenExchangeRatesOrgProvider.reload Reloading exchange rates from open-exchange-rates.json
   [junit4]   2> 1555196 T4440 oass.OpenExchangeRatesOrgProvider.reload Reloading exchange rates from open-exchange-rates.json
   [junit4]   2> 1555196 T4456 oass.OpenExchangeRatesOrgProvider$OpenExchangeRates.<init> WARN Unknown key IMPORTANT NOTE
   [junit4]   2> 1555196 T4488 oass.OpenExchangeRatesOrgProvider.reload Reloading exchange rates from open-exchange-rates.json
   [junit4]   2> 1555200 T4440 oass.OpenExchangeRatesOrgProvider$OpenExchangeRates.<init> WARN Unknown key IMPORTANT NOTE
   [junit4]   2> 1555200 T4456 oass.OpenExchangeRatesOrgProvider$OpenExchangeRates.<init> WARN Expected key, got STRING
   [junit4]   2> 1555201 T4488 oass.OpenExchangeRatesOrgProvider$OpenExchangeRates.<init> WARN Unknown key IMPORTANT NOTE
   [junit4]   2> 1555201 T4440 oass.OpenExchangeRatesOrgProvider$OpenExchangeRates.<init> WARN Expected key, got STRING
   [junit4]   2> 1555202 T4472 oass.OpenExchangeRatesOrgProvider.reload Reloading exchange rates from open-exchange-rates.json
   [junit4]   2> 1555202 T4488 oass.OpenExchangeRatesOrgProvider$OpenExchangeRates.<init> WARN Expected key, got STRING
   [junit4]   2> 1555201 T4456 oass.OpenExchangeRatesOrgProvider.reload Reloading exchange rates from open-exchange-rates.json
   [junit4]   2> 1555203 T4472 oass.OpenExchangeRatesOrgProvider$OpenExchangeRates.<init> WARN Unknown key IMPORTANT NOTE
   [junit4]   2> 1555203 T4488 oass.OpenExchangeRatesOrgProvider.reload Reloading exchange rates from open-exchange-rates.json
   [junit4]   2> 1555202 T4440 oass.OpenExchangeRatesOrgProvider.reload Reloading exchange rates from open-exchange-rates.json
   [junit4]   2> 1555204 T4456 oass.OpenExchangeRatesOrgProvider$OpenExchangeRates.<init> WARN Unknown key IMPORTANT NOTE
   [junit4]   2> 1555203 T4472 oass.OpenExchangeRatesOrgProvider$OpenExchangeRates.<init> WARN Expected key, got STRING
   [junit4]   2> 1555205 T4456 oass.OpenExchangeRatesOrgProvider$OpenExchangeRates.<init> WARN Expected key, got STRING
   [junit4]   2> 1555205 T4440 oass.OpenExchangeRatesOrgProvider$OpenExchangeRates.<init> WARN Unknown key IMPORTANT NOTE
   [junit4]   2> 1555204 T4488 oass.OpenExchangeRatesOrgProvider$OpenExchangeRates.<init> WARN Unknown key IMPORTANT NOTE
   [junit4]   2> 1555206 T4440 oass.OpenExchangeRatesOrgProvider$OpenExchangeRates.<init> WARN Expected key, got STRING
   [junit4]   2> 1555206 T4456 oasc.CoreContainer.create Creating SolrCore 'nodes_used_collection_shard1_replica1' using configuration from collection nodes_used_collection
   [junit4]   2> 1555205 T4472 oass.OpenExchangeRatesOrgProvider.reload Reloading exchange rates from open-exchange-rates.json
   [junit4]   2> 1555207 T4456 oasc.SolrCore.initDirectoryFactory org.apache.solr.core.MockDirectoryFactory
   [junit4]   2> 1555207 T4440 oasc.CoreContainer.create Creating SolrCore 'nodes_used_collection_shard1_replica2' using configuration from collection nodes_used_collection
   [junit4]   2> 1555206 T4488 oass.OpenExchangeRatesOrgProvider$OpenExchangeRates.<init> WARN Expected key, got STRING
   [junit4]   2> 1555208 T4440 oasc.SolrCore.initDirectoryFactory org.apache.solr.core.MockDirectoryFactory
   [junit4]   2> 1555208 T4456 oasc.SolrCore.<init> [nodes_used_collection_shard1_replica1] Opening new SolrCore at ../../../../../../../../../../../usr/home/jenkins/jenkins-slave/workspace/Lucene-Solr-NightlyTests-5.x/solr/build/solr-core/test/J3/temp/solr.cloud.CollectionsAPIDistributedZkTest-D0BBE4846841C4A4-001/tempDir-004/nodes_used_collection_shard1_replica1/, dataDir=/usr/home/jenkins/jenkins-slave/workspace/Lucene-Solr-NightlyTests-5.x/solr/build/solr-core/test/J3/../../../../../../../../../../../usr/home/jenkins/jenkins-slave/workspace/Lucene-Solr-NightlyTests-5.x/solr/build/solr-core/test/J3/temp/solr.cloud.CollectionsAPIDistributedZkTest-D0BBE4846841C4A4-001/tempDir-004/nodes_used_collection_shard1_replica1/data/
   [junit4]   2> 1555208 T4472 oass.OpenExchangeRatesOrgProvider$OpenExchangeRates.<init> WARN Unknown key IMPORTANT NOTE
   [junit4]   2> 1555209 T4456 oasc.JmxMonitoredMap.<init> JMX monitoring is enabled. Adding Solr mbeans to JMX Server: com.sun.jmx.mbeanserver.JmxMBeanServer@42fc523f
   [junit4]   2> 1555208 T4440 oasc.SolrCore.<init> [nodes_used_collection_shard1_replica2] Opening new SolrCore at /usr/home/jenkins/jenkins-slave/workspace/Lucene-Solr-NightlyTests-5.x/solr/build/solr-core/test/J3/temp/solr.cloud.CollectionsAPIDistributedZkTest-D0BBE4846841C4A4-001/tempDir-003/nodes_used_collection_shard1_replica2/, dataDir=/usr/home/jenkins/jenkins-slave/workspace/Lucene-Solr-NightlyTests-5.x/solr/build/solr-core/test/J3/temp/solr.cloud.CollectionsAPIDistributedZkTest-D0BBE4846841C4A4-001/tempDir-003/nodes_used_collection_shard1_replica2/data/
   [junit4]   2> 1555208 T4488 oasc.CoreContainer.create Creating SolrCore 'nodes_used_collection_shard2_replica1' using configuration from collection nodes_used_collection
   [junit4]   2> 1555210 T4440 oasc.JmxMonitoredMap.<init> JMX monitoring is enabled. Adding Solr mbeans to JMX Server: com.sun.jmx.mbeanserver.JmxMBeanServer@42fc523f
   [junit4]   2> 1555209 T4472 oass.OpenExchangeRatesOrgProvider$OpenExchangeRates.<init> WARN Expected key, got STRING
   [junit4]   2> 1555210 T4488 oasc.SolrCore.initDirectoryFactory org.apache.solr.core.MockDirectoryFactory
   [junit4]   2> 1555211 T4440 oasc.CachingDirectoryFactory.get return new directory for /usr/home/jenkins/jenkins-slave/workspace/Lucene-Solr-NightlyTests-5.x/solr/build/solr-core/test/J3/temp/solr.cloud.CollectionsAPIDistributedZkTest-D0BBE4846841C4A4-001/tempDir-003/nodes_used_collection_shard1_replica2/data
   [junit4]   2> 1555210 T4456 oasc.CachingDirectoryFactory.get return new directory for /usr/home/jenkins/jenkins-slave/workspace/Lucene-Solr-NightlyTests-5.x/solr/build/solr-core/test/J3/../../../../../../../../../../../usr/home/jenkins/jenkins-slave/workspace/Lucene-Solr-NightlyTests-5.x/solr/build/solr-core/test/J3/temp/solr.cloud.CollectionsAPIDistributedZkTest-D0BBE4846841C4A4-001/tempDir-004/nodes_used_collection_shard1_replica1/data
   [junit4]   2> 1555212 T4440 oasc.SolrCore.getNewIndexDir New index directory detected: old=null new=/usr/home/jenkins/jenkins-slave/workspace/Lucene-Solr-NightlyTests-5.x/solr/build/solr-core/test/J3/temp/solr.cloud.CollectionsAPIDistributedZkTest-D0BBE4846841C4A4-001/tempDir-003/nodes_used_collection_shard1_replica2/data/index/
   [junit4]   2> 1555211 T4488 oasc.SolrCore.<init> [nodes_used_collection_shard2_replica1] Opening new SolrCore at /usr/home/jenkins/jenkins-slave/workspace/Lucene-Solr-NightlyTests-5.x/solr/build/solr-core/test/J3/temp/solr.cloud.CollectionsAPIDistributedZkTest-D0BBE4846841C4A4-001/tempDir-006/nodes_used_collection_shard2_replica1/, dataDir=/usr/home/jenkins/jenkins-slave/workspace/Lucene-Solr-NightlyTests-5.x/solr/build/solr-core/test/J3/temp/solr.cloud.CollectionsAPIDistributedZkTest-D0BBE4846841C4A4-001/tempDir-006/nodes_used_collection_shard2_replica1/data/
   [junit4]   2> 1555211 T4472 oasc.CoreContainer.create Creating SolrCore 'nodes_used_collection_shard2_replica2' using configuration from collection nodes_used_collection
   [junit4]   2> 1555213 T4488 oasc.JmxMonitoredMap.<init> JMX monitoring is enabled. Adding Solr mbeans to JMX Server: com.sun.jmx.mbeanserver.JmxMBeanServer@42fc523f
   [junit4]   2> 1555212 T4440 oasc.SolrCore.initIndex WARN [nodes_used_collection_shard1_replica2] Solr index directory '/usr/home/jenkins/jenkins-slave/workspace/Lucene-Solr-NightlyTests-5.x/solr/build/solr-core/test/J3/temp/solr.cloud.CollectionsAPIDistributedZkTest-D0BBE4846841C4A4-001/tempDir-003/nodes_used_collection_shard1_replica2/data/index' doesn't exist. Creating new index...
   [junit4]   2> 1555212 T4456 oasc.SolrCore.getNewIndexDir New index directory detected: old=null new=/usr/home/jenkins/jenkins-slave/workspace/Lucene-Solr-NightlyTests-5.x/solr/build/solr-core/test/J3/../../../../../../../../../../../usr/home/jenkins/jenkins-slave/workspace/Lucene-Solr-NightlyTests-5.x/solr/build/solr-core/test/J3/temp/solr.cloud.CollectionsAPIDistributedZkTest-D0BBE4846841C4A4-001/tempDir-004/nodes_used_collection_shard1_replica1/data/index/
   [junit4]   2> 1555214 T4488 oasc.CachingDirectoryFactory.get return new directory for /usr/home/jenkins/jenkins-slave/workspace/Lucene-Solr-NightlyTests-5.x/solr/build/solr-core/test/J3/temp/solr.cloud.CollectionsAPIDistributedZkTest-D0BBE4846841C4A4-001/tempDir-006/nodes_used_collection_shard2_replica1/data
   [junit4]   2> 1555214 T4456 oasc.SolrCore.initIndex WARN [nodes_used_collection_shard1_replica1] Solr index directory '/usr/home/jenkins/jenkins-slave/workspace/Lucene-Solr-NightlyTests-5.x/solr/build/solr-core/test/J3/../../../../../../../../../../../usr/home/jenkins/jenkins-slave/workspace/Lucene-Solr-NightlyTests-5.x/solr/build/solr-core/test/J3/temp/solr.cloud.CollectionsAPIDistributedZkTest-D0BBE4846841C4A4-001/tempDir-004/nodes_used_collection_shard1_replica1/data/index' doesn't exist. Creating new index...
   [junit4]   2> 1555213 T4472 oasc.SolrCore.initDirectoryFactory org.apache.solr.core.MockDirectoryFactory
   [junit4]   2> 1555214 T4488 oasc.SolrCore.getNewIndexDir New index directory detected: old=null new=/usr/home/jenkins/jenkins-slave/workspace/Lucene-Solr-NightlyTests-5.x/solr/build/solr-core/test/J3/temp/solr.cloud.CollectionsAPIDistributedZkTest-D0BBE4846841C4A4-001/tempDir-006/nodes_used_collection_shard2_replica1/data/index/
   [junit4]   2> 1555215 T4440 oasc.CachingDirectoryFactory.get return new directory for /usr/home/jenkins/jenkins-slave/workspace/Lucene-Solr-NightlyTests-5.x/solr/build/solr-core/test/J3/temp/solr.cloud.CollectionsAPIDistributedZkTest-D0BBE4846841C4A4-001/tempDir-003/nodes_used_collection_shard1_replica2/data/index
   [junit4]   2> 1555215 T4472 oasc.SolrCore.<init> [nodes_used_collection_shard2_replica2] Opening new SolrCore at /usr/home/jenkins/jenkins-slave/workspace/Lucene-Solr-NightlyTests-5.x/solr/build/solr-core/test/J3/temp/solr.cloud.CollectionsAPIDistributedZkTest-D0BBE4846841C4A4-001/tempDir-005/nodes_used_collection_shard2_replica2/, dataDir=/usr/home/jenkins/jenkins-slave/workspace/Lucene-Solr-NightlyTests-5.x/solr/build/solr-core/test/J3/temp/solr.cloud.CollectionsAPIDistributedZkTest-D0BBE4846841C4A4-001/tempDir-005/nodes_used_collection_shard2_replica2/data/
   [junit4]   2> 1555216 T4456 oasc.CachingDirectoryFactory.get return new directory for /usr/home/jenkins/jenkins-slave/workspace/Lucene-Solr-NightlyTests-5.x/solr/build/solr-core/test/J3/../../../../../../../../../../../usr/home/jenkins/jenkins-slave/workspace/Lucene-Solr-NightlyTests-5.x/solr/build/solr-core/test/J3/temp/solr.cloud.CollectionsAPIDistributedZkTest-D0BBE4846841C4A4-001/tempDir-004/nodes_used_collection_shard1_replica1/data/index
   [junit4]   2> 1555216 T4472 oasc.JmxMonitoredMap.<init> JMX monitoring is enabled. Adding Solr mbeans to JMX Server: com.sun.jmx.mbeanserver.JmxMBeanServer@42fc523f
   [junit4]   2> 1555216 T4440 oasu.RandomMergePolicy.<init> RandomMergePolicy wrapping class org.apache.lucene.index.TieredMergePolicy: [TieredMergePolicy: maxMergeAtOnce=50, maxMergeAtOnceExplicit=36, maxMergedSegmentMB=2.931640625, floorSegmentMB=0.9853515625, forceMergeDeletesPctAllowed=22.377769735034732, segmentsPerTier=12.0, maxCFSSegmentSizeMB=8.796093022207999E12, noCFSRatio=0.0
   [junit4]   2> 1555216 T4488 oasc.SolrCore.initIndex WARN [nodes_used_collection_shard2_replica1] Solr index directory '/usr/home/jenkins/jenkins-slave/workspace/Lucene-Solr-NightlyTests-5.x/solr/build/solr-core/test/J3/temp/solr.cloud.CollectionsAPIDistributedZkTest-D0BBE4846841C4A4-001/tempDir-006/nodes_used_collection_shard2_replica1/data/index' doesn't exist. Creating new index...
   [junit4]   2> 1555218 T4472 oasc.CachingDirectoryFactory.get return new directory for /usr/home/jenkins/jenkins-slave/workspace/Lucene-Solr-NightlyTests-5.x/solr/build/solr-core/test/J3/temp/solr.cloud.CollectionsAPIDistributedZkTest-D0BBE4846841C4A4-001/tempDir-005/nodes_used_collection_shard2_replica2/data
   [junit4]   2> 1555217 T4456 oasu.RandomMergePolicy.<init> RandomMergePolicy wrapping class org.apache.lucene.index.TieredMergePolicy: [TieredMergePolicy: maxMergeAtOnce=50, maxMergeAtOnceExplicit=36, maxMergedSegmentMB=2.931640625, floorSegmentMB=0.9853515625, forceMergeDeletesPctAllowed=22.377769735034732, segmentsPerTier=12.0, maxCFSSegmentSizeMB=8.796093022207999E12, noCFSRatio=0.0
   [junit4]   2> 1555218 T4472 oasc.SolrCore.getNewIndexDir New index directory detected: old=null new=/usr/home/jenkins/jenkins-slave/workspace/Lucene-Solr-NightlyTests-5.x/solr/build/solr-core/test/J3/temp/solr.cloud.CollectionsAPIDistributedZkTest-D0BBE4846841C4A4-001/tempDir-005/nodes_used_collection_shard2_replica2/data/index/
   [junit4]   2> 1555219 T4472 oasc.SolrCore.initIndex WARN [nodes_used_collection_shard2_replica2] Solr index directory '/usr/home/jenkins/jenkins-slave/workspace/Lucene-Solr-NightlyTests-5.x/solr/build/solr-core/test/J3/temp/solr.cloud.CollectionsAPIDistributedZkTest-D0BBE4846841C4A4-001/tempDir-005/nodes_used_collection_shard2_replica2/data/index' doesn't exist. Creating new index...
   [junit4]   2> 1555220 T4488 oasc.CachingDirectoryFactory.get return new directory for /usr/home/jenkins/jenkins-slave/workspace/Lucene-Solr-NightlyTests-5.x/solr/build/solr-core/test/J3/temp/solr.cloud.CollectionsAPIDistributedZkTest-D0BBE4846841C4A4-001/tempDir-006/nodes_used_collection_shard2_replica1/data/index
   [junit4]   2> 1555220 T4488 oasu.RandomMergePolicy.<init> RandomMergePolicy wrapping class org.apache.lucene.index.TieredMergePolicy: [TieredMergePolicy: maxMergeAtOnce=50, maxMergeAtOnceExplicit=36, maxMergedSegmentMB=2.931640625, floorSegmentMB=0.9853515625, forceMergeDeletesPctAllowed=22.377769735034732, segmentsPerTier=12.0, maxCFSSegmentSizeMB=8.796093022207999E12, noCFSRatio=0.0
   [junit4]   2> 1555222 T4472 oasc.CachingDirectoryFactory.get return new directory for /usr/home/jenkins/jenkins-slave/workspace/Lucene-Solr-NightlyTests-5.x/solr/build/solr-core/test/J3/temp/solr.cloud.CollectionsAPIDistributedZkTest-D0BBE4846841C4A4-001/tempDir-005/nodes_used_collection_shard2_replica2/data/index
   [junit4]   2> 1555223 T4472 oasu.RandomMergePolicy.<init> RandomMergePolicy wrapping class org.apache.lucene.index.TieredMergePolicy: [TieredMergePolicy: maxMergeAtOnce=50, maxMergeAtOnceExplicit=36, maxMergedSegmentMB=2.931640625, floorSegmentMB=0.9853515625, forceMergeDeletesPctAllowed=22.377769735034732, segmentsPerTier=12.0, maxCFSSegmentSizeMB=8.796093022207999E12, noCFSRatio=0.0
   [junit4]   2> 1555238 T4440 oasc.SolrDeletionPolicy.onCommit SolrDeletionPolicy.onCommit: commits: num=1
   [junit4]   2> 		commit{dir=BaseDirectoryWrapper(MMapDirectory@/usr/home/jenkins/jenkins-slave/workspace/Lucene-Solr-NightlyTests-5.x/solr/build/solr-core/test/J3/temp/solr.cloud.CollectionsAPIDistributedZkTest-D0BBE4846841C4A4-001/index-MMapDirectory-001 lockFactory=org.apache.lucene.store.NativeFSLockFactory@1f87a22f),segFN=segments_1,generation=1}
   [junit4]   2> 1555238 T4440 oasc.SolrDeletionPolicy.updateCommits newest commit generation = 1
   [junit4]   2> 1555243 T4456 oasc.SolrDeletionPolicy.onCommit SolrDeletionPolicy.onCommit: commits: num=1
   [junit4]   2> 		commit{dir=BaseDirectoryWrapper(MMapDirectory@/usr/home/jenkins/jenkins-slave/workspace/Lucene-Solr-NightlyTests-5.x/solr/build/solr-core/test/J3/temp/solr.cloud.CollectionsAPIDistributedZkTest-D0BBE4846841C4A4-001/index-MMapDirectory-002 lockFactory=org.apache.lucene.store.NativeFSLockFactory@1f87a22f),segFN=segments_1,generation=1}
   [junit4]   2> 1555244 T4488 oasc.SolrDeletionPolicy.onCommit SolrDeletionPolicy.onCommit: commits: num=1
   [junit4]   2> 		commit{dir=BaseDirectoryWrapper(MMapDirectory@/usr/home/jenkins/jenkins-slave/workspace/Lucene-Solr-NightlyTests-5.x/solr/build/solr-core/test/J3/temp/solr.cloud.CollectionsAPIDistributedZkTest-D0BBE4846841C4A4-001/index-MMapDirectory-003 lockFactory=org.apache.lucene.store.NativeFSLockFactory@1f87a22f),segFN=segments_1,generation=1}
   [junit4]   2> 1555244 T4472 oasc.SolrDeletionPolicy.onCommit SolrDeletionPolicy.onCommit: commits: num=1
   [junit4]   2> 		commit{dir=BaseDirectoryWrapper(MMapDirectory@/usr/home/jenkins/jenkins-slave/workspace/Lucene-Solr-NightlyTests-5.x/solr/build/solr-core/test/J3/temp/solr.cloud.CollectionsAPIDistributedZkTest-D0BBE4846841C4A4-001/index-MMapDirectory-004 lockFactory=org.apache.lucene.store.NativeFSLockFactory@1f87a22f),segFN=segments_1,generation=1}
   [junit4]   2> 1555244 T4488 oasc.SolrDeletionPolicy.updateCommits newest commit generation = 1
   [junit4]   2> 1555244 T4440 oasup.UpdateRequestProcessorChain.init creating updateRequestProcessorChain "nodistrib"
   [junit4]   2> 1555244 T4456 oasc.SolrDeletionPolicy.updateCommits newest commit generation = 1
   [junit4]   2> 1555246 T4440 oasup.UpdateRequestProcessorChain.init creating updateRequestProcessorChain "dedupe"
   [junit4]   2> 1555245 T4472 oasc.SolrDeletionPolicy.updateCommits newest commit generation = 1
   [junit4]   2> 1555246 T4440 oasup.UpdateRequestProcessorChain.init inserting DistributedUpdateProcessorFactory into updateRequestProcessorChain "dedupe"
   [junit4]   2> 1555247 T4440 oasup.UpdateRequestProcessorChain.init creating updateRequestProcessorChain "stored_sig"
   [junit4]   2> 1555247 T4440 oasup.UpdateRequestProcessorChain.init inserting DistributedUpdateProcessorFactory into updateRequestProcessorChain "stored_sig"
   [junit4]   2> 1555248 T4440 oasup.UpdateRequestProcessorChain.init creating updateRequestProcessorChain "distrib-dup-test-chain-explicit"
   [junit4]   2> 1555248 T4440 oasup.UpdateRequestProcessorChain.init creating updateRequestProcessorChain "distrib-dup-test-chain-implicit"
   [junit4]   2> 1555249 T4440 oasup.UpdateRequestProcessorChain.init inserting DistributedUpdateProcessorFactory into updateRequestProcessorChain "distrib-dup-test-chain-implicit"
   [junit4]   2> 1555249 T4440 oasc.SolrCore.loadUpdateProcessorChains no updateRequestProcessorChain defined as default, creating implicit default
   [junit4]   2> 1555250 T4440 oasc.RequestHandlers.initHandlersFromConfig created /update: org.apache.solr.handler.UpdateRequestHandler
   [junit4]   2> 1555251 T4488 oasup.UpdateRequestProcessorChain.init creating updateRequestProcessorChain "nodistrib"
   [junit4]   2> 1555251 T4440 oasc.RequestHandlers.initHandlersFromConfig created /update/json: org.apache.solr.handler.UpdateRequestHandler
   [junit4]   2> 1555251 T4456 oasup.UpdateRequestProcessorChain.init creating updateRequestProcessorChain "nodistrib"
   [junit4]   2> 1555251 T4488 oasup.UpdateRequestProcessorChain.init creating updateRequestProcessorChain "dedupe"
   [junit4]   2> 1555252 T4472 oasup.UpdateRequestProcessorChain.init creating updateRequestProcessorChain "nodistrib"
   [junit4]   2> 1555252 T4456 oasup.UpdateRequestProcessorChain.init creating updateRequestProcessorChain "dedupe"
   [junit4]   2> 1555252 T4440 oasc.RequestHandlers.initHandlersFromConfig created /update/csv: org.apache.solr.handler.UpdateRequestHandler
   [junit4]   2> 1555253 T4456 oasup.UpdateRequestProcessorChain.init inserting DistributedUpdateProcessorFactory into updateRequestProcessorChain "dedupe"
   [junit4]   2> 1555253 T4472 oasup.UpdateRequestProcessorChain.init creating updateRequestProcessorChain "dedupe"
   [junit4]   2> 1555252 T4488 oasup.UpdateRequestProcessorChain.init inserting DistributedUpdateProcessorFactory into updateRequestProcessorChain "dedupe"
   [junit4]   2> 1555254 T4472 oasup.UpdateRequestProcessorChain.init inserting DistributedUpdateProcessorFactory into updateRequestProcessorChain "dedupe"
   [junit4]   2> 1555253 T4456 oasup.UpdateRequestProcessorChain.init creating updateRequestProcessorChain "stored_sig"
   [junit4]   2> 1555253 T4440 oasc.RequestHandlers.initHandlersFromConfig created /update/json/docs: org.apache.solr.handler.UpdateRequestHandler
   [junit4]   2> 1555255 T4456 oasup.UpdateRequestProcessorChain.init inserting DistributedUpdateProcessorFactory into updateRequestProcessorChain "stored_sig"
   [junit4]   2> 1555255 T4440 oasc.RequestHandlers.initHandlersFromConfig created /config: org.apache.solr.handler.SolrConfigHandler
   [junit4]   2> 1555254 T4472 oasup.UpdateRequestProcessorChain.init creating updateRequestProcessorChain "stored_sig"
   [junit4]   2> 1555254 T4488 oasup.UpdateRequestProcessorChain.init creating updateRequestProcessorChain "stored_sig"
   [junit4]   2> 1555256 T4472 oasup.UpdateRequestProcessorChain.init inserting DistributedUpdateProcessorFactory into updateRequestProcessorChain "stored_sig"
   [junit4]   2> 1555256 T4440 oasc.RequestHandlers.initHandlersFromConfig created /schema: org.apache.solr.handler.SchemaHandler
   [junit4]   2> 1555255 T4456 oasup.UpdateRequestProcessorChain.init creating updateRequestProcessorChain "distrib-dup-test-chain-explicit"
   [junit4]   2> 1555257 T4472 oasup.UpdateRequestProcessorChain.init creating updateRequestProcessorChain "distrib-dup-test-chain-explicit"
   [junit4]   2> 1555258 T4456 oasup.UpdateRequestProcessorChain.init creating updateRequestProcessorChain "distrib-dup-test-chain-implicit"
   [junit4]   2> 1555256 T4488 oasup.UpdateRequestProcessorChain.init inserting DistributedUpdateProcessorFactory into updateRequestProcessorChain "stored_sig"
   [junit4]   2> 1555258 T4456 oasup.UpdateRequestProcessorChain.init inserting DistributedUpdateProcessorFactory into updateRequestProcessorChain "distrib-dup-test-chain-implicit"
   [junit4]   2> 1555258 T4472 oasup.UpdateRequestProcessorChain.init creating updateRequestProcessorChain "distrib-dup-test-chain-implicit"
   [junit4]   2> 1555257 T4440 oasc.RequestHandlers.initHandlersFromConfig created /replication: org.apache.solr.handler.ReplicationHandler
   [junit4]   2> 1555259 T4472 oasup.UpdateRequestProcessorChain.init inserting DistributedUpdateProcessorFactory into updateRequestProcessorChain "distrib-dup-test-chain-implicit"
   [junit4]   2> 1555259 T4456 oasc.SolrCore.loadUpdateProcessorChains no updateRequestProcessorChain defined as default, creating implicit default
   [junit4]   2> 1555258 T4488 oasup.UpdateRequestProcessorChain.init creating updateRequestProcessorChain "distrib-dup-test-chain-explicit"
   [junit4]   2> 1555260 T4440 oasc.RequestHandlers.initHandlersFromConfig created /get: org.apache.solr.handler.RealTimeGetHandler
   [junit4]   2> 1555260 T4472 oasc.SolrCore.loadUpdateProcessorChains no updateRequestProcessorChain defined as default, creating implicit default
   [junit4]   2> 1555261 T4440 oasc.RequestHandlers.initHandlersFromConfig created /admin/luke: org.apache.solr.handler.admin.LukeRequestHandler
   [junit4]   2> 1555260 T4488 oasup.UpdateRequestProcessorChain.init creating updateRequestProcessorChain "distrib-dup-test-chain-implicit"
   [junit4]   2> 1555260 T4456 oasc.RequestHandlers.initHandlersFromConfig created /update: org.apache.solr.handler.UpdateRequestHandler
   [junit4]   2> 1555262 T4488 oasup.UpdateRequestProcessorChain.init inserting DistributedUpdateProcessorFactory into updateRequestProcessorChain "distrib-dup-test-chain-implicit"
   [junit4]   2> 1555261 T4472 oasc.RequestHandlers.initHandlersFromConfig created /update: org.apache.solr.handler.UpdateRequestHandler
   [junit4]   2> 1555262 T4488 oasc.SolrCore.loadUpdateProcessorChains no updateRequestProcessorChain defined as default, creating implicit default
   [junit4]   2> 1555262 T4456 oasc.RequestHandlers.initHandlersFromConfig created /update/json: org.apache.solr.handler.UpdateRequestHandler
   [junit4]   2> 1555262 T4440 oasc.RequestHandlers.initHandlersFromConfig created /admin/system: org.apache.solr.handler.admin.SystemInfoHandler
   [junit4]   2> 1555263 T4456 oasc.RequestHandlers.initHandlersFromConfig created /update/csv: org.apache.solr.handler.UpdateRequestHandler
   [junit4]   2> 1555263 T4488 oasc.RequestHandlers.initHandlersFromConfig created /update: org.apache.solr.handler.UpdateRequestHandler
   [junit4]   2> 1555263 T4472 oasc.RequestHandlers.initHandlersFromConfig created /update/json: org.apache.solr.handler.UpdateRequestHandler
   [junit4]   2> 1555264 T4488 oasc.RequestHandlers.initHandlersFromConfig created /update/json: org.apache.solr.handler.UpdateRequestHandler
   [junit4]   2> 1555264 T4456 oasc.RequestHandlers.initHandlersFromConfig created /update/json/docs: org.apache.solr.handler.UpdateRequestHandler
   [junit4]   2> 1555265 T4488 oasc.RequestHandlers.initHandlersFromConfig created /update/csv: org.apache.solr.handler.UpdateRequestHandler
   [junit4]   2> 1555264 T4440 oasc.RequestHandlers.initHandlersFromConfig created /admin/mbeans: org.apache.solr.handler.admin.SolrInfoMBeanHandler
   [junit4]   2> 1555266 T4488 oasc.RequestHandlers.initHandlersFromConfig created /update/json/docs: org.apache.solr.handler.UpdateRequestHandler
   [junit4]   2> 1555265 T4456 oasc.RequestHandlers.initHandlersFromConfig created /config: org.apache.solr.handler.SolrConfigHandler
   [junit4]   2> 1555265 T4472 oasc.RequestHandlers.initHandlersFromConfig created /update/csv: org.apache.solr.handler.UpdateRequestHandler
   [junit4]   2> 1555266 T4488 oasc.RequestHandlers.initHandlersFromConfig created /config: org.apache.solr.handler.SolrConfigHandler
   [junit4]   

[...truncated too long message...]

ollectionsAPIDistributedZkTest.java:908)
   [junit4]    > Caused by: org.apache.solr.client.solrj.impl.HttpSolrServer$RemoteSolrException: Error from server at http://127.0.0.1:65319/t_/vu: Could not fully create collection: awholynewstresscollection_collection5_2
   [junit4]    > 	at org.apache.solr.client.solrj.impl.HttpSolrServer.executeMethod(HttpSolrServer.java:566)
   [junit4]    > 	at org.apache.solr.client.solrj.impl.HttpSolrServer.request(HttpSolrServer.java:213)
   [junit4]    > 	at org.apache.solr.client.solrj.impl.HttpSolrServer.request(HttpSolrServer.java:209)
   [junit4]    > 	at org.apache.solr.client.solrj.impl.LBHttpSolrServer.doRequest(LBHttpSolrServer.java:354)
   [junit4]    > 	at org.apache.solr.client.solrj.impl.LBHttpSolrServer.request(LBHttpSolrServer.java:313)
   [junit4]    > 	... 6 moreThrowable #6: com.carrotsearch.randomizedtesting.UncaughtExceptionError: Captured an uncaught exception in thread: Thread[id=4929, name=Thread-2481, state=RUNNABLE, group=TGRP-CollectionsAPIDistributedZkTest]
   [junit4]    > Caused by: java.lang.RuntimeException: org.apache.solr.client.solrj.SolrServerException: No live SolrServers available to handle this request:[http://127.0.0.1:65324/t_/vu, http://127.0.0.1:65332/t_/vu, http://127.0.0.1:65319/t_/vu, http://127.0.0.1:65313/t_/vu, http://127.0.0.1:65328/t_/vu]
   [junit4]    > 	at __randomizedtesting.SeedInfo.seed([D0BBE4846841C4A4]:0)
   [junit4]    > 	at org.apache.solr.cloud.CollectionsAPIDistributedZkTest$1CollectionThread.run(CollectionsAPIDistributedZkTest.java:918)
   [junit4]    > Caused by: org.apache.solr.client.solrj.SolrServerException: No live SolrServers available to handle this request:[http://127.0.0.1:65324/t_/vu, http://127.0.0.1:65332/t_/vu, http://127.0.0.1:65319/t_/vu, http://127.0.0.1:65313/t_/vu, http://127.0.0.1:65328/t_/vu]
   [junit4]    > 	at org.apache.solr.client.solrj.impl.LBHttpSolrServer.request(LBHttpSolrServer.java:333)
   [junit4]    > 	at org.apache.solr.client.solrj.impl.CloudSolrServer.sendRequest(CloudSolrServer.java:1015)
   [junit4]    > 	at org.apache.solr.client.solrj.impl.CloudSolrServer.requestWithRetryOnStaleState(CloudSolrServer.java:793)
   [junit4]    > 	at org.apache.solr.client.solrj.impl.CloudSolrServer.request(CloudSolrServer.java:736)
   [junit4]    > 	at org.apache.solr.cloud.AbstractFullDistribZkTestBase.createCollection(AbstractFullDistribZkTestBase.java:1640)
   [junit4]    > 	at org.apache.solr.cloud.AbstractFullDistribZkTestBase.createCollection(AbstractFullDistribZkTestBase.java:1661)
   [junit4]    > 	at org.apache.solr.cloud.CollectionsAPIDistributedZkTest$1CollectionThread.run(CollectionsAPIDistributedZkTest.java:908)
   [junit4]    > Caused by: org.apache.solr.client.solrj.impl.HttpSolrServer$RemoteSolrException: Error from server at http://127.0.0.1:65319/t_/vu: Could not fully create collection: awholynewstresscollection_collection3_2
   [junit4]    > 	at org.apache.solr.client.solrj.impl.HttpSolrServer.executeMethod(HttpSolrServer.java:566)
   [junit4]    > 	at org.apache.solr.client.solrj.impl.HttpSolrServer.request(HttpSolrServer.java:213)
   [junit4]    > 	at org.apache.solr.client.solrj.impl.HttpSolrServer.request(HttpSolrServer.java:209)
   [junit4]    > 	at org.apache.solr.client.solrj.impl.LBHttpSolrServer.doRequest(LBHttpSolrServer.java:354)
   [junit4]    > 	at org.apache.solr.client.solrj.impl.LBHttpSolrServer.request(LBHttpSolrServer.java:313)
   [junit4]    > 	... 6 moreThrowable #7: com.carrotsearch.randomizedtesting.UncaughtExceptionError: Captured an uncaught exception in thread: Thread[id=4927, name=Thread-2479, state=RUNNABLE, group=TGRP-CollectionsAPIDistributedZkTest]
   [junit4]    > Caused by: java.lang.RuntimeException: org.apache.solr.client.solrj.SolrServerException: No live SolrServers available to handle this request:[http://127.0.0.1:65324/t_/vu, http://127.0.0.1:65332/t_/vu, http://127.0.0.1:65319/t_/vu, http://127.0.0.1:65313/t_/vu, http://127.0.0.1:65328/t_/vu]
   [junit4]    > 	at __randomizedtesting.SeedInfo.seed([D0BBE4846841C4A4]:0)
   [junit4]    > 	at org.apache.solr.cloud.CollectionsAPIDistributedZkTest$1CollectionThread.run(CollectionsAPIDistributedZkTest.java:918)
   [junit4]    > Caused by: org.apache.solr.client.solrj.SolrServerException: No live SolrServers available to handle this request:[http://127.0.0.1:65324/t_/vu, http://127.0.0.1:65332/t_/vu, http://127.0.0.1:65319/t_/vu, http://127.0.0.1:65313/t_/vu, http://127.0.0.1:65328/t_/vu]
   [junit4]    > 	at org.apache.solr.client.solrj.impl.LBHttpSolrServer.request(LBHttpSolrServer.java:333)
   [junit4]    > 	at org.apache.solr.client.solrj.impl.CloudSolrServer.sendRequest(CloudSolrServer.java:1015)
   [junit4]    > 	at org.apache.solr.client.solrj.impl.CloudSolrServer.requestWithRetryOnStaleState(CloudSolrServer.java:793)
   [junit4]    > 	at org.apache.solr.client.solrj.impl.CloudSolrServer.request(CloudSolrServer.java:736)
   [junit4]    > 	at org.apache.solr.cloud.AbstractFullDistribZkTestBase.createCollection(AbstractFullDistribZkTestBase.java:1640)
   [junit4]    > 	at org.apache.solr.cloud.AbstractFullDistribZkTestBase.createCollection(AbstractFullDistribZkTestBase.java:1661)
   [junit4]    > 	at org.apache.solr.cloud.CollectionsAPIDistributedZkTest$1CollectionThread.run(CollectionsAPIDistributedZkTest.java:908)
   [junit4]    > Caused by: org.apache.solr.client.solrj.impl.HttpSolrServer$RemoteSolrException: Error from server at http://127.0.0.1:65319/t_/vu: Could not fully create collection: awholynewstresscollection_collection1_3
   [junit4]    > 	at org.apache.solr.client.solrj.impl.HttpSolrServer.executeMethod(HttpSolrServer.java:566)
   [junit4]    > 	at org.apache.solr.client.solrj.impl.HttpSolrServer.request(HttpSolrServer.java:213)
   [junit4]    > 	at org.apache.solr.client.solrj.impl.HttpSolrServer.request(HttpSolrServer.java:209)
   [junit4]    > 	at org.apache.solr.client.solrj.impl.LBHttpSolrServer.doRequest(LBHttpSolrServer.java:354)
   [junit4]    > 	at org.apache.solr.client.solrj.impl.LBHttpSolrServer.request(LBHttpSolrServer.java:313)
   [junit4]    > 	... 6 more
   [junit4]   2> 2687545 T4401 oas.SolrTestCaseJ4.deleteCore ###deleteCore
   [junit4]   2> NOTE: leaving temporary files on disk at: /usr/home/jenkins/jenkins-slave/workspace/Lucene-Solr-NightlyTests-5.x/solr/build/solr-core/test/J3/temp/solr.cloud.CollectionsAPIDistributedZkTest-D0BBE4846841C4A4-001
   [junit4]   2> 1146261 T4400 ccr.ThreadLeakControl.checkThreadLeaks WARNING Will linger awaiting termination of 1 leaked thread(s).
   [junit4]   2> NOTE: test params are: codec=CheapBastard, sim=DefaultSimilarity, locale=es_UY, timezone=AET
   [junit4]   2> NOTE: FreeBSD 9.1-RELEASE-p3 amd64/Oracle Corporation 1.7.0_65 (64-bit)/cpus=16,threads=1,free=124430208,total=507510784
   [junit4]   2> NOTE: All tests run in this JVM: [TestWordDelimiterFilterFactory, TestManagedSchema, DistributedFacetPivotLargeTest, SOLR749Test, TestLMJelinekMercerSimilarityFactory, DeleteInactiveReplicaTest, HdfsChaosMonkeySafeLeaderTest, TestComplexPhraseQParserPlugin, SolrIndexConfigTest, ZkNodePropsTest, TestSolrIndexConfig, TestValueSourceCache, TestWriterPerf, CSVRequestHandlerTest, LeaderElectionTest, ShardRoutingTest, TestManagedStopFilterFactory, DistributedDebugComponentTest, TestDynamicFieldResource, XsltUpdateRequestHandlerTest, LeaderInitiatedRecoveryOnCommitTest, TestFiltering, TestSweetSpotSimilarityFactory, SharedFSAutoReplicaFailoverUtilsTest, TestGroupingSearch, TestHighlightDedupGrouping, TestSolrQueryParserDefaultOperatorResource, TestQueryTypes, TestReloadAndDeleteDocs, TermVectorComponentDistributedTest, TestConfigReload, TestStressRecovery, QueryResultKeyTest, DistributedQueueTest, TestJmxIntegration, TestIndexingPerformance, TestSurroundQueryParser, TestDistributedGrouping, TestSolrQueryParserResource, UpdateRequestProcessorFactoryTest, IndexSchemaRuntimeFieldTest, URLClassifyProcessorTest, RAMDirectoryFactoryTest, SSLMigrationTest, TestSolrXml, TestMissingGroups, FacetPivotSmallTest, TermsComponentTest, TestSearchPerf, ZkCLITest, SoftAutoCommitTest, DocValuesMultiTest, TestConfigOverlay, CoreAdminHandlerTest, ChaosMonkeySafeLeaderTest, BasicDistributedZk2Test, UnloadDistributedZkTest, CollectionsAPIDistributedZkTest]
   [junit4] Completed on J3 in 1147.06s, 1 test, 1 error <<< FAILURES!

[...truncated 730 lines...]
BUILD FAILED
/usr/home/jenkins/jenkins-slave/workspace/Lucene-Solr-NightlyTests-5.x/build.xml:536: The following error occurred while executing this line:
/usr/home/jenkins/jenkins-slave/workspace/Lucene-Solr-NightlyTests-5.x/build.xml:477: The following error occurred while executing this line:
/usr/home/jenkins/jenkins-slave/workspace/Lucene-Solr-NightlyTests-5.x/build.xml:61: The following error occurred while executing this line:
/usr/home/jenkins/jenkins-slave/workspace/Lucene-Solr-NightlyTests-5.x/extra-targets.xml:39: The following error occurred while executing this line:
/usr/home/jenkins/jenkins-slave/workspace/Lucene-Solr-NightlyTests-5.x/solr/build.xml:190: The following error occurred while executing this line:
/usr/home/jenkins/jenkins-slave/workspace/Lucene-Solr-NightlyTests-5.x/solr/common-build.xml:508: The following error occurred while executing this line:
/usr/home/jenkins/jenkins-slave/workspace/Lucene-Solr-NightlyTests-5.x/lucene/common-build.xml:1363: The following error occurred while executing this line:
/usr/home/jenkins/jenkins-slave/workspace/Lucene-Solr-NightlyTests-5.x/lucene/common-build.xml:970: There were test failures: 453 suites, 1855 tests, 1 error, 57 ignored (10 assumptions)

Total time: 175 minutes 18 seconds
Build step 'Invoke Ant' marked build as failure
Archiving artifacts
Sending artifact delta relative to Lucene-Solr-NightlyTests-5.x #705
Archived 5 artifacts
Archive block size is 32768
Received 0 blocks and 1133714042 bytes
Compression is 0.0%
Took 3 min 14 sec
Recording test results
Email was triggered for: Failure
Sending email for trigger: Failure



Mime
View raw message