lucene-dev mailing list archives

Site index · List index
Message view « Date » · « Thread »
Top « Date » · « Thread »
From Apache Jenkins Server <jenk...@builds.apache.org>
Subject [JENKINS-MAVEN] Lucene-Solr-Maven-5.x #802: POMs out of sync
Date Mon, 29 Dec 2014 16:56:55 GMT
Build: https://builds.apache.org/job/Lucene-Solr-Maven-5.x/802/

4 tests failed.
FAILED:  org.apache.solr.hadoop.MapReduceIndexerToolArgumentParserTest.org.apache.solr.hadoop.MapReduceIndexerToolArgumentParserTest

Error Message:
null

Stack Trace:
java.lang.AssertionError: null
	at __randomizedtesting.SeedInfo.seed([4A07A40669064479]:0)
	at org.apache.lucene.util.TestRuleTemporaryFilesCleanup.before(TestRuleTemporaryFilesCleanup.java:105)
	at com.carrotsearch.randomizedtesting.rules.TestRuleAdapter$1.before(TestRuleAdapter.java:26)
	at com.carrotsearch.randomizedtesting.rules.StatementAdapter.evaluate(StatementAdapter.java:35)
	at com.carrotsearch.randomizedtesting.rules.StatementAdapter.evaluate(StatementAdapter.java:36)
	at org.apache.lucene.util.TestRuleAssertionsRequired$1.evaluate(TestRuleAssertionsRequired.java:54)
	at org.apache.lucene.util.TestRuleMarkFailure$1.evaluate(TestRuleMarkFailure.java:48)
	at org.apache.lucene.util.TestRuleIgnoreAfterMaxFailures$1.evaluate(TestRuleIgnoreAfterMaxFailures.java:65)
	at org.apache.lucene.util.TestRuleIgnoreTestSuites$1.evaluate(TestRuleIgnoreTestSuites.java:55)
	at com.carrotsearch.randomizedtesting.rules.StatementAdapter.evaluate(StatementAdapter.java:36)
	at com.carrotsearch.randomizedtesting.ThreadLeakControl$StatementRunner.run(ThreadLeakControl.java:365)
	at java.lang.Thread.run(Thread.java:745)


FAILED:  org.apache.solr.hadoop.MorphlineGoLiveMiniMRTest.testDistribSearch

Error Message:
expected:<0> but was:<-1>

Stack Trace:
java.lang.AssertionError: expected:<0> but was:<-1>
	at __randomizedtesting.SeedInfo.seed([DAEA4B293B3E2E57:5B0CC5314C614E6B]:0)
	at org.junit.Assert.fail(Assert.java:93)
	at org.junit.Assert.failNotEquals(Assert.java:647)
	at org.junit.Assert.assertEquals(Assert.java:128)
	at org.junit.Assert.assertEquals(Assert.java:472)
	at org.junit.Assert.assertEquals(Assert.java:456)
	at org.apache.solr.hadoop.MorphlineGoLiveMiniMRTest.doTest(MorphlineGoLiveMiniMRTest.java:686)


FAILED:  org.apache.solr.hadoop.MorphlineBasicMiniMRTest.testPathParts

Error Message:
Test abandoned because suite timeout was reached.

Stack Trace:
java.lang.Exception: Test abandoned because suite timeout was reached.
	at __randomizedtesting.SeedInfo.seed([306648F2F9477A72]:0)


FAILED:  org.apache.solr.hadoop.MorphlineBasicMiniMRTest.org.apache.solr.hadoop.MorphlineBasicMiniMRTest

Error Message:
Suite timeout exceeded (>= 7200000 msec).

Stack Trace:
java.lang.Exception: Suite timeout exceeded (>= 7200000 msec).
	at __randomizedtesting.SeedInfo.seed([306648F2F9477A72]:0)




Build Log:
[...truncated 53941 lines...]
BUILD FAILED
/usr/home/jenkins/jenkins-slave/workspace/Lucene-Solr-Maven-5.x/build.xml:552: The following
error occurred while executing this line:
/usr/home/jenkins/jenkins-slave/workspace/Lucene-Solr-Maven-5.x/build.xml:204: The following
error occurred while executing this line:
: Java returned: 1

Total time: 407 minutes 16 seconds
Build step 'Invoke Ant' marked build as failure
Recording test results
Email was triggered for: Failure
Sending email for trigger: Failure



Mime
View raw message