lucene-dev mailing list archives

Site index · List index
Message view « Date » · « Thread »
Top « Date » · « Thread »
From Policeman Jenkins Server <jenk...@thetaphi.de>
Subject [JENKINS] Lucene-Solr-trunk-Linux (32bit/jdk1.9.0-ea-b34) - Build # 11803 - Failure!
Date Wed, 24 Dec 2014 21:14:38 GMT
Build: http://jenkins.thetaphi.de/job/Lucene-Solr-trunk-Linux/11803/
Java: 32bit/jdk1.9.0-ea-b34 -client -XX:+UseSerialGC (asserts: true)

1 tests failed.
FAILED:  org.apache.solr.spelling.SpellCheckCollatorTest.testEstimatedHitCounts

Error Message:
Exception during query

Stack Trace:
java.lang.RuntimeException: Exception during query
	at __randomizedtesting.SeedInfo.seed([EB8855170201AE5B:DA33EB22A73EBE8B]:0)
	at org.apache.solr.SolrTestCaseJ4.assertQ(SolrTestCaseJ4.java:730)
	at org.apache.solr.SolrTestCaseJ4.assertQ(SolrTestCaseJ4.java:697)
	at org.apache.solr.spelling.SpellCheckCollatorTest.testEstimatedHitCounts(SpellCheckCollatorTest.java:530)
	at sun.reflect.NativeMethodAccessorImpl.invoke0(Native Method)
	at sun.reflect.NativeMethodAccessorImpl.invoke(NativeMethodAccessorImpl.java:62)
	at sun.reflect.DelegatingMethodAccessorImpl.invoke(DelegatingMethodAccessorImpl.java:43)
	at java.lang.reflect.Method.invoke(Method.java:498)
	at com.carrotsearch.randomizedtesting.RandomizedRunner.invoke(RandomizedRunner.java:1618)
	at com.carrotsearch.randomizedtesting.RandomizedRunner$6.evaluate(RandomizedRunner.java:827)
	at com.carrotsearch.randomizedtesting.RandomizedRunner$7.evaluate(RandomizedRunner.java:863)
	at com.carrotsearch.randomizedtesting.RandomizedRunner$8.evaluate(RandomizedRunner.java:877)
	at com.carrotsearch.randomizedtesting.rules.SystemPropertiesRestoreRule$1.evaluate(SystemPropertiesRestoreRule.java:53)
	at org.apache.lucene.util.TestRuleSetupTeardownChained$1.evaluate(TestRuleSetupTeardownChained.java:50)
	at org.apache.lucene.util.AbstractBeforeAfterRule$1.evaluate(AbstractBeforeAfterRule.java:46)
	at com.carrotsearch.randomizedtesting.rules.SystemPropertiesInvariantRule$1.evaluate(SystemPropertiesInvariantRule.java:55)
	at org.apache.lucene.util.TestRuleThreadAndTestName$1.evaluate(TestRuleThreadAndTestName.java:49)
	at org.apache.lucene.util.TestRuleIgnoreAfterMaxFailures$1.evaluate(TestRuleIgnoreAfterMaxFailures.java:65)
	at org.apache.lucene.util.TestRuleMarkFailure$1.evaluate(TestRuleMarkFailure.java:48)
	at com.carrotsearch.randomizedtesting.rules.StatementAdapter.evaluate(StatementAdapter.java:36)
	at com.carrotsearch.randomizedtesting.ThreadLeakControl$StatementRunner.run(ThreadLeakControl.java:365)
	at com.carrotsearch.randomizedtesting.ThreadLeakControl.forkTimeoutingTask(ThreadLeakControl.java:798)
	at com.carrotsearch.randomizedtesting.ThreadLeakControl$3.evaluate(ThreadLeakControl.java:458)
	at com.carrotsearch.randomizedtesting.RandomizedRunner.runSingleTest(RandomizedRunner.java:836)
	at com.carrotsearch.randomizedtesting.RandomizedRunner$3.evaluate(RandomizedRunner.java:738)
	at com.carrotsearch.randomizedtesting.RandomizedRunner$4.evaluate(RandomizedRunner.java:772)
	at com.carrotsearch.randomizedtesting.RandomizedRunner$5.evaluate(RandomizedRunner.java:783)
	at com.carrotsearch.randomizedtesting.rules.StatementAdapter.evaluate(StatementAdapter.java:36)
	at com.carrotsearch.randomizedtesting.rules.SystemPropertiesRestoreRule$1.evaluate(SystemPropertiesRestoreRule.java:53)
	at org.apache.lucene.util.AbstractBeforeAfterRule$1.evaluate(AbstractBeforeAfterRule.java:46)
	at org.apache.lucene.util.TestRuleStoreClassName$1.evaluate(TestRuleStoreClassName.java:42)
	at com.carrotsearch.randomizedtesting.rules.SystemPropertiesInvariantRule$1.evaluate(SystemPropertiesInvariantRule.java:55)
	at com.carrotsearch.randomizedtesting.rules.NoShadowingOrOverridesOnMethodsRule$1.evaluate(NoShadowingOrOverridesOnMethodsRule.java:39)
	at com.carrotsearch.randomizedtesting.rules.NoShadowingOrOverridesOnMethodsRule$1.evaluate(NoShadowingOrOverridesOnMethodsRule.java:39)
	at com.carrotsearch.randomizedtesting.rules.StatementAdapter.evaluate(StatementAdapter.java:36)
	at com.carrotsearch.randomizedtesting.rules.StatementAdapter.evaluate(StatementAdapter.java:36)
	at com.carrotsearch.randomizedtesting.rules.StatementAdapter.evaluate(StatementAdapter.java:36)
	at org.apache.lucene.util.TestRuleAssertionsRequired$1.evaluate(TestRuleAssertionsRequired.java:54)
	at org.apache.lucene.util.TestRuleMarkFailure$1.evaluate(TestRuleMarkFailure.java:48)
	at org.apache.lucene.util.TestRuleIgnoreAfterMaxFailures$1.evaluate(TestRuleIgnoreAfterMaxFailures.java:65)
	at org.apache.lucene.util.TestRuleIgnoreTestSuites$1.evaluate(TestRuleIgnoreTestSuites.java:55)
	at com.carrotsearch.randomizedtesting.rules.StatementAdapter.evaluate(StatementAdapter.java:36)
	at com.carrotsearch.randomizedtesting.ThreadLeakControl$StatementRunner.run(ThreadLeakControl.java:365)
	at java.lang.Thread.run(Thread.java:745)
Caused by: java.lang.RuntimeException: REQUEST FAILED: xpath=//lst[@name='spellcheck']/lst[@name='collations']/lst[@name='collation']/int[@name='hits' and 6 <= . and . <= 10]
	xml response was: <?xml version="1.0" encoding="UTF-8"?>
<response>
<lst name="responseHeader"><int name="status">0</int><int name="QTime">4</int></lst><result name="response" numFound="0" start="0"></result><lst name="spellcheck"><lst name="suggestions"><lst name="everother"><int name="numFound">1</int><int name="startOffset">9</int><int name="endOffset">18</int><arr name="suggestion"><str>everyother</str></arr></lst></lst><lst name="collations"><lst name="collation"><str name="collationQuery">teststop:everyother</str><int name="hits">12</int><lst name="misspellingsAndCorrections"><str name="everother">everyother</str></lst></lst></lst></lst>
</response>

	request was:spellcheck=true&spellcheck.dictionary=direct&spellcheck.count=1&spellcheck.collate=true&spellcheck.maxCollationTries=1&spellcheck.maxCollations=1&spellcheck.collateExtendedResults=true&qt=spellCheckCompRH&q=teststop%3Aeverother&spellcheck.collateMaxCollectDocs=5
	at org.apache.solr.SolrTestCaseJ4.assertQ(SolrTestCaseJ4.java:723)
	... 42 more




Build Log:
[...truncated 9676 lines...]
   [junit4] Suite: org.apache.solr.spelling.SpellCheckCollatorTest
   [junit4]   2> Creating dataDir: /mnt/ssd/jenkins/workspace/Lucene-Solr-trunk-Linux/solr/build/solr-core/test/J1/temp/solr.spelling.SpellCheckCollatorTest-EB8855170201AE5B-001/init-core-data-001
   [junit4]   2> 2100321 T6240 oas.SolrTestCaseJ4.buildSSLConfig Randomized ssl (false) and clientAuth (false)
   [junit4]   2> 2100321 T6240 oas.SolrTestCaseJ4.initCore ####initCore
   [junit4]   2> 2100322 T6240 oasc.SolrResourceLoader.<init> new SolrResourceLoader for directory: '/mnt/ssd/jenkins/workspace/Lucene-Solr-trunk-Linux/solr/core/src/test-files/solr/collection1/'
   [junit4]   2> 2100322 T6240 oasc.SolrResourceLoader.replaceClassLoader Adding 'file:/mnt/ssd/jenkins/workspace/Lucene-Solr-trunk-Linux/solr/core/src/test-files/solr/collection1/lib/.svn/' to classloader
   [junit4]   2> 2100322 T6240 oasc.SolrResourceLoader.replaceClassLoader Adding 'file:/mnt/ssd/jenkins/workspace/Lucene-Solr-trunk-Linux/solr/core/src/test-files/solr/collection1/lib/classes/' to classloader
   [junit4]   2> 2100323 T6240 oasc.SolrResourceLoader.replaceClassLoader Adding 'file:/mnt/ssd/jenkins/workspace/Lucene-Solr-trunk-Linux/solr/core/src/test-files/solr/collection1/lib/README' to classloader
   [junit4]   2> 2100359 T6240 oasc.SolrConfig.<init> Using Lucene MatchVersion: 6.0.0
   [junit4]   2> 2100373 T6240 oasc.SolrConfig.<init> Loaded SolrConfig: solrconfig-spellcheckcomponent.xml
   [junit4]   2> 2100374 T6240 oass.IndexSchema.readSchema Reading Solr Schema from /mnt/ssd/jenkins/workspace/Lucene-Solr-trunk-Linux/solr/core/src/test-files/solr/collection1/conf/schema.xml
   [junit4]   2> 2100381 T6240 oass.IndexSchema.readSchema [null] Schema name=test
   [junit4]   2> 2100502 T6240 oass.OpenExchangeRatesOrgProvider.init Initialized with rates=open-exchange-rates.json, refreshInterval=1440.
   [junit4]   2> 2100507 T6240 oass.IndexSchema.readSchema default search field in schema is text
   [junit4]   2> 2100509 T6240 oass.IndexSchema.readSchema unique key field: id
   [junit4]   2> 2100513 T6240 oass.FileExchangeRateProvider.reload Reloading exchange rates from file currency.xml
   [junit4]   2> 2100515 T6240 oass.FileExchangeRateProvider.reload Reloading exchange rates from file currency.xml
   [junit4]   2> 2100517 T6240 oass.OpenExchangeRatesOrgProvider.reload Reloading exchange rates from open-exchange-rates.json
   [junit4]   2> 2100517 T6240 oass.OpenExchangeRatesOrgProvider$OpenExchangeRates.<init> WARN Unknown key IMPORTANT NOTE
   [junit4]   2> 2100517 T6240 oass.OpenExchangeRatesOrgProvider$OpenExchangeRates.<init> WARN Expected key, got STRING
   [junit4]   2> 2100518 T6240 oass.OpenExchangeRatesOrgProvider.reload Reloading exchange rates from open-exchange-rates.json
   [junit4]   2> 2100518 T6240 oass.OpenExchangeRatesOrgProvider$OpenExchangeRates.<init> WARN Unknown key IMPORTANT NOTE
   [junit4]   2> 2100518 T6240 oass.OpenExchangeRatesOrgProvider$OpenExchangeRates.<init> WARN Expected key, got STRING
   [junit4]   2> 2100519 T6240 oasc.SolrResourceLoader.locateSolrHome JNDI not configured for solr (NoInitialContextEx)
   [junit4]   2> 2100519 T6240 oasc.SolrResourceLoader.locateSolrHome using system property solr.solr.home: /mnt/ssd/jenkins/workspace/Lucene-Solr-trunk-Linux/solr/core/src/test-files/solr
   [junit4]   2> 2100519 T6240 oasc.SolrResourceLoader.<init> new SolrResourceLoader for directory: '/mnt/ssd/jenkins/workspace/Lucene-Solr-trunk-Linux/solr/core/src/test-files/solr/'
   [junit4]   2> 2100536 T6240 oasc.CoreContainer.<init> New CoreContainer 10022621
   [junit4]   2> 2100537 T6240 oasc.CoreContainer.load Loading cores into CoreContainer [instanceDir=/mnt/ssd/jenkins/workspace/Lucene-Solr-trunk-Linux/solr/core/src/test-files/solr/]
   [junit4]   2> 2100537 T6240 oashc.HttpShardHandlerFactory.getParameter Setting socketTimeout to: 0
   [junit4]   2> 2100537 T6240 oashc.HttpShardHandlerFactory.getParameter Setting urlScheme to: null
   [junit4]   2> 2100538 T6240 oashc.HttpShardHandlerFactory.getParameter Setting connTimeout to: 0
   [junit4]   2> 2100538 T6240 oashc.HttpShardHandlerFactory.getParameter Setting maxConnectionsPerHost to: 20
   [junit4]   2> 2100538 T6240 oashc.HttpShardHandlerFactory.getParameter Setting maxConnections to: 10000
   [junit4]   2> 2100538 T6240 oashc.HttpShardHandlerFactory.getParameter Setting corePoolSize to: 0
   [junit4]   2> 2100538 T6240 oashc.HttpShardHandlerFactory.getParameter Setting maximumPoolSize to: 2147483647
   [junit4]   2> 2100539 T6240 oashc.HttpShardHandlerFactory.getParameter Setting maxThreadIdleTime to: 5
   [junit4]   2> 2100539 T6240 oashc.HttpShardHandlerFactory.getParameter Setting sizeOfQueue to: -1
   [junit4]   2> 2100539 T6240 oashc.HttpShardHandlerFactory.getParameter Setting fairnessPolicy to: false
   [junit4]   2> 2100540 T6240 oasu.UpdateShardHandler.<init> Creating UpdateShardHandler HTTP client with params: socketTimeout=30000&connTimeout=30000&retry=false
   [junit4]   2> 2100540 T6240 oasl.LogWatcher.createWatcher SLF4J impl is org.slf4j.impl.Log4jLoggerFactory
   [junit4]   2> 2100540 T6240 oasl.LogWatcher.newRegisteredLogWatcher Registering Log Listener [Log4j (org.slf4j.impl.Log4jLoggerFactory)]
   [junit4]   2> 2100540 T6240 oasc.CoreContainer.load Host Name: 
   [junit4]   2> 2100542 T6241 oasc.SolrResourceLoader.<init> new SolrResourceLoader for directory: '/mnt/ssd/jenkins/workspace/Lucene-Solr-trunk-Linux/solr/core/src/test-files/solr/collection1/'
   [junit4]   2> 2100542 T6241 oasc.SolrResourceLoader.replaceClassLoader Adding 'file:/mnt/ssd/jenkins/workspace/Lucene-Solr-trunk-Linux/solr/core/src/test-files/solr/collection1/lib/.svn/' to classloader
   [junit4]   2> 2100542 T6241 oasc.SolrResourceLoader.replaceClassLoader Adding 'file:/mnt/ssd/jenkins/workspace/Lucene-Solr-trunk-Linux/solr/core/src/test-files/solr/collection1/lib/classes/' to classloader
   [junit4]   2> 2100543 T6241 oasc.SolrResourceLoader.replaceClassLoader Adding 'file:/mnt/ssd/jenkins/workspace/Lucene-Solr-trunk-Linux/solr/core/src/test-files/solr/collection1/lib/README' to classloader
   [junit4]   2> 2100569 T6241 oasc.SolrConfig.<init> Using Lucene MatchVersion: 6.0.0
   [junit4]   2> 2100583 T6241 oasc.SolrConfig.<init> Loaded SolrConfig: solrconfig-spellcheckcomponent.xml
   [junit4]   2> 2100584 T6241 oass.IndexSchema.readSchema Reading Solr Schema from /mnt/ssd/jenkins/workspace/Lucene-Solr-trunk-Linux/solr/core/src/test-files/solr/collection1/conf/schema.xml
   [junit4]   2> 2100590 T6241 oass.IndexSchema.readSchema [collection1] Schema name=test
   [junit4]   2> 2100709 T6241 oass.OpenExchangeRatesOrgProvider.init Initialized with rates=open-exchange-rates.json, refreshInterval=1440.
   [junit4]   2> 2100713 T6241 oass.IndexSchema.readSchema default search field in schema is text
   [junit4]   2> 2100714 T6241 oass.IndexSchema.readSchema unique key field: id
   [junit4]   2> 2100719 T6241 oass.FileExchangeRateProvider.reload Reloading exchange rates from file currency.xml
   [junit4]   2> 2100720 T6241 oass.FileExchangeRateProvider.reload Reloading exchange rates from file currency.xml
   [junit4]   2> 2100722 T6241 oass.OpenExchangeRatesOrgProvider.reload Reloading exchange rates from open-exchange-rates.json
   [junit4]   2> 2100722 T6241 oass.OpenExchangeRatesOrgProvider$OpenExchangeRates.<init> WARN Unknown key IMPORTANT NOTE
   [junit4]   2> 2100722 T6241 oass.OpenExchangeRatesOrgProvider$OpenExchangeRates.<init> WARN Expected key, got STRING
   [junit4]   2> 2100723 T6241 oass.OpenExchangeRatesOrgProvider.reload Reloading exchange rates from open-exchange-rates.json
   [junit4]   2> 2100723 T6241 oass.OpenExchangeRatesOrgProvider$OpenExchangeRates.<init> WARN Unknown key IMPORTANT NOTE
   [junit4]   2> 2100723 T6241 oass.OpenExchangeRatesOrgProvider$OpenExchangeRates.<init> WARN Expected key, got STRING
   [junit4]   2> 2100723 T6241 oasc.CoreContainer.create Creating SolrCore 'collection1' using configuration from instancedir /mnt/ssd/jenkins/workspace/Lucene-Solr-trunk-Linux/solr/core/src/test-files/solr/collection1/
   [junit4]   2> 2100724 T6241 oasc.SolrCore.initDirectoryFactory org.apache.solr.core.MockDirectoryFactory
   [junit4]   2> 2100724 T6241 oasc.SolrCore.<init> [collection1] Opening new SolrCore at /mnt/ssd/jenkins/workspace/Lucene-Solr-trunk-Linux/solr/core/src/test-files/solr/collection1/, dataDir=/mnt/ssd/jenkins/workspace/Lucene-Solr-trunk-Linux/solr/build/solr-core/test/J1/temp/solr.spelling.SpellCheckCollatorTest-EB8855170201AE5B-001/init-core-data-001/
   [junit4]   2> 2100724 T6241 oasc.SolrCore.<init> JMX monitoring not detected for core: collection1
   [junit4]   2> 2100724 T6241 oasc.CachingDirectoryFactory.get return new directory for /mnt/ssd/jenkins/workspace/Lucene-Solr-trunk-Linux/solr/build/solr-core/test/J1/temp/solr.spelling.SpellCheckCollatorTest-EB8855170201AE5B-001/init-core-data-001
   [junit4]   2> 2100725 T6241 oasc.SolrCore.getNewIndexDir New index directory detected: old=null new=/mnt/ssd/jenkins/workspace/Lucene-Solr-trunk-Linux/solr/build/solr-core/test/J1/temp/solr.spelling.SpellCheckCollatorTest-EB8855170201AE5B-001/init-core-data-001/index/
   [junit4]   2> 2100725 T6241 oasc.SolrCore.initIndex WARN [collection1] Solr index directory '/mnt/ssd/jenkins/workspace/Lucene-Solr-trunk-Linux/solr/build/solr-core/test/J1/temp/solr.spelling.SpellCheckCollatorTest-EB8855170201AE5B-001/init-core-data-001/index' doesn't exist. Creating new index...
   [junit4]   2> 2100725 T6241 oasc.CachingDirectoryFactory.get return new directory for /mnt/ssd/jenkins/workspace/Lucene-Solr-trunk-Linux/solr/build/solr-core/test/J1/temp/solr.spelling.SpellCheckCollatorTest-EB8855170201AE5B-001/init-core-data-001/index
   [junit4]   2> 2100725 T6241 oasu.RandomMergePolicy.<init> RandomMergePolicy wrapping class org.apache.lucene.index.TieredMergePolicy: [TieredMergePolicy: maxMergeAtOnce=30, maxMergeAtOnceExplicit=44, maxMergedSegmentMB=3.8154296875, floorSegmentMB=1.041015625, forceMergeDeletesPctAllowed=10.489882742501987, segmentsPerTier=16.0, maxCFSSegmentSizeMB=8.796093022207999E12, noCFSRatio=1.0
   [junit4]   2> 2100726 T6241 oasc.SolrDeletionPolicy.onCommit SolrDeletionPolicy.onCommit: commits: num=1
   [junit4]   2> 		commit{dir=BaseDirectoryWrapper(RAMDirectory@1094458 lockFactory=org.apache.lucene.store.SingleInstanceLockFactory@722a89),segFN=segments_1,generation=1}
   [junit4]   2> 2100726 T6241 oasc.SolrDeletionPolicy.updateCommits newest commit generation = 1
   [junit4]   2> 2100727 T6241 oasc.SolrCore.loadUpdateProcessorChains no updateRequestProcessorChain defined as default, creating implicit default
   [junit4]   2> 2100727 T6241 oasc.RequestHandlers.initHandlersFromConfig created /update: org.apache.solr.handler.UpdateRequestHandler
   [junit4]   2> 2100728 T6241 oasc.RequestHandlers.initHandlersFromConfig created /update/json: org.apache.solr.handler.UpdateRequestHandler
   [junit4]   2> 2100728 T6241 oasc.RequestHandlers.initHandlersFromConfig created /update/csv: org.apache.solr.handler.UpdateRequestHandler
   [junit4]   2> 2100728 T6241 oasc.RequestHandlers.initHandlersFromConfig created /update/json/docs: org.apache.solr.handler.UpdateRequestHandler
   [junit4]   2> 2100728 T6241 oasc.RequestHandlers.initHandlersFromConfig created /config: org.apache.solr.handler.SolrConfigHandler
   [junit4]   2> 2100728 T6241 oasc.RequestHandlers.initHandlersFromConfig created /schema: org.apache.solr.handler.SchemaHandler
   [junit4]   2> 2100729 T6241 oasc.RequestHandlers.initHandlersFromConfig created /replication: org.apache.solr.handler.ReplicationHandler
   [junit4]   2> 2100729 T6241 oasc.RequestHandlers.initHandlersFromConfig created /get: org.apache.solr.handler.RealTimeGetHandler
   [junit4]   2> 2100729 T6241 oasc.RequestHandlers.initHandlersFromConfig created /admin/luke: org.apache.solr.handler.admin.LukeRequestHandler
   [junit4]   2> 2100730 T6241 oasc.RequestHandlers.initHandlersFromConfig created /admin/system: org.apache.solr.handler.admin.SystemInfoHandler
   [junit4]   2> 2100730 T6241 oasc.RequestHandlers.initHandlersFromConfig created /admin/mbeans: org.apache.solr.handler.admin.SolrInfoMBeanHandler
   [junit4]   2> 2100731 T6241 oasc.RequestHandlers.initHandlersFromConfig created /admin/plugins: org.apache.solr.handler.admin.PluginInfoHandler
   [junit4]   2> 2100731 T6241 oasc.RequestHandlers.initHandlersFromConfig created /admin/threads: org.apache.solr.handler.admin.ThreadDumpHandler
   [junit4]   2> 2100731 T6241 oasc.RequestHandlers.initHandlersFromConfig created /admin/properties: org.apache.solr.handler.admin.PropertiesRequestHandler
   [junit4]   2> 2100731 T6241 oasc.RequestHandlers.initHandlersFromConfig created /admin/logging: org.apache.solr.handler.admin.LoggingHandler
   [junit4]   2> 2100732 T6241 oasc.RequestHandlers.initHandlersFromConfig created /admin/file: org.apache.solr.handler.admin.ShowFileRequestHandler
   [junit4]   2> 2100732 T6241 oasc.RequestHandlers.initHandlersFromConfig created /admin/ping: org.apache.solr.handler.PingRequestHandler
   [junit4]   2> 2100732 T6241 oasc.RequestHandlers.initHandlersFromConfig created standard: solr.StandardRequestHandler
   [junit4]   2> 2100732 T6241 oasc.RequestHandlers.initHandlersFromConfig created spellCheckCompRH: org.apache.solr.handler.component.SearchHandler
   [junit4]   2> 2100733 T6241 oasc.RequestHandlers.initHandlersFromConfig created spellCheckCompRH1: org.apache.solr.handler.component.SearchHandler
   [junit4]   2> 2100733 T6241 oasc.RequestHandlers.initHandlersFromConfig created spellCheckWithWordbreak: org.apache.solr.handler.component.SearchHandler
   [junit4]   2> 2100734 T6241 oashl.XMLLoader.init xsltCacheLifetimeSeconds=60
   [junit4]   2> 2100735 T6241 oashl.XMLLoader.init xsltCacheLifetimeSeconds=60
   [junit4]   2> 2100736 T6241 oashl.XMLLoader.init xsltCacheLifetimeSeconds=60
   [junit4]   2> 2100737 T6241 oashl.XMLLoader.init xsltCacheLifetimeSeconds=60
   [junit4]   2> 2100737 T6241 oasc.SolrCore.initStatsCache Using default statsCache cache: org.apache.solr.search.stats.LocalStatsCache
   [junit4]   2> 2100738 T6241 oasu.CommitTracker.<init> Hard AutoCommit: disabled
   [junit4]   2> 2100738 T6241 oasu.CommitTracker.<init> Soft AutoCommit: disabled
   [junit4]   2> 2100738 T6241 oasu.RandomMergePolicy.<init> RandomMergePolicy wrapping class org.apache.lucene.index.TieredMergePolicy: [TieredMergePolicy: maxMergeAtOnce=26, maxMergeAtOnceExplicit=47, maxMergedSegmentMB=99.7158203125, floorSegmentMB=1.494140625, forceMergeDeletesPctAllowed=26.522979851725925, segmentsPerTier=35.0, maxCFSSegmentSizeMB=8.796093022207999E12, noCFSRatio=0.122061282776526
   [junit4]   2> 2100739 T6241 oasc.SolrDeletionPolicy.onInit SolrDeletionPolicy.onInit: commits: num=1
   [junit4]   2> 		commit{dir=BaseDirectoryWrapper(RAMDirectory@1094458 lockFactory=org.apache.lucene.store.SingleInstanceLockFactory@722a89),segFN=segments_1,generation=1}
   [junit4]   2> 2100739 T6241 oasc.SolrDeletionPolicy.updateCommits newest commit generation = 1
   [junit4]   2> 2100739 T6241 oass.SolrIndexSearcher.<init> Opening Searcher@9e1fc1[collection1] main
   [junit4]   2> 2100739 T6241 oasr.ManagedResourceStorage.newStorageIO WARN Cannot write to config directory /mnt/ssd/jenkins/workspace/Lucene-Solr-trunk-Linux/solr/core/src/test-files/solr/collection1/conf; switching to use InMemory storage instead.
   [junit4]   2> 2100740 T6241 oasr.RestManager.init Initializing RestManager with initArgs: {}
   [junit4]   2> 2100740 T6241 oasr.ManagedResourceStorage.load Reading _rest_managed.json using InMemoryStorage
   [junit4]   2> 2100740 T6241 oasr.RestManager.init Initializing 0 registered ManagedResources
   [junit4]   2> 2100740 T6241 oashc.SpellCheckComponent.inform Initializing spell checkers
   [junit4]   2> 2100826 T6241 oashc.SpellCheckComponent.inform Registering newSearcher listener for spellchecker: default
   [junit4]   2> 2100829 T6241 oashc.SpellCheckComponent.inform Registering newSearcher listener for spellchecker: default_teststop
   [junit4]   2> 2100829 T6241 oass.DirectSolrSpellChecker.init init: {name=direct,classname=solr.DirectSolrSpellChecker,minQueryLength=3,maxQueryFrequency=100.0,field=teststop}
   [junit4]   2> 2100830 T6241 oass.DirectSolrSpellChecker.init init: {name=direct_lowerfilt,classname=solr.DirectSolrSpellChecker,minQueryLength=3,maxQueryFrequency=100.0,field=lowerfilt}
   [junit4]   2> 2100833 T6241 oashc.SpellCheckComponent.inform Registering newSearcher listener for spellchecker: threshold
   [junit4]   2> 2100833 T6241 oass.DirectSolrSpellChecker.init init: {name=threshold_direct,classname=solr.DirectSolrSpellChecker,field=lowerfilt,spellcheckIndexDir=spellcheckerThreshold,buildOnCommit=true,thresholdTokenFrequency=0.29}
   [junit4]   2> 2100833 T6241 oashc.SpellCheckComponent.inform Registering newSearcher listener for spellchecker: threshold_direct
   [junit4]   2> 2100836 T6241 oashc.SpellCheckComponent.inform Registering newSearcher listener for spellchecker: multipleFields
   [junit4]   2> 2100846 T6241 oashc.SpellCheckComponent.inform Registering newSearcher listener for spellchecker: freq
   [junit4]   2> 2100849 T6241 oashc.SpellCheckComponent.inform Registering newSearcher listener for spellchecker: fqcn
   [junit4]   2> 2100849 T6241 oash.ReplicationHandler.inform Commits will be reserved for  10000
   [junit4]   2> 2100850 T6242 oashc.SpellCheckComponent$SpellCheckerListener.newSearcher Loading spell index for spellchecker: default
   [junit4]   2> 2100850 T6241 oasc.CoreContainer.registerCore registering core: collection1
   [junit4]   2> 2100850 T6242 oashc.SpellCheckComponent$SpellCheckerListener.newSearcher Loading spell index for spellchecker: default_teststop
   [junit4]   2> 2100851 T6242 oashc.SpellCheckComponent$SpellCheckerListener.newSearcher Loading spell index for spellchecker: direct
   [junit4]   2> 2100851 T6242 oashc.SpellCheckComponent$SpellCheckerListener.newSearcher Loading spell index for spellchecker: direct_lowerfilt
   [junit4]   2> 2100851 T6242 oashc.SpellCheckComponent$SpellCheckerListener.newSearcher Loading spell index for spellchecker: wordbreak
   [junit4]   2> 2100851 T6240 oas.SolrTestCaseJ4.initCore ####initCore end
   [junit4]   2> 2100851 T6242 oashc.SpellCheckComponent$SpellCheckerListener.newSearcher Loading spell index for spellchecker: threshold
   [junit4]   2> 2100852 T6242 oashc.SpellCheckComponent$SpellCheckerListener.newSearcher Loading spell index for spellchecker: threshold_direct
   [junit4]   2> 2100852 T6242 oashc.SpellCheckComponent$SpellCheckerListener.newSearcher Loading spell index for spellchecker: multipleFields
   [junit4]   2> ASYNC  NEW_CORE C2947 name=collection1 org.apache.solr.core.SolrCore@cb3114
   [junit4]   2> 2100852 T6240 C2947 oasup.LogUpdateProcessor.finish [collection1] webapp=null path=null params={} {add=[0]} 0 0
   [junit4]   2> 2100853 T6242 oashc.SpellCheckComponent$SpellCheckerListener.newSearcher Loading spell index for spellchecker: jarowinkler
   [junit4]   2> 2100853 T6242 oashc.SpellCheckComponent$SpellCheckerListener.newSearcher Loading spell index for spellchecker: external
   [junit4]   2> 2100853 T6242 oashc.SpellCheckComponent$SpellCheckerListener.newSearcher Loading spell index for spellchecker: freq
   [junit4]   2> 2100854 T6242 oashc.SpellCheckComponent$SpellCheckerListener.newSearcher Loading spell index for spellchecker: fqcn
   [junit4]   2> 2100854 T6240 C2947 oasup.LogUpdateProcessor.finish [collection1] webapp=null path=null params={} {add=[1]} 0 0
   [junit4]   2> 2100854 T6242 oashc.SpellCheckComponent$SpellCheckerListener.newSearcher Loading spell index for spellchecker: perDict
   [junit4]   2> 2100855 T6242 oasc.SolrCore.registerSearcher [collection1] Registered new searcher Searcher@9e1fc1[collection1] main{ExitableDirectoryReader(UninvertingDirectoryReader())}
   [junit4]   2> 2100856 T6240 C2947 oasup.LogUpdateProcessor.finish [collection1] webapp=null path=null params={} {add=[2]} 0 2
   [junit4]   2> 2100857 T6240 C2947 oasup.LogUpdateProcessor.finish [collection1] webapp=null path=null params={} {add=[3]} 0 1
   [junit4]   2> 2100857 T6240 C2947 oasup.LogUpdateProcessor.finish [collection1] webapp=null path=null params={} {add=[4]} 0 0
   [junit4]   2> 2100859 T6240 C2947 oasup.LogUpdateProcessor.finish [collection1] webapp=null path=null params={} {add=[5]} 0 1
   [junit4]   2> 2100860 T6240 C2947 oasup.LogUpdateProcessor.finish [collection1] webapp=null path=null params={} {add=[6]} 0 1
   [junit4]   2> 2100860 T6240 C2947 oasup.LogUpdateProcessor.finish [collection1] webapp=null path=null params={} {add=[7]} 0 0
   [junit4]   2> 2100862 T6240 C2947 oasup.LogUpdateProcessor.finish [collection1] webapp=null path=null params={} {add=[8]} 0 1
   [junit4]   2> 2100862 T6240 C2947 oasup.LogUpdateProcessor.finish [collection1] webapp=null path=null params={} {add=[9]} 0 0
   [junit4]   2> 2100863 T6240 C2947 oasup.LogUpdateProcessor.finish [collection1] webapp=null path=null params={} {add=[10]} 0 0
   [junit4]   2> 2100864 T6240 C2947 oasup.LogUpdateProcessor.finish [collection1] webapp=null path=null params={} {add=[11]} 0 1
   [junit4]   2> 2100865 T6240 C2947 oasup.LogUpdateProcessor.finish [collection1] webapp=null path=null params={} {add=[12]} 0 0
   [junit4]   2> 2100866 T6240 C2947 oasup.LogUpdateProcessor.finish [collection1] webapp=null path=null params={} {add=[13]} 0 0
   [junit4]   2> 2100867 T6240 C2947 oasup.LogUpdateProcessor.finish [collection1] webapp=null path=null params={} {add=[14]} 0 1
   [junit4]   2> 2100868 T6240 C2947 oasup.LogUpdateProcessor.finish [collection1] webapp=null path=null params={} {add=[15]} 0 0
   [junit4]   2> 2100868 T6240 C2947 oasup.LogUpdateProcessor.finish [collection1] webapp=null path=null params={} {add=[16]} 0 0
   [junit4]   2> 2100869 T6240 C2947 oasu.DirectUpdateHandler2.commit start commit{,optimize=false,openSearcher=true,waitSearcher=true,expungeDeletes=false,softCommit=false,prepareCommit=false}
   [junit4]   2> 2100872 T6240 C2947 oasc.SolrDeletionPolicy.onCommit SolrDeletionPolicy.onCommit: commits: num=2
   [junit4]   2> 		commit{dir=BaseDirectoryWrapper(RAMDirectory@1094458 lockFactory=org.apache.lucene.store.SingleInstanceLockFactory@722a89),segFN=segments_1,generation=1}
   [junit4]   2> 		commit{dir=BaseDirectoryWrapper(RAMDirectory@1094458 lockFactory=org.apache.lucene.store.SingleInstanceLockFactory@722a89),segFN=segments_2,generation=2}
   [junit4]   2> 2100873 T6240 C2947 oasc.SolrDeletionPolicy.updateCommits newest commit generation = 2
   [junit4]   2> 2100874 T6240 C2947 oass.SolrIndexSearcher.<init> Opening Searcher@3f55a8[collection1] main
   [junit4]   2> 2100875 T6240 C2947 oasu.DirectUpdateHandler2.commit end_commit_flush
   [junit4]   2> 2100875 T6242 oashc.SpellCheckComponent$SpellCheckerListener.buildSpellIndex Building spell index for spell checker: default
   [junit4]   2> 2100898 T6242 oashc.SpellCheckComponent$SpellCheckerListener.buildSpellIndex Building spell index for spell checker: default_teststop
   [junit4]   2> 2100930 T6242 oashc.SpellCheckComponent$SpellCheckerListener.buildSpellIndex Building spell index for spell checker: threshold
   [junit4]   2> 2100947 T6242 oashc.SpellCheckComponent$SpellCheckerListener.buildSpellIndex Building spell index for spell checker: threshold_direct
   [junit4]   2> 2100947 T6242 oashc.SpellCheckComponent$SpellCheckerListener.buildSpellIndex Building spell index for spell checker: multipleFields
   [junit4]   2> 2100978 T6242 oashc.SpellCheckComponent$SpellCheckerListener.buildSpellIndex Building spell index for spell checker: freq
   [junit4]   2> 2101008 T6242 oashc.SpellCheckComponent$SpellCheckerListener.buildSpellIndex Building spell index for spell checker: fqcn
   [junit4]   2> 2101037 T6242 oasc.SolrCore.registerSearcher [collection1] Registered new searcher Searcher@3f55a8[collection1] main{ExitableDirectoryReader(UninvertingDirectoryReader(Uninverting(_0(6.0.0):C3) Uninverting(_1(6.0.0):C3) Uninverting(_2(6.0.0):C3) Uninverting(_3(6.0.0):C3) Uninverting(_4(6.0.0):C3) Uninverting(_5(6.0.0):C2)))}
   [junit4]   2> 2101038 T6240 C2947 oasup.LogUpdateProcessor.finish [collection1] webapp=null path=null params={} {commit=} 0 169
   [junit4]   2> 2101040 T6240 oas.SolrTestCaseJ4.setUp ###Starting testCollateWithOverride
   [junit4]   2> 2101057 T6240 C2947 oasc.SolrCore.execute [collection1] webapp=null path=null params={mm=1&q=partisian+politcal+mashine&defType=edismax&spellcheck.dictionary=direct&qt=spellCheckCompRH&spellcheck=true&qf=teststop&spellcheck.maxCollations=10&spellcheck.count=10&spellcheck.maxCollationTries=10&wt=xml&spellcheck.collate=true} hits=0 status=0 QTime=16 
   [junit4]   2> 2101072 T6240 C2947 oasc.SolrCore.execute [collection1] webapp=null path=null params={mm=1&spellcheck.dictionary=direct&qt=spellCheckCompRH&spellcheck.maxCollations=10&spellcheck.maxCollationTries=10&q=partisian+politcal+mashine&defType=edismax&spellcheck.collateParam.mm=100%25&spellcheck=true&qf=teststop&spellcheck.count=10&wt=xml&spellcheck.collate=true} hits=0 status=0 QTime=14 
   [junit4]   2> 2101073 T6240 oas.SolrTestCaseJ4.tearDown ###Ending testCollateWithOverride
   [junit4]   2> 2101076 T6240 oas.SolrTestCaseJ4.setUp ###Starting testCollateWithMultipleRequestHandlers
   [junit4]   2> 2101120 T6240 oas.SolrTestCaseJ4.tearDown ###Ending testCollateWithMultipleRequestHandlers
   [junit4]   2> 2101124 T6240 oas.SolrTestCaseJ4.setUp ###Starting testZeroTries
   [junit4]   2> 2101169 T6240 oas.SolrTestCaseJ4.tearDown ###Ending testZeroTries
   [junit4]   2> 2101172 T6240 oas.SolrTestCaseJ4.setUp ###Starting testCollateWithGrouping
   [junit4]   2> 2101220 T6240 oas.SolrTestCaseJ4.tearDown ###Ending testCollateWithGrouping
   [junit4]   2> 2101223 T6240 oas.SolrTestCaseJ4.setUp ###Starting testExtendedCollate
   [junit4]   2> 2101280 T6240 oas.SolrTestCaseJ4.tearDown ###Ending testExtendedCollate
   [junit4]   2> 2101283 T6240 oas.SolrTestCaseJ4.setUp ###Starting testContextSensitiveCollate
   [junit4]   2> ASYNC  NEW_CORE C2948 name=collection1 org.apache.solr.core.SolrCore@cb3114
   [junit4]   2> 2101298 T6240 C2948 oasc.SolrCore.execute [collection1] webapp=null path=null params={spellcheck.collateExtendedResults=true&qt=spellCheckCompRH&spellcheck.dictionary=direct&indent=true&spellcheck.maxCollations=1&spellcheck.maxCollationTries=10&spellcheck.alternativeTermCount=5&spellcheck.build=true&spellcheck.extendedResults=true&q=teststop:(flew+AND+form+AND+heathrow)&spellcheck.maxResultsForSuggest=0&spellcheck=true&spellcheck.count=10&wt=xml&spellcheck.collate=true} hits=0 status=0 QTime=15 
   [junit4]   2> 2101307 T6240 C2948 oasc.SolrCore.execute [collection1] webapp=null path=null params={spellcheck.collateExtendedResults=true&qt=spellCheckCompRH&spellcheck.dictionary=direct&indent=true&spellcheck.maxCollations=1&spellcheck.maxCollationTries=10&spellcheck.alternativeTermCount=5&spellcheck.extendedResults=true&q=teststop:(june+AND+customs)&spellcheck.maxResultsForSuggest=1&spellcheck=true&spellcheck.count=10&wt=xml&spellcheck.collate=true} hits=1 status=0 QTime=7 
   [junit4]   2> 2101312 T6240 C2948 oasc.SolrCore.execute [collection1] webapp=null path=null params={mm=2&q=teststop:(june+customs)&qt=spellCheckCompRH&spellcheck.dictionary=direct&indent=true&spellcheck=true&spellcheck.count=10&spellcheck.alternativeTermCount=0&wt=xml&spellcheck.collate=true} hits=2 status=0 QTime=1 
   [junit4]   2> 2101371 T6240 C2948 oasc.SolrCore.execute [collection1] webapp=null path=null params={spellcheck.collateExtendedResults=true&qt=spellCheckCompRH&spellcheck.dictionary=default_teststop&indent=true&spellcheck.maxCollations=1&spellcheck.maxCollationTries=10&spellcheck.alternativeTermCount=5&spellcheck.build=true&spellcheck.extendedResults=true&q=teststop:(flew+AND+form+AND+heathrow)&spellcheck.maxResultsForSuggest=0&spellcheck=true&spellcheck.count=10&wt=xml&spellcheck.collate=true} hits=0 status=0 QTime=59 
   [junit4]   2> 2101375 T6240 C2948 oasc.SolrCore.execute [collection1] webapp=null path=null params={spellcheck.collateExtendedResults=true&qt=spellCheckCompRH&spellcheck.dictionary=default_teststop&indent=true&spellcheck.maxCollations=1&spellcheck.maxCollationTries=10&spellcheck.alternativeTermCount=5&spellcheck.extendedResults=true&q=teststop:(june+AND+customs)&spellcheck.maxResultsForSuggest=1&spellcheck=true&spellcheck.count=10&wt=xml&spellcheck.collate=true} hits=1 status=0 QTime=1 
   [junit4]   2> 2101377 T6240 C2948 oasc.SolrCore.execute [collection1] webapp=null path=null params={mm=2&q=teststop:(june+customs)&qt=spellCheckCompRH&spellcheck.dictionary=default_teststop&indent=true&spellcheck=true&spellcheck.count=10&spellcheck.alternativeTermCount=0&wt=xml&spellcheck.collate=true} hits=2 status=0 QTime=0 
   [junit4]   2> 2101378 T6240 oas.SolrTestCaseJ4.tearDown ###Ending testContextSensitiveCollate
   [junit4]   2> 2101381 T6240 oas.SolrTestCaseJ4.setUp ###Starting testCollateWithFilter
   [junit4]   2> 2101438 T6240 oas.SolrTestCaseJ4.tearDown ###Ending testCollateWithFilter
   [junit4]   2> 2101443 T6240 oas.SolrTestCaseJ4.setUp ###Starting testEstimatedHitCounts
   [junit4]   2> 2101446 T6240 C2948 oasc.SolrCore.execute [collection1] webapp=null path=null params={spellcheck=true&spellcheck.dictionary=direct&spellcheck.count=1&spellcheck.collate=true&spellcheck.maxCollationTries=1&spellcheck.maxCollations=1&spellcheck.collateExtendedResults=true&qt=spellCheckCompRH&q=teststop%3Ametnoia} hits=0 status=0 QTime=3 
   [junit4]   2> 2101451 T6240 C2948 oasc.SolrCore.execute [collection1] webapp=null path=null params={spellcheck=true&spellcheck.dictionary=direct&spellcheck.count=1&spellcheck.collate=true&spellcheck.maxCollationTries=1&spellcheck.maxCollations=1&spellcheck.collateExtendedResults=true&qt=spellCheckCompRH&q=teststop%3Ametnoia&spellcheck.collateMaxCollectDocs=0} hits=0 status=0 QTime=3 
   [junit4]   2> 2101455 T6240 C2948 oasc.SolrCore.execute [collection1] webapp=null path=null params={spellcheck=true&spellcheck.dictionary=direct&spellcheck.count=1&spellcheck.collate=true&spellcheck.maxCollationTries=1&spellcheck.maxCollations=1&spellcheck.collateExtendedResults=true&qt=spellCheckCompRH&q=teststop%3Ametnoia&spellcheck.collateMaxCollectDocs=30} hits=0 status=0 QTime=3 
   [junit4]   2> 2101459 T6240 C2948 oasc.SolrCore.execute [collection1] webapp=null path=null params={spellcheck=true&spellcheck.dictionary=direct&spellcheck.count=1&spellcheck.collate=true&spellcheck.maxCollationTries=1&spellcheck.maxCollations=1&spellcheck.collateExtendedResults=true&qt=spellCheckCompRH&q=teststop%3Ametnoia&spellcheck.collateMaxCollectDocs=100} hits=0 status=0 QTime=3 
   [junit4]   2> 2101463 T6240 C2948 oasc.SolrCore.execute [collection1] webapp=null path=null params={spellcheck=true&spellcheck.dictionary=direct&spellcheck.count=1&spellcheck.collate=true&spellcheck.maxCollationTries=1&spellcheck.maxCollations=1&spellcheck.collateExtendedResults=true&qt=spellCheckCompRH&q=teststop%3Ametnoia&spellcheck.collateMaxCollectDocs=10000} hits=0 status=0 QTime=3 
   [junit4]   2> 2101467 T6240 C2948 oasc.SolrCore.execute [collection1] webapp=null path=null params={spellcheck=true&spellcheck.dictionary=direct&spellcheck.count=1&spellcheck.collate=true&spellcheck.maxCollationTries=1&spellcheck.maxCollations=1&spellcheck.collateExtendedResults=true&qt=spellCheckCompRH&q=teststop%3Ametnoia&spellcheck.collateMaxCollectDocs=13} hits=0 status=0 QTime=3 
   [junit4]   2> 2101472 T6240 C2948 oasc.SolrCore.execute [collection1] webapp=null path=null params={spellcheck=true&spellcheck.dictionary=direct&spellcheck.count=1&spellcheck.collate=true&spellcheck.maxCollationTries=1&spellcheck.maxCollations=1&spellcheck.collateExtendedResults=true&qt=spellCheckCompRH&q=teststop%3Ametnoia&spellcheck.collateMaxCollectDocs=2} hits=0 status=0 QTime=3 
   [junit4]   2> 2101476 T6240 C2948 oasc.SolrCore.execute [collection1] webapp=null path=null params={spellcheck=true&spellcheck.dictionary=direct&spellcheck.count=1&spellcheck.collate=true&spellcheck.maxCollationTries=1&spellcheck.maxCollations=1&spellcheck.collateExtendedResults=true&qt=spellCheckCompRH&q=teststop%3Ametnoia&spellcheck.collateMaxCollectDocs=1} hits=0 status=0 QTime=3 
   [junit4]   2> 2101480 T6240 C2948 oasc.SolrCore.execute [collection1] webapp=null path=null params={spellcheck=true&spellcheck.dictionary=direct&spellcheck.count=1&spellcheck.collate=true&spellcheck.maxCollationTries=1&spellcheck.maxCollations=1&spellcheck.collateExtendedResults=true&qt=spellCheckCompRH&q=teststop%3Ametnoia&spellcheck.collateMaxCollectDocs=3} hits=0 status=0 QTime=3 
   [junit4]   2> 2101484 T6240 C2948 oasc.SolrCore.execute [collection1] webapp=null path=null params={spellcheck=true&spellcheck.dictionary=direct&spellcheck.count=1&spellcheck.collate=true&spellcheck.maxCollationTries=1&spellcheck.maxCollations=1&spellcheck.collateExtendedResults=true&qt=spellCheckCompRH&q=teststop%3Ametnoia&spellcheck.collateMaxCollectDocs=10} hits=0 status=0 QTime=3 
   [junit4]   2> 2101488 T6240 C2948 oasc.SolrCore.execute [collection1] webapp=null path=null params={spellcheck=true&spellcheck.dictionary=direct&spellcheck.count=1&spellcheck.collate=true&spellcheck.maxCollationTries=1&spellcheck.maxCollations=1&spellcheck.collateExtendedResults=true&qt=spellCheckCompRH&q=teststop%3Ametnoia&spellcheck.collateMaxCollectDocs=2} hits=0 status=0 QTime=3 
   [junit4]   2> 2101492 T6240 C2948 oasc.SolrCore.execute [collection1] webapp=null path=null params={spellcheck=true&spellcheck.dictionary=direct&spellcheck.count=1&spellcheck.collate=true&spellcheck.maxCollationTries=1&spellcheck.maxCollations=1&spellcheck.collateExtendedResults=true&qt=spellCheckCompRH&q=teststop%3Ametnoia&spellcheck.collateMaxCollectDocs=5} hits=0 status=0 QTime=3 
   [junit4]   2> 2101496 T6240 C2948 oasc.SolrCore.execute [collection1] webapp=null path=null params={spellcheck=true&spellcheck.dictionary=direct&spellcheck.count=1&spellcheck.collate=true&spellcheck.maxCollationTries=1&spellcheck.maxCollations=1&spellcheck.collateExtendedResults=true&qt=spellCheckCompRH&q=teststop%3Ametnoia&spellcheck.collateMaxCollectDocs=7} hits=0 status=0 QTime=3 
   [junit4]   2> 2101500 T6240 C2948 oasc.SolrCore.execute [collection1] webapp=null path=null params={spellcheck=true&spellcheck.dictionary=direct&spellcheck.count=1&spellcheck.collate=true&spellcheck.maxCollationTries=1&spellcheck.maxCollations=1&spellcheck.collateExtendedResults=true&qt=spellCheckCompRH&q=teststop%3Ametnoia&spellcheck.collateMaxCollectDocs=16} hits=0 status=0 QTime=3 
   [junit4]   2> 2101504 T6240 C2948 oasc.SolrCore.execute [collection1] webapp=null path=null params={spellcheck=true&spellcheck.dictionary=direct&spellcheck.count=1&spellcheck.collate=true&spellcheck.maxCollationTries=1&spellcheck.maxCollations=1&spellcheck.collateExtendedResults=true&qt=spellCheckCompRH&q=teststop%3Ametnoia&spellcheck.collateMaxCollectDocs=10} hits=0 status=0 QTime=3 
   [junit4]   2> 2101509 T6240 C2948 oasc.SolrCore.execute [collection1] webapp=null path=null params={spellcheck=true&spellcheck.dictionary=direct&spellcheck.count=1&spellcheck.collate=true&spellcheck.maxCollationTries=1&spellcheck.maxCollations=1&spellcheck.collateExtendedResults=true&qt=spellCheckCompRH&q=teststop%3Ametnoia&spellcheck.collateMaxCollectDocs=16} hits=0 status=0 QTime=4 
   [junit4]   2> 2101513 T6240 C2948 oasc.SolrCore.execute [collection1] webapp=null path=null params={spellcheck=true&spellcheck.dictionary=direct&spellcheck.count=1&spellcheck.collate=true&spellcheck.maxCollationTries=1&spellcheck.maxCollations=1&spellcheck.collateExtendedResults=true&qt=spellCheckCompRH&q=teststop%3Ametnoia&spellcheck.collateMaxCollectDocs=11} hits=0 status=0 QTime=3 
   [junit4]   2> 2101517 T6240 C2948 oasc.SolrCore.execute [collection1] webapp=null path=null params={spellcheck=true&spellcheck.dictionary=direct&spellcheck.count=1&spellcheck.collate=true&spellcheck.maxCollationTries=1&spellcheck.maxCollations=1&spellcheck.collateExtendedResults=true&qt=spellCheckCompRH&q=teststop%3Ametnoia&spellcheck.collateMaxCollectDocs=7} hits=0 status=0 QTime=3 
   [junit4]   2> 2101520 T6240 C2948 oasc.SolrCore.execute [collection1] webapp=null path=null params={spellcheck=true&spellcheck.dictionary=direct&spellcheck.count=1&spellcheck.collate=true&spellcheck.maxCollationTries=1&spellcheck.maxCollations=1&spellcheck.collateExtendedResults=true&qt=spellCheckCompRH&q=teststop%3Ametnoia&spellcheck.collateMaxCollectDocs=2} hits=0 status=0 QTime=3 
   [junit4]   2> 2101524 T6240 C2948 oasc.SolrCore.execute [collection1] webapp=null path=null params={spellcheck=true&spellcheck.dictionary=direct&spellcheck.count=1&spellcheck.collate=true&spellcheck.maxCollationTries=1&spellcheck.maxCollations=1&spellcheck.collateExtendedResults=true&qt=spellCheckCompRH&q=teststop%3Ametnoia&spellcheck.collateMaxCollectDocs=9} hits=0 status=0 QTime=3 
   [junit4]   2> 2101528 T6240 C2948 oasc.SolrCore.execute [collection1] webapp=null path=null params={spellcheck=true&spellcheck.dictionary=direct&spellcheck.count=1&spellcheck.collate=true&spellcheck.maxCollationTries=1&spellcheck.maxCollations=1&spellcheck.collateExtendedResults=true&qt=spellCheckCompRH&q=teststop%3Ametnoia&spellcheck.collateMaxCollectDocs=5} hits=0 status=0 QTime=3 
   [junit4]   2> 2101532 T6240 C2948 oasc.SolrCore.execute [collection1] webapp=null path=null params={spellcheck=true&spellcheck.dictionary=direct&spellcheck.count=1&spellcheck.collate=true&spellcheck.maxCollationTries=1&spellcheck.maxCollations=1&spellcheck.collateExtendedResults=true&qt=spellCheckCompRH&q=teststop%3Ametnoia&spellcheck.collateMaxCollectDocs=10} hits=0 status=0 QTime=3 
   [junit4]   2> 2101536 T6240 C2948 oasc.SolrCore.execute [collection1] webapp=null path=null params={spellcheck=true&spellcheck.dictionary=direct&spellcheck.count=1&spellcheck.collate=true&spellcheck.maxCollationTries=1&spellcheck.maxCollations=1&spellcheck.collateExtendedResults=true&qt=spellCheckCompRH&q=teststop%3Ametnoia&spellcheck.collateMaxCollectDocs=8} hits=0 status=0 QTime=3 
   [junit4]   2> 2101540 T6240 C2948 oasc.SolrCore.execute [collection1] webapp=null path=null params={spellcheck=true&spellcheck.dictionary=direct&spellcheck.count=1&spellcheck.collate=true&spellcheck.maxCollationTries=1&spellcheck.maxCollations=1&spellcheck.collateExtendedResults=true&qt=spellCheckCompRH&q=teststop%3Ametnoia&spellcheck.collateMaxCollectDocs=4} hits=0 status=0 QTime=3 
   [junit4]   2> 2101544 T6240 C2948 oasc.SolrCore.execute [collection1] webapp=null path=null params={spellcheck=true&spellcheck.dictionary=direct&spellcheck.count=1&spellcheck.collate=true&spellcheck.maxCollationTries=1&spellcheck.maxCollations=1&spellcheck.collateExtendedResults=true&qt=spellCheckCompRH&q=teststop%3Ametnoia&spellcheck.collateMaxCollectDocs=15} hits=0 status=0 QTime=3 
   [junit4]   2> 2101547 T6240 C2948 oasc.SolrCore.execute [collection1] webapp=null path=null params={spellcheck=true&spellcheck.dictionary=direct&spellcheck.count=1&spellcheck.collate=true&spellcheck.maxCollationTries=1&spellcheck.maxCollations=1&spellcheck.collateExtendedResults=true&qt=spellCheckCompRH&q=teststop%3Ametnoia&spellcheck.collateMaxCollectDocs=17} hits=0 status=0 QTime=3 
   [junit4]   2> 2101551 T6240 C2948 oasc.SolrCore.execute [collection1] webapp=null path=null params={spellcheck=true&spellcheck.dictionary=direct&spellcheck.count=1&spellcheck.collate=true&spellcheck.maxCollationTries=1&spellcheck.maxCollations=1&spellcheck.collateExtendedResults=true&qt=spellCheckCompRH&q=teststop%3Ametnoia&spellcheck.collateMaxCollectDocs=2} hits=0 status=0 QTime=3 
   [junit4]   2> 2101555 T6240 C2948 oasc.SolrCore.execute [collection1] webapp=null path=null params={spellcheck=true&spellcheck.dictionary=direct&spellcheck.count=1&spellcheck.collate=true&spellcheck.maxCollationTries=1&spellcheck.maxCollations=1&spellcheck.collateExtendedResults=true&qt=spellCheckCompRH&q=teststop%3Ametnoia&spellcheck.collateMaxCollectDocs=10} hits=0 status=0 QTime=3 
   [junit4]   2> 2101559 T6240 C2948 oasc.SolrCore.execute [collection1] webapp=null path=null params={spellcheck=true&spellcheck.dictionary=direct&spellcheck.count=1&spellcheck.collate=true&spellcheck.maxCollationTries=1&spellcheck.maxCollations=1&spellcheck.collateExtendedResults=true&qt=spellCheckCompRH&q=teststop%3Ametnoia&spellcheck.collateMaxCollectDocs=8} hits=0 status=0 QTime=3 
   [junit4]   2> 2101563 T6240 C2948 oasc.SolrCore.execute [collection1] webapp=null path=null params={spellcheck=true&spellcheck.dictionary=direct&spellcheck.count=1&spellcheck.collate=true&spellcheck.maxCollationTries=1&spellcheck.maxCollations=1&spellcheck.collateExtendedResults=true&qt=spellCheckCompRH&q=teststop%3Ametnoia&spellcheck.collateMaxCollectDocs=3} hits=0 status=0 QTime=3 
   [junit4]   2> 2101568 T6240 C2948 oasc.SolrCore.execute [collection1] webapp=null path=null params={spellcheck=true&spellcheck.dictionary=direct&spellcheck.count=1&spellcheck.collate=true&spellcheck.maxCollationTries=1&spellcheck.maxCollations=1&spellcheck.collateExtendedResults=true&qt=spellCheckCompRH&q=teststop%3Ametnoia&spellcheck.collateMaxCollectDocs=8} hits=0 status=0 QTime=4 
   [junit4]   2> 2101571 T6240 C2948 oasc.SolrCore.execute [collection1] webapp=null path=null params={spellcheck=true&spellcheck.dictionary=direct&spellcheck.count=1&spellcheck.collate=true&spellcheck.maxCollationTries=1&spellcheck.maxCollations=1&spellcheck.collateExtendedResults=true&qt=spellCheckCompRH&q=teststop%3Ametnoia&spellcheck.collateMaxCollectDocs=10} hits=0 status=0 QTime=3 
   [junit4]   2> 2101575 T6240 C2948 oasc.SolrCore.execute [collection1] webapp=null path=null params={spellcheck=true&spellcheck.dictionary=direct&spellcheck.count=1&spellcheck.collate=true&spellcheck.maxCollationTries=1&spellcheck.maxCollations=1&spellcheck.collateExtendedResults=true&qt=spellCheckCompRH&q=teststop%3Ametnoia&spellcheck.collateMaxCollectDocs=12} hits=0 status=0 QTime=3 
   [junit4]   2> 2101579 T6240 C2948 oasc.SolrCore.execute [collection1] webapp=null path=null params={spellcheck=true&spellcheck.dictionary=direct&spellcheck.count=1&spellcheck.collate=true&spellcheck.maxCollationTries=1&spellcheck.maxCollations=1&spellcheck.collateExtendedResults=true&qt=spellCheckCompRH&q=teststop%3Ametnoia&spellcheck.collateMaxCollectDocs=2} hits=0 status=0 QTime=3 
   [junit4]   2> ASYNC  NEW_CORE C2949 name=collection1 org.apache.solr.core.SolrCore@cb3114
   [junit4]   2> 2101590 T6240 C2949 oasc.SolrCore.execute [collection1] webapp=null path=null params={spellcheck=true&spellcheck.dictionary=direct&spellcheck.count=1&spellcheck.collate=true&spellcheck.maxCollationTries=1&spellcheck.maxCollations=1&spellcheck.collateExtendedResults=true&qt=spellCheckCompRH&q=teststop%3Ametnoia&spellcheck.collateMaxCollectDocs=1} hits=0 status=0 QTime=10 
   [junit4]   2> 2101595 T6240 C2949 oasc.SolrCore.execute [collection1] webapp=null path=null params={spellcheck=true&spellcheck.dictionary=direct&spellcheck.count=1&spellcheck.collate=true&spellcheck.maxCollationTries=1&spellcheck.maxCollations=1&spellcheck.collateExtendedResults=true&qt=spellCheckCompRH&q=teststop%3Aeverother&spellcheck.collateMaxCollectDocs=5} hits=0 status=0 QTime=4 
   [junit4]   2> 2101596 T6240 oas.SolrTestCaseJ4.assertQ ERROR REQUEST FAILED: xpath=//lst[@name='spellcheck']/lst[@name='collations']/lst[@name='collation']/int[@name='hits' and 6 <= . and . <= 10]
   [junit4]   2> 		xml response was: <?xml version="1.0" encoding="UTF-8"?>
   [junit4]   2> 	<response>
   [junit4]   2> 	<lst name="responseHeader"><int name="status">0</int><int name="QTime">4</int></lst><result name="response" numFound="0" start="0"></result><lst name="spellcheck"><lst name="suggestions"><lst name="everother"><int name="numFound">1</int><int name="startOffset">9</int><int name="endOffset">18</int><arr name="suggestion"><str>everyother</str></arr></lst></lst><lst name="collations"><lst name="collation"><str name="collationQuery">teststop:everyother</str><int name="hits">12</int><lst name="misspellingsAndCorrections"><str name="everother">everyother</str></lst></lst></lst></lst>
   [junit4]   2> 	</response>
   [junit4]   2> 	
   [junit4]   2> 		request was:spellcheck=true&spellcheck.dictionary=direct&spellcheck.count=1&spellcheck.collate=true&spellcheck.maxCollationTries=1&spellcheck.maxCollations=1&spellcheck.collateExtendedResults=true&qt=spellCheckCompRH&q=teststop%3Aeverother&spellcheck.collateMaxCollectDocs=5
   [junit4]   2> 2101597 T6240 oasc.SolrException.log ERROR REQUEST FAILED: spellcheck=true&spellcheck.dictionary=direct&spellcheck.count=1&spellcheck.collate=true&spellcheck.maxCollationTries=1&spellcheck.maxCollations=1&spellcheck.collateExtendedResults=true&qt=spellCheckCompRH&q=teststop%3Aeverother&spellcheck.collateMaxCollectDocs=5:java.lang.RuntimeException: REQUEST FAILED: xpath=//lst[@name='spellcheck']/lst[@name='collations']/lst[@name='collation']/int[@name='hits' and 6 <= . and . <= 10]
   [junit4]   2> 		xml response was: <?xml version="1.0" encoding="UTF-8"?>
   [junit4]   2> 	<response>
   [junit4]   2> 	<lst name="responseHeader"><int name="status">0</int><int name="QTime">4</int></lst><result name="response" numFound="0" start="0"></result><lst name="spellcheck"><lst name="suggestions"><lst name="everother"><int name="numFound">1</int><int name="startOffset">9</int><int name="endOffset">18</int><arr name="suggestion"><str>everyother</str></arr></lst></lst><lst name="collations"><lst name="collation"><str name="collationQuery">teststop:everyother</str><int name="hits">12</int><lst name="misspellingsAndCorrections"><str name="everother">everyother</str></lst></lst></lst></lst>
   [junit4]   2> 	</response>
   [junit4]   2> 	
   [junit4]   2> 		request was:spellcheck=true&spellcheck.dictionary=direct&spellcheck.count=1&spellcheck.collate=true&spellcheck.maxCollationTries=1&spellcheck.maxCollations=1&spellcheck.collateExtendedResults=true&qt=spellCheckCompRH&q=teststop%3Aeverother&spellcheck.collateMaxCollectDocs=5
   [junit4]   2> 		at org.apache.solr.SolrTestCaseJ4.assertQ(SolrTestCaseJ4.java:723)
   [junit4]   2> 		at org.apache.solr.SolrTestCaseJ4.assertQ(SolrTestCaseJ4.java:697)
   [junit4]   2> 		at org.apache.solr.spelling.SpellCheckCollatorTest.testEstimatedHitCounts(SpellCheckCollatorTest.java:530)
   [junit4]   2> 		at sun.reflect.NativeMethodAccessorImpl.invoke0(Native Method)
   [junit4]   2> 		at sun.reflect.NativeMethodAccessorImpl.invoke(NativeMethodAccessorImpl.java:62)
   [junit4]   2> 		at sun.reflect.DelegatingMethodAccessorImpl.invoke(DelegatingMethodAccessorImpl.java:43)
   [junit4]   2> 		at java.lang.reflect.Method.invoke(Method.java:498)
   [junit4]   2> 		at com.carrotsearch.randomizedtesting.RandomizedRunner.invoke(RandomizedRunner.java:1618)
   [junit4]   2> 		at com.carrotsearch.randomizedtesting.RandomizedRunner$6.evaluate(RandomizedRunner.java:827)
   [junit4]   2> 		at com.carrotsearch.randomizedtesting.RandomizedRunner$7.evaluate(RandomizedRunner.java:863)
   [junit4]   2> 		at com.carrotsearch.randomizedtesting.RandomizedRunner$8.evaluate(RandomizedRunner.java:877)
   [junit4]   2> 		at com.carrotsearch.randomizedtesting.rules.SystemPropertiesRestoreRule$1.evaluate(SystemPropertiesRestoreRule.java:53)
   [junit4]   2> 		at org.apache.lucene.util.TestRuleSetupTeardownChained$1.evaluate(TestRuleSetupTeardownChained.java:50)
   [junit4]   2> 		at org.apache.lucene.util.AbstractBeforeAfterRule$1.evaluate(AbstractBeforeAfterRule.java:46)
   [junit4]   2> 		at com.carrotsearch.randomizedtesting.rules.SystemPropertiesInvariantRule$1.evaluate(SystemPropertiesInvariantRule.java:55)
   [junit4]   2> 		at org.apache.lucene.util.TestRuleThreadAndTestName$1.evaluate(TestRuleThreadAndTestName.java:49)
   [junit4]   2> 		at org.apache.lucene.util.TestRuleIgnoreAfterMaxFailures$1.evaluate(TestRuleIgnoreAfterMaxFailures.java:65)
   [junit4]   2> 		at org.apache.lucene.util.TestRuleMarkFailure$1.evaluate(TestRuleMarkFailure.java:48)
   [junit4]   2> 		at com.carrotsearch.randomizedtesting.rules.StatementAdapter.evaluate(StatementAdapter.java:36)
   [junit4]   2> 		at com.carrotsearch.randomizedtesting.ThreadLeakControl$StatementRunner.run(ThreadLeakControl.java:365)
   [junit4]   2> 		at com.carrotsearch.randomizedtesting.ThreadLeakControl.forkTimeoutingTask(ThreadLeakControl.java:798)
   [junit4]   2> 		at com.carrotsearch.randomizedtesting.ThreadLeakControl$3.evaluate(ThreadLeakControl.java:458)
   [junit4]   2> 		at com.carrotsearch.randomizedtesting.RandomizedRunner.runSingleTest(RandomizedRunner.java:836)
   [junit4]   2> 		at com.carrotsearch.randomizedtesting.RandomizedRunner$3.evaluate(RandomizedRunner.java:738)
   [junit4]   2> 		at com.carrotsearch.randomizedtesting.RandomizedRunner$4.evaluate(RandomizedRunner.java:772)
   [junit4]   2> 		at com.carrotsearch.randomizedtesting.RandomizedRunner$5.evaluate(RandomizedRunner.java:783)
   [junit4]   2> 		at com.carrotsearch.randomizedtesting.rules.StatementAdapter.evaluate(StatementAdapter.java:36)
   [junit4]   2> 		at com.carrotsearch.randomizedtesting.rules.SystemPropertiesRestoreRule$1.evaluate(SystemPropertiesRestoreRule.java:53)
   [junit4]   2> 		at org.apache.lucene.util.AbstractBeforeAfterRule$1.evaluate(AbstractBeforeAfterRule.java:46)
   [junit4]   2> 		at org.apache.lucene.util.TestRuleStoreClassName$1.evaluate(TestRuleStoreClassName.java:42)
   [junit4]   2> 		at com.carrotsearch.randomizedtesting.rules.SystemPropertiesInvariantRule$1.evaluate(SystemPropertiesInvariantRule.java:55)
   [junit4]   2> 		at com.carrotsearch.randomizedtesting.rules.NoShadowingOrOverridesOnMethodsRule$1.evaluate(NoShadowingOrOverridesOnMethodsRule.java:39)
   [junit4]   2> 		at com.carrotsearch.randomizedtesting.rules.NoShadowingOrOverridesOnMethodsRule$1.evaluate(NoShadowingOrOverridesOnMethodsRule.java:39)
   [junit4]   2> 		at com.carrotsearch.randomizedtesting.rules.StatementAdapter.evaluate(StatementAdapter.java:36)
   [junit4]   2> 		at com.carrotsearch.randomizedtesting.rules.StatementAdapter.evaluate(StatementAdapter.java:36)
   [junit4]   2> 		at com.carrotsearch.randomizedtesting.rules.StatementAdapter.evaluate(StatementAdapter.java:36)
   [junit4]   2> 		at org.apache.lucene.util.TestRuleAssertionsRequired$1.evaluate(TestRuleAssertionsRequired.java:54)
   [junit4]   2> 		at org.apache.lucene.util.TestRuleMarkFailure$1.evaluate(TestRuleMarkFailure.java:48)
   [junit4]   2> 		at org.apache.lucene.util.TestRuleIgnoreAfterMaxFailures$1.evaluate(TestRuleIgnoreAfterMaxFailures.java:65)
   [junit4]   2> 		at org.apache.lucene.util.TestRuleIgnoreTestSuites$1.evaluate(TestRuleIgnoreTestSuites.java:55)
   [junit4]   2> 		at com.carrotsearch.randomizedtesting.rules.StatementAdapter.evaluate(StatementAdapter.java:36)
   [junit4]   2> 		at com.carrotsearch.randomizedtesting.ThreadLeakControl$StatementRunner.run(ThreadLeakControl.java:365)
   [junit4]   2> 		at java.lang.Thread.run(Thread.java:745)
   [junit4]   2> 	
   [junit4]   2> 2101598 T6240 oas.SolrTestCaseJ4.tearDown ###Ending testEstimatedHitCounts
   [junit4]   2> NOTE: reproduce with: ant test  -Dtestcase=SpellCheckCollatorTest -Dtests.method=testEstimatedHitCounts -Dtests.seed=EB8855170201AE5B -Dtests.multiplier=3 -Dtests.slow=true -Dtests.locale=ga_IE -Dtests.timezone=Brazil/East -Dtests.asserts=true -Dtests.file.encoding=US-ASCII
   [junit4] ERROR   0.17s J1 | SpellCheckCollatorTest.testEstimatedHitCounts <<<
   [junit4]    > Throwable #1: java.lang.RuntimeException: Exception during query
   [junit4]    > 	at __randomizedtesting.SeedInfo.seed([EB8855170201AE5B:DA33EB22A73EBE8B]:0)
   [junit4]    > 	at org.apache.solr.SolrTestCaseJ4.assertQ(SolrTestCaseJ4.java:730)
   [junit4]    > 	at org.apache.solr.SolrTestCaseJ4.assertQ(SolrTestCaseJ4.java:697)
   [junit4]    > 	at org.apache.solr.spelling.SpellCheckCollatorTest.testEstimatedHitCounts(SpellCheckCollatorTest.java:530)
   [junit4]    > 	at java.lang.Thread.run(Thread.java:745)
   [junit4]    > Caused by: java.lang.RuntimeException: REQUEST FAILED: xpath=//lst[@name='spellcheck']/lst[@name='collations']/lst[@name='collation']/int[@name='hits' and 6 <= . and . <= 10]
   [junit4]    > 	xml response was: <?xml version="1.0" encoding="UTF-8"?>
   [junit4]    > <response>
   [junit4]    > <lst name="responseHeader"><int name="status">0</int><int name="QTime">4</int></lst><result name="response" numFound="0" start="0"></result><lst name="spellcheck"><lst name="suggestions"><lst name="everother"><int name="numFound">1</int><int name="startOffset">9</int><int name="endOffset">18</int><arr name="suggestion"><str>everyother</str></arr></lst></lst><lst name="collations"><lst name="collation"><str name="collationQuery">teststop:everyother</str><int name="hits">12</int><lst name="misspellingsAndCorrections"><str name="everother">everyother</str></lst></lst></lst></lst>
   [junit4]    > </response>
   [junit4]    > 	request was:spellcheck=true&spellcheck.dictionary=direct&spellcheck.count=1&spellcheck.collate=true&spellcheck.maxCollationTries=1&spellcheck.maxCollations=1&spellcheck.collateExtendedResults=true&qt=spellCheckCompRH&q=teststop%3Aeverother&spellcheck.collateMaxCollectDocs=5
   [junit4]    > 	at org.apache.solr.SolrTestCaseJ4.assertQ(SolrTestCaseJ4.java:723)
   [junit4]    > 	... 42 more
   [junit4]   2> 2101617 T6240 oas.SolrTestCaseJ4.setUp ###Starting testCollationWithHypens
   [junit4]   2> 2101703 T6240 oas.SolrTestCaseJ4.tearDown ###Ending testCollationWithHypens
   [junit4]   2> 2101705 T6240 oas.SolrTestCaseJ4.deleteCore ###deleteCore
   [junit4]   2> 2101705 T6240 oasc.CoreContainer.shutdown Shutting down CoreContainer instance=10022621
   [junit4]   2> 2101705 T6240 oasc.SolrCore.close [collection1]  CLOSING SolrCore org.apache.solr.core.SolrCore@cb3114
   [junit4]   2> 2101706 T6240 oasu.DirectUpdateHandler2.close closing DirectUpdateHandler2{commits=1,autocommits=0,soft autocommits=0,optimizes=0,rollbacks=0,expungeDeletes=0,docsPending=0,adds=0,deletesById=0,deletesByQuery=0,errors=0,cumulative_adds=17,cumulative_deletesById=0,cumulative_deletesByQuery=0,cumulative_errors=0}
   [junit4]   2> 2101706 T6240 oasu.SolrCoreState.decrefSolrCoreState Closing SolrCoreState
   [junit4]   2> 2101706 T6240 oasu.DefaultSolrCoreState.closeIndexWriter SolrCoreState ref count has reached 0 - closing IndexWriter
   [junit4]   2> 2101706 T6240 oasu.DefaultSolrCoreState.closeIndexWriter closing IndexWriter with IndexWriterCloser
   [junit4]   2> 2101707 T6240 oasc.SolrCore.closeSearcher [collection1] Closing main searcher on request.
   [junit4]   2> 2101707 T6240 oasc.CachingDirectoryFactory.close Closing MockDirectoryFactory - 2 directories currently being tracked
   [junit4]   2> 2101708 T6240 oasc.CachingDirectoryFactory.closeCacheValue looking to close /mnt/ssd/jenkins/workspace/Lucene-Solr-trunk-Linux/solr/build/solr-core/test/J1/temp/solr.spelling.SpellCheckCollatorTest-EB8855170201AE5B-001/init-core-data-001 [CachedDir<<refCount=0;path=/mnt/ssd/jenkins/workspace/Lucene-Solr-trunk-Linux/solr/build/solr-core/test/J1/temp/solr.spelling.SpellCheckCollatorTest-EB8855170201AE5B-001/init-core-data-001;done=false>>]
   [junit4]   2> 2101708 T6240 oasc.CachingDirectoryFactory.close Closing directory: /mnt/ssd/jenkins/workspace/Lucene-Solr-trunk-Linux/solr/build/solr-core/test/J1/temp/solr.spelling.SpellCheckCollatorTest-EB8855170201AE5B-001/init-core-data-001
   [junit4]   2> 2101708 T6240 oasc.CachingDirectoryFactory.closeCacheValue looking to close /mnt/ssd/jenkins/workspace/Lucene-Solr-trunk-Linux/solr/build/solr-core/test/J1/temp/solr.spelling.SpellCheckCollatorTest-EB8855170201AE5B-001/init-core-data-001/index [CachedDir<<refCount=0;path=/mnt/ssd/jenkins/workspace/Lucene-Solr-trunk-Linux/solr/build/solr-core/test/J1/temp/solr.spelling.SpellCheckCollatorTest-EB8855170201AE5B-001/init-core-data-001/index;done=false>>]
   [junit4]   2> 2101708 T6240 oasc.CachingDirectoryFactory.close Closing directory: /mnt/ssd/jenkins/workspace/Lucene-Solr-trunk-Linux/solr/build/solr-core/test/J1/temp/solr.spelling.SpellCheckCollatorTest-EB8855170201AE5B-001/init-core-data-001/index
   [junit4]   2> NOTE: leaving temporary files on disk at: /mnt/ssd/jenkins/workspace/Lucene-Solr-trunk-Linux/solr/build/solr-core/test/J1/temp/solr.spelling.SpellCheckCollatorTest-EB8855170201AE5B-001
   [junit4]   2> NOTE: test params are: codec=Asserting(Lucene50): {start1=PostingsFormat(name=Memory doPackFST= true), lowerfilt1=PostingsFormat(name=Memory doPackFST= true), multiDefault=PostingsFormat(name=LuceneFixedGap), teststop=PostingsFormat(name=LuceneFixedGap), intDefault=FST50, range_facet_l=FST50, lowerfilt1and2=PostingsFormat(name=LuceneFixedGap), end4=PostingsFormat(name=Memory doPackFST= true), end3=PostingsFormat(name=LuceneFixedGap), end2=PostingsFormat(name=LuceneVarGapFixedInterval), end1=FST50, lowerfilt=PostingsFormat(name=LuceneFixedGap), gram1=FST50, id=PostingsFormat(name=LuceneVarGapFixedInterval), gram2=PostingsFormat(name=LuceneVarGapFixedInterval), gram3=PostingsFormat(name=LuceneFixedGap), start3=PostingsFormat(name=LuceneVarGapFixedInterval), gram4=PostingsFormat(name=Memory doPackFST= true), start2=PostingsFormat(name=LuceneFixedGap), word=FST50, timestamp=FST50, start4=FST50}, docValues:{timestamp=DocValuesFormat(name=Memory)}, sim=DefaultSimilarity, locale=ga_IE, timezone=Brazil/East
   [junit4]   2> NOTE: Linux 3.13.0-43-generic i386/Oracle Corporation 1.9.0-ea (32-bit)/cpus=8,threads=1,free=105601296,total=237195264
   [junit4]   2> NOTE: All tests run in this JVM: [DisMaxRequestHandlerTest, RollingRestartTest, CursorPagingTest, SpellPossibilityIteratorTest, TestSolrConfigHandlerConcurrent, ZkNodePropsTest, TestDocSet, TestPostingsSolrHighlighter, TestElisionMultitermQuery, BinaryUpdateRequestHandlerTest, DistributedDebugComponentTest, TestPseudoReturnFields, ExternalFileFieldSortTest, SignatureUpdateProcessorFactoryTest, TestShortCircuitedRequests, CSVRequestHandlerTest, TestSchemaVersionResource, DistributedExpandComponentTest, TestSystemIdResolver, TestJoin, TestDistributedMissingSort, CurrencyFieldXmlFileTest, HdfsUnloadDistributedZkTest, OverseerCollectionProcessorTest, MoreLikeThisHandlerTest, TestLuceneMatchVersion, DistribDocExpirationUpdateProcessorTest, ZkSolrClientTest, TestFieldSortValues, TestCustomSort, TestSolrJ, MBeansHandlerTest, TestFieldTypeResource, TestReloadAndDeleteDocs, CollectionsAPIDistributedZkTest, BadIndexSchemaTest, ChaosMonkeySafeLeaderTest, TestAnalyzeInfixSuggestions, TestDynamicFieldResource, TestCollationFieldDocValues, BasicDistributedZk2Test, TestExactSharedStatsCache, TestDistributedGrouping, CollectionsAPIAsyncDistributedZkTest, TestCloudInspectUtil, TestDefaultStatsCache, JsonLoaderTest, TestZkChroot, ResponseLogComponentTest, TestSchemaManager, TimeZoneUtilsTest, ConvertedLegacyTest, BadComponentTest, OutOfBoxZkACLAndCredentialsProvidersTest, TestReRankQParserPlugin, TestRecovery, CurrencyFieldOpenExchangeTest, HdfsRecoveryZkTest, TestSolrIndexConfig, TestChildDocTransformer, TestPerFieldSimilarity, TestReversedWildcardFilterFactory, TestReplicationHandlerBackup, DirectUpdateHandlerOptimizeTest, StandardRequestHandlerTest, SpellingQueryConverterTest, EchoParamsTest, PreAnalyzedUpdateProcessorTest, LeaderElectionIntegrationTest, LoggingHandlerTest, TestConfigSets, TestOrdValues, TestManagedSchemaFieldTypeResource, TestCopyFieldCollectionResource, TestSolr4Spatial, TestRandomMergePolicy, TestDefaultSimilarityFactory, TestNRTOpen, TestFreeTextSuggestions, TestFiltering, SolrCmdDistributorTest, CachingDirectoryFactoryTest, WordBreakSolrSpellCheckerTest, SpatialFilterTest, TestConfig, TriLevelCompositeIdRoutingTest, TestSolrDeletionPolicy1, HdfsBasicDistributedZk2Test, TermsComponentTest, SimplePostToolTest, TestMergePolicyConfig, FileBasedSpellCheckerTest, TermVectorComponentDistributedTest, TestMiniSolrCloudCluster, TestSearchPerf, TermVectorComponentTest, CopyFieldTest, ReturnFieldsTest, TestReload, TestDynamicLoading, PolyFieldTest, SearchHandlerTest, AnalysisErrorHandlingTest, TestBulkSchemaAPI, SolrRequestParserTest, BasicFunctionalityTest, XsltUpdateRequestHandlerTest, DocValuesMissingTest, TestCharFilters, BasicDistributedZkTest, SyncSliceTest, OpenCloseCoreStressTest, OverseerTest, ShardRoutingTest, BasicZkTest, RecoveryZkTest, ClusterStateUpdateTest, TestRandomFaceting, TestRandomDVFaceting, AutoCommitTest, TestFaceting, DistributedSpellCheckComponentTest, TestStressReorder, TestRangeQuery, SimpleFacetsTest, StatsComponentTest, SpellCheckComponentTest, TestSort, TestFunctionQuery, DirectUpdateHandlerTest, TestBadConfig, HighlighterTest, SoftAutoCommitTest, SolrIndexSplitterTest, TestCoreDiscovery, TestExtendedDismaxParser, SpellCheckCollatorTest]
   [junit4] Completed on J1 in 1.42s, 9 tests, 1 error <<< FAILURES!

[...truncated 605 lines...]
BUILD FAILED
/mnt/ssd/jenkins/workspace/Lucene-Solr-trunk-Linux/build.xml:519: The following error occurred while executing this line:
/mnt/ssd/jenkins/workspace/Lucene-Solr-trunk-Linux/build.xml:467: The following error occurred while executing this line:
/mnt/ssd/jenkins/workspace/Lucene-Solr-trunk-Linux/build.xml:61: The following error occurred while executing this line:
/mnt/ssd/jenkins/workspace/Lucene-Solr-trunk-Linux/extra-targets.xml:39: The following error occurred while executing this line:
/mnt/ssd/jenkins/workspace/Lucene-Solr-trunk-Linux/solr/build.xml:187: The following error occurred while executing this line:
/mnt/ssd/jenkins/workspace/Lucene-Solr-trunk-Linux/solr/common-build.xml:510: The following error occurred while executing this line:
/mnt/ssd/jenkins/workspace/Lucene-Solr-trunk-Linux/lucene/common-build.xml:1349: The following error occurred while executing this line:
/mnt/ssd/jenkins/workspace/Lucene-Solr-trunk-Linux/lucene/common-build.xml:956: There were test failures: 458 suites, 1853 tests, 1 error, 32 ignored (22 assumptions)

Total time: 89 minutes 37 seconds
Build step 'Invoke Ant' marked build as failure
[description-setter] Description set: Java: 32bit/jdk1.9.0-ea-b34 -client -XX:+UseSerialGC (asserts: true)
Archiving artifacts
Recording test results
Email was triggered for: Failure - Any
Sending email for trigger: Failure - Any



Mime
View raw message