lucene-dev mailing list archives

Site index · List index
Message view « Date » · « Thread »
Top « Date » · « Thread »
From Apache Jenkins Server <jenk...@builds.apache.org>
Subject [JENKINS] Lucene-Solr-NightlyTests-5.x - Build # 814 - Still Failing
Date Sat, 11 Apr 2015 16:44:56 GMT
Build: https://builds.apache.org/job/Lucene-Solr-NightlyTests-5.x/814/

1 tests failed.
FAILED:  org.apache.solr.cloud.RecoveryZkTest.test

Error Message:
shard1 is not consistent.  Got 862 from http://127.0.0.1:63103/ne_/s/collection1lastClient and got 192 from http://127.0.0.1:63106/ne_/s/collection1

Stack Trace:
java.lang.AssertionError: shard1 is not consistent.  Got 862 from http://127.0.0.1:63103/ne_/s/collection1lastClient and got 192 from http://127.0.0.1:63106/ne_/s/collection1
	at __randomizedtesting.SeedInfo.seed([2C3F78376E526F98:A46B47EDC0AE0260]:0)
	at org.junit.Assert.fail(Assert.java:93)
	at org.apache.solr.cloud.RecoveryZkTest.test(RecoveryZkTest.java:123)
	at sun.reflect.NativeMethodAccessorImpl.invoke0(Native Method)
	at sun.reflect.NativeMethodAccessorImpl.invoke(NativeMethodAccessorImpl.java:57)
	at sun.reflect.DelegatingMethodAccessorImpl.invoke(DelegatingMethodAccessorImpl.java:43)
	at java.lang.reflect.Method.invoke(Method.java:606)
	at com.carrotsearch.randomizedtesting.RandomizedRunner.invoke(RandomizedRunner.java:1627)
	at com.carrotsearch.randomizedtesting.RandomizedRunner$6.evaluate(RandomizedRunner.java:836)
	at com.carrotsearch.randomizedtesting.RandomizedRunner$7.evaluate(RandomizedRunner.java:872)
	at com.carrotsearch.randomizedtesting.RandomizedRunner$8.evaluate(RandomizedRunner.java:886)
	at org.apache.solr.BaseDistributedSearchTestCase$ShardsRepeatRule$ShardsFixedStatement.callStatement(BaseDistributedSearchTestCase.java:960)
	at org.apache.solr.BaseDistributedSearchTestCase$ShardsRepeatRule$ShardsStatement.evaluate(BaseDistributedSearchTestCase.java:935)
	at com.carrotsearch.randomizedtesting.rules.SystemPropertiesRestoreRule$1.evaluate(SystemPropertiesRestoreRule.java:57)
	at org.apache.lucene.util.TestRuleSetupTeardownChained$1.evaluate(TestRuleSetupTeardownChained.java:50)
	at org.apache.lucene.util.AbstractBeforeAfterRule$1.evaluate(AbstractBeforeAfterRule.java:46)
	at org.apache.lucene.util.TestRuleThreadAndTestName$1.evaluate(TestRuleThreadAndTestName.java:49)
	at org.apache.lucene.util.TestRuleIgnoreAfterMaxFailures$1.evaluate(TestRuleIgnoreAfterMaxFailures.java:65)
	at org.apache.lucene.util.TestRuleMarkFailure$1.evaluate(TestRuleMarkFailure.java:48)
	at com.carrotsearch.randomizedtesting.rules.StatementAdapter.evaluate(StatementAdapter.java:36)
	at com.carrotsearch.randomizedtesting.ThreadLeakControl$StatementRunner.run(ThreadLeakControl.java:365)
	at com.carrotsearch.randomizedtesting.ThreadLeakControl.forkTimeoutingTask(ThreadLeakControl.java:798)
	at com.carrotsearch.randomizedtesting.ThreadLeakControl$3.evaluate(ThreadLeakControl.java:458)
	at com.carrotsearch.randomizedtesting.RandomizedRunner.runSingleTest(RandomizedRunner.java:845)
	at com.carrotsearch.randomizedtesting.RandomizedRunner$3.evaluate(RandomizedRunner.java:747)
	at com.carrotsearch.randomizedtesting.RandomizedRunner$4.evaluate(RandomizedRunner.java:781)
	at com.carrotsearch.randomizedtesting.RandomizedRunner$5.evaluate(RandomizedRunner.java:792)
	at com.carrotsearch.randomizedtesting.rules.StatementAdapter.evaluate(StatementAdapter.java:36)
	at com.carrotsearch.randomizedtesting.rules.SystemPropertiesRestoreRule$1.evaluate(SystemPropertiesRestoreRule.java:57)
	at org.apache.lucene.util.AbstractBeforeAfterRule$1.evaluate(AbstractBeforeAfterRule.java:46)
	at com.carrotsearch.randomizedtesting.rules.StatementAdapter.evaluate(StatementAdapter.java:36)
	at org.apache.lucene.util.TestRuleStoreClassName$1.evaluate(TestRuleStoreClassName.java:42)
	at com.carrotsearch.randomizedtesting.rules.NoShadowingOrOverridesOnMethodsRule$1.evaluate(NoShadowingOrOverridesOnMethodsRule.java:39)
	at com.carrotsearch.randomizedtesting.rules.NoShadowingOrOverridesOnMethodsRule$1.evaluate(NoShadowingOrOverridesOnMethodsRule.java:39)
	at com.carrotsearch.randomizedtesting.rules.StatementAdapter.evaluate(StatementAdapter.java:36)
	at com.carrotsearch.randomizedtesting.rules.StatementAdapter.evaluate(StatementAdapter.java:36)
	at com.carrotsearch.randomizedtesting.rules.StatementAdapter.evaluate(StatementAdapter.java:36)
	at org.apache.lucene.util.TestRuleAssertionsRequired$1.evaluate(TestRuleAssertionsRequired.java:54)
	at org.apache.lucene.util.TestRuleMarkFailure$1.evaluate(TestRuleMarkFailure.java:48)
	at org.apache.lucene.util.TestRuleIgnoreAfterMaxFailures$1.evaluate(TestRuleIgnoreAfterMaxFailures.java:65)
	at org.apache.lucene.util.TestRuleIgnoreTestSuites$1.evaluate(TestRuleIgnoreTestSuites.java:55)
	at com.carrotsearch.randomizedtesting.rules.StatementAdapter.evaluate(StatementAdapter.java:36)
	at com.carrotsearch.randomizedtesting.ThreadLeakControl$StatementRunner.run(ThreadLeakControl.java:365)
	at java.lang.Thread.run(Thread.java:745)




Build Log:
[...truncated 10476 lines...]
   [junit4] Suite: org.apache.solr.cloud.RecoveryZkTest
   [junit4]   2> Creating dataDir: /usr/home/jenkins/jenkins-slave/workspace/Lucene-Solr-NightlyTests-5.x/solr/build/solr-core/test/J0/temp/solr.cloud.RecoveryZkTest 2C3F78376E526F98-001/init-core-data-001
   [junit4]   2> 1381073 T5127 oas.SolrTestCaseJ4.buildSSLConfig Randomized ssl (false) and clientAuth (true)
   [junit4]   2> 1381074 T5127 oas.BaseDistributedSearchTestCase.initHostContext Setting hostContext system property: /ne_/s
   [junit4]   2> 1381079 T5127 oasc.ZkTestServer.run STARTING ZK TEST SERVER
   [junit4]   1> client port:0.0.0.0/0.0.0.0:0
   [junit4]   2> 1381080 T5128 oasc.ZkTestServer$ZKServerMain.runFromConfig Starting server
   [junit4]   2> 1381180 T5127 oasc.ZkTestServer.run start zk server on port:41594
   [junit4]   2> 1381181 T5127 oascc.SolrZkClient.createZkCredentialsToAddAutomatically Using default ZkCredentialsProvider
   [junit4]   2> 1381182 T5127 oascc.ConnectionManager.waitForConnected Waiting for client to connect to ZooKeeper
   [junit4]   2> 1381185 T5135 oascc.ConnectionManager.process Watcher org.apache.solr.common.cloud.ConnectionManager@5e4f0b0 name:ZooKeeperConnection Watcher:127.0.0.1:41594 got event WatchedEvent state:SyncConnected type:None path:null path:null type:None
   [junit4]   2> 1381186 T5127 oascc.ConnectionManager.waitForConnected Client is connected to ZooKeeper
   [junit4]   2> 1381186 T5127 oascc.SolrZkClient.createZkACLProvider Using default ZkACLProvider
   [junit4]   2> 1381186 T5127 oascc.SolrZkClient.makePath makePath: /solr
   [junit4]   2> 1381189 T5127 oascc.SolrZkClient.createZkCredentialsToAddAutomatically Using default ZkCredentialsProvider
   [junit4]   2> 1381190 T5127 oascc.ConnectionManager.waitForConnected Waiting for client to connect to ZooKeeper
   [junit4]   2> 1381191 T5138 oascc.ConnectionManager.process Watcher org.apache.solr.common.cloud.ConnectionManager@39c60626 name:ZooKeeperConnection Watcher:127.0.0.1:41594/solr got event WatchedEvent state:SyncConnected type:None path:null path:null type:None
   [junit4]   2> 1381191 T5127 oascc.ConnectionManager.waitForConnected Client is connected to ZooKeeper
   [junit4]   2> 1381192 T5127 oascc.SolrZkClient.createZkACLProvider Using default ZkACLProvider
   [junit4]   2> 1381192 T5127 oascc.SolrZkClient.makePath makePath: /collections/collection1
   [junit4]   2> 1381194 T5127 oascc.SolrZkClient.makePath makePath: /collections/collection1/shards
   [junit4]   2> 1381196 T5127 oascc.SolrZkClient.makePath makePath: /collections/control_collection
   [junit4]   2> 1381197 T5127 oascc.SolrZkClient.makePath makePath: /collections/control_collection/shards
   [junit4]   2> 1381199 T5127 oasc.AbstractZkTestCase.putConfig put /usr/home/jenkins/jenkins-slave/workspace/Lucene-Solr-NightlyTests-5.x/solr/core/src/test-files/solr/collection1/conf/solrconfig-tlog.xml to /configs/conf1/solrconfig.xml
   [junit4]   2> 1381200 T5127 oascc.SolrZkClient.makePath makePath: /configs/conf1/solrconfig.xml
   [junit4]   2> 1381203 T5127 oasc.AbstractZkTestCase.putConfig put /usr/home/jenkins/jenkins-slave/workspace/Lucene-Solr-NightlyTests-5.x/solr/core/src/test-files/solr/collection1/conf/schema15.xml to /configs/conf1/schema.xml
   [junit4]   2> 1381203 T5127 oascc.SolrZkClient.makePath makePath: /configs/conf1/schema.xml
   [junit4]   2> 1381306 T5127 oasc.AbstractZkTestCase.putConfig put /usr/home/jenkins/jenkins-slave/workspace/Lucene-Solr-NightlyTests-5.x/solr/core/src/test-files/solr/collection1/conf/solrconfig.snippet.randomindexconfig.xml to /configs/conf1/solrconfig.snippet.randomindexconfig.xml
   [junit4]   2> 1381307 T5127 oascc.SolrZkClient.makePath makePath: /configs/conf1/solrconfig.snippet.randomindexconfig.xml
   [junit4]   2> 1381309 T5127 oasc.AbstractZkTestCase.putConfig put /usr/home/jenkins/jenkins-slave/workspace/Lucene-Solr-NightlyTests-5.x/solr/core/src/test-files/solr/collection1/conf/stopwords.txt to /configs/conf1/stopwords.txt
   [junit4]   2> 1381310 T5127 oascc.SolrZkClient.makePath makePath: /configs/conf1/stopwords.txt
   [junit4]   2> 1381312 T5127 oasc.AbstractZkTestCase.putConfig put /usr/home/jenkins/jenkins-slave/workspace/Lucene-Solr-NightlyTests-5.x/solr/core/src/test-files/solr/collection1/conf/protwords.txt to /configs/conf1/protwords.txt
   [junit4]   2> 1381313 T5127 oascc.SolrZkClient.makePath makePath: /configs/conf1/protwords.txt
   [junit4]   2> 1381315 T5127 oasc.AbstractZkTestCase.putConfig put /usr/home/jenkins/jenkins-slave/workspace/Lucene-Solr-NightlyTests-5.x/solr/core/src/test-files/solr/collection1/conf/currency.xml to /configs/conf1/currency.xml
   [junit4]   2> 1381315 T5127 oascc.SolrZkClient.makePath makePath: /configs/conf1/currency.xml
   [junit4]   2> 1381317 T5127 oasc.AbstractZkTestCase.putConfig put /usr/home/jenkins/jenkins-slave/workspace/Lucene-Solr-NightlyTests-5.x/solr/core/src/test-files/solr/collection1/conf/enumsConfig.xml to /configs/conf1/enumsConfig.xml
   [junit4]   2> 1381318 T5127 oascc.SolrZkClient.makePath makePath: /configs/conf1/enumsConfig.xml
   [junit4]   2> 1381320 T5127 oasc.AbstractZkTestCase.putConfig put /usr/home/jenkins/jenkins-slave/workspace/Lucene-Solr-NightlyTests-5.x/solr/core/src/test-files/solr/collection1/conf/open-exchange-rates.json to /configs/conf1/open-exchange-rates.json
   [junit4]   2> 1381321 T5127 oascc.SolrZkClient.makePath makePath: /configs/conf1/open-exchange-rates.json
   [junit4]   2> 1381323 T5127 oasc.AbstractZkTestCase.putConfig put /usr/home/jenkins/jenkins-slave/workspace/Lucene-Solr-NightlyTests-5.x/solr/core/src/test-files/solr/collection1/conf/mapping-ISOLatin1Accent.txt to /configs/conf1/mapping-ISOLatin1Accent.txt
   [junit4]   2> 1381324 T5127 oascc.SolrZkClient.makePath makePath: /configs/conf1/mapping-ISOLatin1Accent.txt
   [junit4]   2> 1381326 T5127 oasc.AbstractZkTestCase.putConfig put /usr/home/jenkins/jenkins-slave/workspace/Lucene-Solr-NightlyTests-5.x/solr/core/src/test-files/solr/collection1/conf/old_synonyms.txt to /configs/conf1/old_synonyms.txt
   [junit4]   2> 1381326 T5127 oascc.SolrZkClient.makePath makePath: /configs/conf1/old_synonyms.txt
   [junit4]   2> 1381328 T5127 oasc.AbstractZkTestCase.putConfig put /usr/home/jenkins/jenkins-slave/workspace/Lucene-Solr-NightlyTests-5.x/solr/core/src/test-files/solr/collection1/conf/synonyms.txt to /configs/conf1/synonyms.txt
   [junit4]   2> 1381329 T5127 oascc.SolrZkClient.makePath makePath: /configs/conf1/synonyms.txt
   [junit4]   2> 1382587 T5127 oas.SolrTestCaseJ4.writeCoreProperties Writing core.properties file to /usr/home/jenkins/jenkins-slave/workspace/Lucene-Solr-NightlyTests-5.x/solr/build/solr-core/test/J0/temp/solr.cloud.RecoveryZkTest 2C3F78376E526F98-001/control-001/cores/collection1
   [junit4]   2> 1382591 T5127 oejs.Server.doStart jetty-8.1.10.v20130312
   [junit4]   2> 1382596 T5127 oejs.AbstractConnector.doStart Started SocketConnector@127.0.0.1:63098
   [junit4]   2> 1382596 T5127 oascse.JettySolrRunner$1.lifeCycleStarted Jetty properties: {hostPort=63098, coreRootDirectory=/usr/home/jenkins/jenkins-slave/workspace/Lucene-Solr-NightlyTests-5.x/solr/build/solr-core/test/J0/temp/solr.cloud.RecoveryZkTest 2C3F78376E526F98-001/control-001/cores, hostContext=/ne_/s, solr.data.dir=/usr/home/jenkins/jenkins-slave/workspace/Lucene-Solr-NightlyTests-5.x/solr/build/solr-core/test/J0/temp/solr.cloud.RecoveryZkTest 2C3F78376E526F98-001/tempDir-001/control/data}
   [junit4]   2> 1382597 T5127 oass.SolrDispatchFilter.init SolrDispatchFilter.init()sun.misc.Launcher$AppClassLoader@231bf785
   [junit4]   2> 1382597 T5127 oasc.SolrResourceLoader.<init> new SolrResourceLoader for directory: '/usr/home/jenkins/jenkins-slave/workspace/Lucene-Solr-NightlyTests-5.x/solr/build/solr-core/test/J0/temp/solr.cloud.RecoveryZkTest 2C3F78376E526F98-001/control-001/'
   [junit4]   2> 1382645 T5127 oasc.SolrXmlConfig.fromFile Loading container configuration from /usr/home/jenkins/jenkins-slave/workspace/Lucene-Solr-NightlyTests-5.x/solr/build/solr-core/test/J0/temp/solr.cloud.RecoveryZkTest 2C3F78376E526F98-001/control-001/solr.xml
   [junit4]   2> 1382709 T5127 oasc.CorePropertiesLocator.<init> Config-defined core root directory: /usr/home/jenkins/jenkins-slave/workspace/Lucene-Solr-NightlyTests-5.x/solr/build/solr-core/test/J0/temp/solr.cloud.RecoveryZkTest 2C3F78376E526F98-001/control-001/cores
   [junit4]   2> 1382709 T5127 oasc.CoreContainer.<init> New CoreContainer 972999988
   [junit4]   2> 1382710 T5127 oasc.CoreContainer.load Loading cores into CoreContainer [instanceDir=/usr/home/jenkins/jenkins-slave/workspace/Lucene-Solr-NightlyTests-5.x/solr/build/solr-core/test/J0/temp/solr.cloud.RecoveryZkTest 2C3F78376E526F98-001/control-001/]
   [junit4]   2> 1382710 T5127 oasc.CoreContainer.load loading shared library: /usr/home/jenkins/jenkins-slave/workspace/Lucene-Solr-NightlyTests-5.x/solr/build/solr-core/test/J0/temp/solr.cloud.RecoveryZkTest 2C3F78376E526F98-001/control-001/lib
   [junit4]   2> 1382711 T5127 oasc.SolrResourceLoader.addToClassLoader WARN Can't find (or read) directory to add to classloader: lib (resolved as: /usr/home/jenkins/jenkins-slave/workspace/Lucene-Solr-NightlyTests-5.x/solr/build/solr-core/test/J0/temp/solr.cloud.RecoveryZkTest 2C3F78376E526F98-001/control-001/lib).
   [junit4]   2> 1382724 T5127 oashc.HttpShardHandlerFactory.getParameter Setting socketTimeout to: 90000
   [junit4]   2> 1382725 T5127 oashc.HttpShardHandlerFactory.getParameter Setting urlScheme to: 
   [junit4]   2> 1382725 T5127 oashc.HttpShardHandlerFactory.getParameter Setting connTimeout to: 15000
   [junit4]   2> 1382725 T5127 oashc.HttpShardHandlerFactory.getParameter Setting maxConnectionsPerHost to: 20
   [junit4]   2> 1382726 T5127 oashc.HttpShardHandlerFactory.getParameter Setting maxConnections to: 10000
   [junit4]   2> 1382726 T5127 oashc.HttpShardHandlerFactory.getParameter Setting corePoolSize to: 0
   [junit4]   2> 1382726 T5127 oashc.HttpShardHandlerFactory.getParameter Setting maximumPoolSize to: 2147483647
   [junit4]   2> 1382726 T5127 oashc.HttpShardHandlerFactory.getParameter Setting maxThreadIdleTime to: 5
   [junit4]   2> 1382727 T5127 oashc.HttpShardHandlerFactory.getParameter Setting sizeOfQueue to: -1
   [junit4]   2> 1382727 T5127 oashc.HttpShardHandlerFactory.getParameter Setting fairnessPolicy to: false
   [junit4]   2> 1382727 T5127 oashc.HttpShardHandlerFactory.getParameter Setting useRetries to: false
   [junit4]   2> 1382734 T5127 oasu.UpdateShardHandler.<init> Creating UpdateShardHandler HTTP client with params: socketTimeout=340000&connTimeout=45000&retry=true
   [junit4]   2> 1382735 T5127 oasl.LogWatcher.createWatcher SLF4J impl is org.slf4j.impl.Log4jLoggerFactory
   [junit4]   2> 1382736 T5127 oasl.LogWatcher.newRegisteredLogWatcher Registering Log Listener [Log4j (org.slf4j.impl.Log4jLoggerFactory)]
   [junit4]   2> 1382736 T5127 oasc.CoreContainer.load Node Name: 127.0.0.1
   [junit4]   2> 1382737 T5127 oasc.ZkContainer.initZooKeeper Zookeeper client=127.0.0.1:41594/solr
   [junit4]   2> 1382737 T5127 oasc.ZkController.checkChrootPath zkHost includes chroot
   [junit4]   2> 1382737 T5127 oascc.SolrZkClient.createZkCredentialsToAddAutomatically Using default ZkCredentialsProvider
   [junit4]   2> 1382738 T5127 oascc.ConnectionManager.waitForConnected Waiting for client to connect to ZooKeeper
   [junit4]   2> 1382740 T5150 oascc.ConnectionManager.process Watcher org.apache.solr.common.cloud.ConnectionManager@5679af85 name:ZooKeeperConnection Watcher:127.0.0.1:41594 got event WatchedEvent state:SyncConnected type:None path:null path:null type:None
   [junit4]   2> 1382741 T5127 oascc.ConnectionManager.waitForConnected Client is connected to ZooKeeper
   [junit4]   2> 1382741 T5127 oascc.SolrZkClient.createZkACLProvider Using default ZkACLProvider
   [junit4]   2> 1382743 T5127 oascc.ConnectionManager.waitForConnected Waiting for client to connect to ZooKeeper
   [junit4]   2> 1382744 T5153 oascc.ConnectionManager.process Watcher org.apache.solr.common.cloud.ConnectionManager@13ad131f name:ZooKeeperConnection Watcher:127.0.0.1:41594/solr got event WatchedEvent state:SyncConnected type:None path:null path:null type:None
   [junit4]   2> 1382745 T5127 oascc.ConnectionManager.waitForConnected Client is connected to ZooKeeper
   [junit4]   2> 1382746 T5127 oascc.SolrZkClient.makePath makePath: /overseer/queue
   [junit4]   2> 1382748 T5127 oascc.SolrZkClient.makePath makePath: /overseer/collection-queue-work
   [junit4]   2> 1382751 T5127 oascc.SolrZkClient.makePath makePath: /overseer/collection-map-running
   [junit4]   2> 1382753 T5127 oascc.SolrZkClient.makePath makePath: /overseer/collection-map-completed
   [junit4]   2> 1382755 T5127 oascc.SolrZkClient.makePath makePath: /overseer/collection-map-failure
   [junit4]   2> 1382757 T5127 oascc.SolrZkClient.makePath makePath: /live_nodes
   [junit4]   2> 1382759 T5127 oascc.SolrZkClient.makePath makePath: /aliases.json
   [junit4]   2> 1382760 T5127 oascc.SolrZkClient.makePath makePath: /clusterstate.json
   [junit4]   2> 1382762 T5127 oasc.ZkController.createEphemeralLiveNode Register node as live in ZooKeeper:/live_nodes/127.0.0.1:63098_ne_%2Fs
   [junit4]   2> 1382762 T5127 oascc.SolrZkClient.makePath makePath: /live_nodes/127.0.0.1:63098_ne_%2Fs
   [junit4]   2> 1382764 T5127 oascc.SolrZkClient.makePath makePath: /overseer_elect
   [junit4]   2> 1382766 T5127 oascc.SolrZkClient.makePath makePath: /overseer_elect/election
   [junit4]   2> 1382767 T5127 oasc.Overseer.close Overseer (id=null) closing
   [junit4]   2> 1382769 T5127 oasc.OverseerElectionContext.runLeaderProcess I am going to be the leader 127.0.0.1:63098_ne_%2Fs
   [junit4]   2> 1382769 T5127 oascc.SolrZkClient.makePath makePath: /overseer_elect/leader
   [junit4]   2> 1382771 T5127 oasc.Overseer.start Overseer (id=93635670365437955-127.0.0.1:63098_ne_%2Fs-n_0000000000) starting
   [junit4]   2> 1382773 T5127 oascc.SolrZkClient.makePath makePath: /overseer/queue-work
   [junit4]   2> 1382780 T5127 oasc.OverseerAutoReplicaFailoverThread.<init> Starting OverseerAutoReplicaFailoverThread autoReplicaFailoverWorkLoopDelay=10000 autoReplicaFailoverWaitAfterExpiration=30000 autoReplicaFailoverBadNodeExpiration=60000
   [junit4]   2> 1382780 T5155 oasc.OverseerCollectionProcessor.run Process current queue of collection creations
   [junit4]   2> 1382780 T5127 oascc.ZkStateReader.createClusterStateWatchersAndUpdate Updating cluster state from ZooKeeper... 
   [junit4]   2> 1382781 T5154 oasc.Overseer$ClusterStateUpdater.run Starting to work on the main queue
   [junit4]   2> 1382784 T5127 oasc.CorePropertiesLocator.discover Looking for core definitions underneath /usr/home/jenkins/jenkins-slave/workspace/Lucene-Solr-NightlyTests-5.x/solr/build/solr-core/test/J0/temp/solr.cloud.RecoveryZkTest 2C3F78376E526F98-001/control-001/cores
   [junit4]   2> 1382786 T5127 oasc.CoreDescriptor.<init> CORE DESCRIPTOR: {shard=, instanceDir=/usr/home/jenkins/jenkins-slave/workspace/Lucene-Solr-NightlyTests-5.x/solr/build/solr-core/test/J0/temp/solr.cloud.RecoveryZkTest 2C3F78376E526F98-001/control-001/cores/collection1, loadOnStartup=true, collection=control_collection, absoluteInstDir=/usr/home/jenkins/jenkins-slave/workspace/Lucene-Solr-NightlyTests-5.x/solr/build/solr-core/test/J0/temp/solr.cloud.RecoveryZkTest 2C3F78376E526F98-001/control-001/cores/collection1/, coreNodeName=, config=solrconfig.xml, name=collection1, transient=false, dataDir=data/, schema=schema.xml}
   [junit4]   2> 1382786 T5127 oasc.CorePropertiesLocator.discoverUnder Found core collection1 in /usr/home/jenkins/jenkins-slave/workspace/Lucene-Solr-NightlyTests-5.x/solr/build/solr-core/test/J0/temp/solr.cloud.RecoveryZkTest 2C3F78376E526F98-001/control-001/cores/collection1/
   [junit4]   2> 1382787 T5127 oasc.CorePropertiesLocator.discover Found 1 core definitions
   [junit4]   2> 1382788 T5157 C:control_collection c:collection1 oasc.ZkController.publish publishing core=collection1 state=down collection=control_collection
   [junit4]   2> 1382788 T5157 C:control_collection c:collection1 oasc.ZkController.publish numShards not found on descriptor - reading it from system property
   [junit4]   2> 1382789 T5153 oasc.DistributedQueue$LatchWatcher.process NodeChildrenChanged fired on path /overseer/queue state SyncConnected
   [junit4]   2> 1382789 T5157 C:control_collection c:collection1 oasc.ZkController.waitForCoreNodeName look for our core node name
   [junit4]   2> 1382790 T5154 oasc.Overseer$ClusterStateUpdater.run processMessage: queueSize: 1, message = {
   [junit4]   2> 	  "roles":null,
   [junit4]   2> 	  "collection":"control_collection",
   [junit4]   2> 	  "shard":null,
   [junit4]   2> 	  "core":"collection1",
   [junit4]   2> 	  "node_name":"127.0.0.1:63098_ne_%2Fs",
   [junit4]   2> 	  "state":"down",
   [junit4]   2> 	  "base_url":"http://127.0.0.1:63098/ne_/s",
   [junit4]   2> 	  "operation":"state",
   [junit4]   2> 	  "numShards":"1"} current state version: 0
   [junit4]   2> 1382790 T5154 oasco.ReplicaMutator.updateState Update state numShards=1 message={
   [junit4]   2> 	  "roles":null,
   [junit4]   2> 	  "collection":"control_collection",
   [junit4]   2> 	  "shard":null,
   [junit4]   2> 	  "core":"collection1",
   [junit4]   2> 	  "node_name":"127.0.0.1:63098_ne_%2Fs",
   [junit4]   2> 	  "state":"down",
   [junit4]   2> 	  "base_url":"http://127.0.0.1:63098/ne_/s",
   [junit4]   2> 	  "operation":"state",
   [junit4]   2> 	  "numShards":"1"}
   [junit4]   2> 1382790 T5154 oasco.ClusterStateMutator.createCollection building a new cName: control_collection
   [junit4]   2> 1382791 T5154 oasco.ReplicaMutator.updateState Assigning new node to shard shard=shard1
   [junit4]   2> 1382792 T5153 oascc.ZkStateReader$2.process A cluster state change: WatchedEvent state:SyncConnected type:NodeDataChanged path:/clusterstate.json, has occurred - updating... (live nodes size: 1)
   [junit4]   2> 1383789 T5157 C:control_collection c:collection1 oasc.ZkController.waitForShardId waiting to find shard id in clusterstate for collection1
   [junit4]   2> 1383790 T5157 C:control_collection c:collection1 oasc.ZkController.createCollectionZkNode Check for collection zkNode:control_collection
   [junit4]   2> 1383791 T5157 C:control_collection c:collection1 oasc.ZkController.createCollectionZkNode Collection zkNode exists
   [junit4]   2> 1383791 T5157 C:control_collection c:collection1 oascc.ZkStateReader.readConfigName Load collection config from:/collections/control_collection
   [junit4]   2> 1383792 T5157 C:control_collection c:collection1 oascc.ZkStateReader.readConfigName path=/collections/control_collection configName=conf1 specified config exists in ZooKeeper
   [junit4]   2> 1383792 T5157 C:control_collection c:collection1 oasc.SolrResourceLoader.<init> new SolrResourceLoader for directory: '/usr/home/jenkins/jenkins-slave/workspace/Lucene-Solr-NightlyTests-5.x/solr/build/solr-core/test/J0/temp/solr.cloud.RecoveryZkTest 2C3F78376E526F98-001/control-001/cores/collection1/'
   [junit4]   2> 1383809 T5157 C:control_collection c:collection1 oasc.ZkController.watchZKConfDir watch zkdir /configs/conf1
   [junit4]   2> 1383812 T5157 C:control_collection c:collection1 oasc.Config.<init> loaded config solrconfig.xml with version 0 
   [junit4]   2> 1383823 T5157 C:control_collection c:collection1 oasc.SolrConfig.refreshRequestParams current version of requestparams : -1
   [junit4]   2> 1383845 T5157 C:control_collection c:collection1 oasc.SolrConfig.<init> Using Lucene MatchVersion: 5.2.0
   [junit4]   2> 1383895 T5157 C:control_collection c:collection1 oasc.SolrConfig.<init> Loaded SolrConfig: solrconfig.xml
   [junit4]   2> 1383996 T5157 C:control_collection c:collection1 oass.IndexSchema.readSchema Reading Solr Schema from /configs/conf1/schema.xml
   [junit4]   2> 1384006 T5157 C:control_collection c:collection1 oass.IndexSchema.readSchema [collection1] Schema name=test
   [junit4]   2> 1384385 T5157 C:control_collection c:collection1 oass.IndexSchema.readSchema default search field in schema is text
   [junit4]   2> 1384388 T5157 C:control_collection c:collection1 oass.IndexSchema.readSchema unique key field: id
   [junit4]   2> 1384390 T5157 C:control_collection c:collection1 oass.FileExchangeRateProvider.reload Reloading exchange rates from file currency.xml
   [junit4]   2> 1384395 T5157 C:control_collection c:collection1 oass.FileExchangeRateProvider.reload Reloading exchange rates from file currency.xml
   [junit4]   2> 1384414 T5157 C:control_collection c:collection1 oasc.CoreContainer.create Creating SolrCore 'collection1' using configuration from collection control_collection
   [junit4]   2> 1384415 T5157 C:control_collection c:collection1 oasc.SolrCore.initDirectoryFactory org.apache.solr.core.MockDirectoryFactory
   [junit4]   2> 1384415 T5157 C:control_collection c:collection1 oasc.SolrCore.<init> [collection1] Opening new SolrCore at /usr/home/jenkins/jenkins-slave/workspace/Lucene-Solr-NightlyTests-5.x/solr/build/solr-core/test/J0/temp/solr.cloud.RecoveryZkTest 2C3F78376E526F98-001/control-001/cores/collection1/, dataDir=/usr/home/jenkins/jenkins-slave/workspace/Lucene-Solr-NightlyTests-5.x/solr/build/solr-core/test/J0/temp/solr.cloud.RecoveryZkTest 2C3F78376E526F98-001/control-001/cores/collection1/data/
   [junit4]   2> 1384416 T5157 C:control_collection c:collection1 oasc.JmxMonitoredMap.<init> JMX monitoring is enabled. Adding Solr mbeans to JMX Server: com.sun.jmx.mbeanserver.JmxMBeanServer@1fe167f3
   [junit4]   2> 1384417 T5157 C:control_collection c:collection1 oasc.CachingDirectoryFactory.get return new directory for /usr/home/jenkins/jenkins-slave/workspace/Lucene-Solr-NightlyTests-5.x/solr/build/solr-core/test/J0/temp/solr.cloud.RecoveryZkTest 2C3F78376E526F98-001/control-001/cores/collection1/data
   [junit4]   2> 1384417 T5157 C:control_collection c:collection1 oasc.SolrCore.getNewIndexDir New index directory detected: old=null new=/usr/home/jenkins/jenkins-slave/workspace/Lucene-Solr-NightlyTests-5.x/solr/build/solr-core/test/J0/temp/solr.cloud.RecoveryZkTest 2C3F78376E526F98-001/control-001/cores/collection1/data/index/
   [junit4]   2> 1384417 T5157 C:control_collection c:collection1 oasc.SolrCore.initIndex WARN [collection1] Solr index directory '/usr/home/jenkins/jenkins-slave/workspace/Lucene-Solr-NightlyTests-5.x/solr/build/solr-core/test/J0/temp/solr.cloud.RecoveryZkTest 2C3F78376E526F98-001/control-001/cores/collection1/data/index' doesn't exist. Creating new index...
   [junit4]   2> 1384418 T5157 C:control_collection c:collection1 oasc.CachingDirectoryFactory.get return new directory for /usr/home/jenkins/jenkins-slave/workspace/Lucene-Solr-NightlyTests-5.x/solr/build/solr-core/test/J0/temp/solr.cloud.RecoveryZkTest 2C3F78376E526F98-001/control-001/cores/collection1/data/index
   [junit4]   2> 1384418 T5157 C:control_collection c:collection1 oasu.RandomMergePolicy.<init> RandomMergePolicy wrapping class org.apache.lucene.index.TieredMergePolicy: [TieredMergePolicy: maxMergeAtOnce=28, maxMergeAtOnceExplicit=13, maxMergedSegmentMB=87.6728515625, floorSegmentMB=1.197265625, forceMergeDeletesPctAllowed=15.735976729135663, segmentsPerTier=36.0, maxCFSSegmentSizeMB=8.796093022207999E12, noCFSRatio=0.2923950719088899
   [junit4]   2> 1384419 T5157 C:control_collection c:collection1 oasc.SolrDeletionPolicy.onCommit SolrDeletionPolicy.onCommit: commits: num=1
   [junit4]   2> 		commit{dir=MockDirectoryWrapper(RAMDirectory@439a72fa lockFactory=org.apache.lucene.store.SingleInstanceLockFactory@50f29dc2),segFN=segments_1,generation=1}
   [junit4]   2> 1384419 T5157 C:control_collection c:collection1 oasc.SolrDeletionPolicy.updateCommits newest commit generation = 1
   [junit4]   2> 1384425 T5157 C:control_collection c:collection1 oasup.UpdateRequestProcessorChain.init creating updateRequestProcessorChain "nodistrib"
   [junit4]   2> 1384425 T5157 C:control_collection c:collection1 oasup.UpdateRequestProcessorChain.init creating updateRequestProcessorChain "dedupe"
   [junit4]   2> 1384426 T5157 C:control_collection c:collection1 oasup.UpdateRequestProcessorChain.init inserting DistributedUpdateProcessorFactory into updateRequestProcessorChain "dedupe"
   [junit4]   2> 1384426 T5157 C:control_collection c:collection1 oasup.UpdateRequestProcessorChain.init creating updateRequestProcessorChain "stored_sig"
   [junit4]   2> 1384426 T5157 C:control_collection c:collection1 oasup.UpdateRequestProcessorChain.init inserting DistributedUpdateProcessorFactory into updateRequestProcessorChain "stored_sig"
   [junit4]   2> 1384426 T5157 C:control_collection c:collection1 oasup.UpdateRequestProcessorChain.init creating updateRequestProcessorChain "distrib-dup-test-chain-explicit"
   [junit4]   2> 1384427 T5157 C:control_collection c:collection1 oasup.UpdateRequestProcessorChain.init creating updateRequestProcessorChain "distrib-dup-test-chain-implicit"
   [junit4]   2> 1384427 T5157 C:control_collection c:collection1 oasup.UpdateRequestProcessorChain.init inserting DistributedUpdateProcessorFactory into updateRequestProcessorChain "distrib-dup-test-chain-implicit"
   [junit4]   2> 1384427 T5157 C:control_collection c:collection1 oasc.SolrCore.loadUpdateProcessorChains no updateRequestProcessorChain defined as default, creating implicit default
   [junit4]   2> 1384447 T5157 C:control_collection c:collection1 oashl.XMLLoader.init xsltCacheLifetimeSeconds=60
   [junit4]   2> 1384449 T5157 C:control_collection c:collection1 oashl.XMLLoader.init xsltCacheLifetimeSeconds=60
   [junit4]   2> 1384452 T5157 C:control_collection c:collection1 oashl.XMLLoader.init xsltCacheLifetimeSeconds=60
   [junit4]   2> 1384454 T5157 C:control_collection c:collection1 oashl.XMLLoader.init xsltCacheLifetimeSeconds=60
   [junit4]   2> 1384459 T5157 C:control_collection c:collection1 oasc.RequestHandlers.initHandlersFromConfig Registered paths: /admin/ping,/admin/luke,/replication,/admin/logging,/update/csv,/update/json,/update,standard,/admin/mbeans,/admin/plugins,/admin/properties,/admin/threads,/config,/update/json/docs,/admin/system,/admin/file,/admin/segments,/get,/schema
   [junit4]   2> 1384461 T5157 C:control_collection c:collection1 oasc.SolrCore.initStatsCache Using default statsCache cache: org.apache.solr.search.stats.LocalStatsCache
   [junit4]   2> 1384463 T5157 C:control_collection c:collection1 oasu.UpdateHandler.<init> Using UpdateLog implementation: org.apache.solr.update.UpdateLog
   [junit4]   2> 1384463 T5157 C:control_collection c:collection1 oasu.UpdateLog.init Initializing UpdateLog: dataDir= defaultSyncLevel=FLUSH numRecordsToKeep=100 maxNumLogsToKeep=10
   [junit4]   2> 1384465 T5157 C:control_collection c:collection1 oasu.CommitTracker.<init> Hard AutoCommit: disabled
   [junit4]   2> 1384465 T5157 C:control_collection c:collection1 oasu.CommitTracker.<init> Soft AutoCommit: disabled
   [junit4]   2> 1384466 T5157 C:control_collection c:collection1 oasu.RandomMergePolicy.<init> RandomMergePolicy wrapping class org.apache.lucene.index.AlcoholicMergePolicy: [AlcoholicMergePolicy: minMergeSize=0, mergeFactor=10, maxMergeSize=1521501496, maxMergeSizeForForcedMerge=9223372036854775807, calibrateSizeByDeletes=true, maxMergeDocs=2147483647, maxCFSSegmentSizeMB=8.796093022207999E12, noCFSRatio=0.1]
   [junit4]   2> 1384466 T5157 C:control_collection c:collection1 oasc.SolrDeletionPolicy.onInit SolrDeletionPolicy.onInit: commits: num=1
   [junit4]   2> 		commit{dir=MockDirectoryWrapper(RAMDirectory@439a72fa lockFactory=org.apache.lucene.store.SingleInstanceLockFactory@50f29dc2),segFN=segments_1,generation=1}
   [junit4]   2> 1384467 T5157 C:control_collection c:collection1 oasc.SolrDeletionPolicy.updateCommits newest commit generation = 1
   [junit4]   2> 1384467 T5157 C:control_collection c:collection1 oass.SolrIndexSearcher.<init> Opening Searcher@54a7d149[collection1] main
   [junit4]   2> 1384467 T5157 C:control_collection c:collection1 oascc.ZkStateReader.readConfigName Load collection config from:/collections/control_collection
   [junit4]   2> 1384468 T5157 C:control_collection c:collection1 oascc.ZkStateReader.readConfigName path=/collections/control_collection configName=conf1 specified config exists in ZooKeeper
   [junit4]   2> 1384469 T5157 C:control_collection c:collection1 oasr.ManagedResourceStorage.newStorageIO Setting up ZooKeeper-based storage for the RestManager with znodeBase: /configs/conf1
   [junit4]   2> 1384469 T5157 C:control_collection c:collection1 oasr.ManagedResourceStorage$ZooKeeperStorageIO.configure Configured ZooKeeperStorageIO with znodeBase: /configs/conf1
   [junit4]   2> 1384469 T5157 C:control_collection c:collection1 oasr.RestManager.init Initializing RestManager with initArgs: {}
   [junit4]   2> 1384470 T5157 C:control_collection c:collection1 oasr.ManagedResourceStorage.load Reading _rest_managed.json using ZooKeeperStorageIO:path=/configs/conf1
   [junit4]   2> 1384470 T5157 C:control_collection c:collection1 oasr.ManagedResourceStorage$ZooKeeperStorageIO.openInputStream No data found for znode /configs/conf1/_rest_managed.json
   [junit4]   2> 1384470 T5157 C:control_collection c:collection1 oasr.ManagedResourceStorage.load Loaded null at path _rest_managed.json using ZooKeeperStorageIO:path=/configs/conf1
   [junit4]   2> 1384471 T5157 C:control_collection c:collection1 oasr.RestManager.init Initializing 0 registered ManagedResources
   [junit4]   2> 1384471 T5157 C:control_collection c:collection1 oash.ReplicationHandler.inform Commits will be reserved for  10000
   [junit4]   2> 1384472 T5158 C:control_collection c:collection1 oasc.SolrCore.registerSearcher [collection1] Registered new searcher Searcher@54a7d149[collection1] main{ExitableDirectoryReader(UninvertingDirectoryReader())}
   [junit4]   2> 1384472 T5157 C:control_collection c:collection1 oasc.CoreContainer.registerCore registering core: collection1
   [junit4]   2> 1384473 T5161 C:control_collection S:shard1 oasc.ZkController.register Register replica - core:collection1 address:http://127.0.0.1:63098/ne_/s collection:control_collection shard:shard1
   [junit4]   2> 1384474 T5127 oass.SolrDispatchFilter.init user.dir=/usr/home/jenkins/jenkins-slave/workspace/Lucene-Solr-NightlyTests-5.x/solr/build/solr-core/test/J0
   [junit4]   2> 1384474 T5127 oass.SolrDispatchFilter.init SolrDispatchFilter.init() done
   [junit4]   2> 1384474 T5161 C:control_collection S:shard1 oascc.SolrZkClient.makePath makePath: /collections/control_collection/leader_elect/shard1/election
   [junit4]   2> 1384477 T5127 oascc.SolrZkClient.createZkCredentialsToAddAutomatically Using default ZkCredentialsProvider
   [junit4]   2> 1384478 T5127 oascc.ConnectionManager.waitForConnected Waiting for client to connect to ZooKeeper
   [junit4]   2> 1384479 T5161 C:control_collection S:shard1 oasc.ShardLeaderElectionContext.runLeaderProcess Running the leader process for shard shard1
   [junit4]   2> 1384480 T5164 oascc.ConnectionManager.process Watcher org.apache.solr.common.cloud.ConnectionManager@680954cd name:ZooKeeperConnection Watcher:127.0.0.1:41594/solr got event WatchedEvent state:SyncConnected type:None path:null path:null type:None
   [junit4]   2> 1384480 T5127 oascc.ConnectionManager.waitForConnected Client is connected to ZooKeeper
   [junit4]   2> 1384481 T5127 oascc.SolrZkClient.createZkACLProvider Using default ZkACLProvider
   [junit4]   2> 1384481 T5153 oasc.DistributedQueue$LatchWatcher.process NodeChildrenChanged fired on path /overseer/queue state SyncConnected
   [junit4]   2> 1384481 T5161 C:control_collection S:shard1 oasc.ShardLeaderElectionContext.waitForReplicasToComeUp Enough replicas found to continue.
   [junit4]   2> 1384481 T5127 oascc.ZkStateReader.createClusterStateWatchersAndUpdate Updating cluster state from ZooKeeper... 
   [junit4]   2> 1384482 T5161 C:control_collection S:shard1 oasc.ShardLeaderElectionContext.runLeaderProcess I may be the new leader - try and sync
   [junit4]   2> 1384482 T5154 oasc.Overseer$ClusterStateUpdater.run processMessage: queueSize: 1, message = {
   [junit4]   2> 	  "operation":"leader",
   [junit4]   2> 	  "shard":"shard1",
   [junit4]   2> 	  "collection":"control_collection"} current state version: 1
   [junit4]   2> ASYNC  NEW_CORE C752 name=collection1 org.apache.solr.core.SolrCore@55d51534 url=http://127.0.0.1:63098/ne_/s/collection1 node=127.0.0.1:63098_ne_%2Fs C752_STATE=coll:control_collection core:collection1 props:{core=collection1, node_name=127.0.0.1:63098_ne_%2Fs, state=down, base_url=http://127.0.0.1:63098/ne_/s}
   [junit4]   2> 1384483 T5161 C:control_collection S:shard1 C752 P63098 oasc.SyncStrategy.sync Sync replicas to http://127.0.0.1:63098/ne_/s/collection1/
   [junit4]   2> 1384483 T5161 C:control_collection S:shard1 C752 P63098 oasc.SyncStrategy.syncReplicas Sync Success - now sync replicas to me
   [junit4]   2> 1384484 T5161 C:control_collection S:shard1 C752 P63098 oasc.SyncStrategy.syncToMe http://127.0.0.1:63098/ne_/s/collection1/ has no replicas
   [junit4]   2> 1384484 T5161 C:control_collection S:shard1 oasc.ShardLeaderElectionContext.runLeaderProcess I am the new leader: http://127.0.0.1:63098/ne_/s/collection1/ shard1
   [junit4]   2> 1384484 T5164 oascc.ZkStateReader$2.process A cluster state change: WatchedEvent state:SyncConnected type:NodeDataChanged path:/clusterstate.json, has occurred - updating... (live nodes size: 0)
   [junit4]   2> 1384484 T5153 oascc.ZkStateReader$2.process A cluster state change: WatchedEvent state:SyncConnected type:NodeDataChanged path:/clusterstate.json, has occurred - updating... (live nodes size: 1)
   [junit4]   2> 1384484 T5161 C:control_collection S:shard1 oascc.SolrZkClient.makePath makePath: /collections/control_collection/leaders/shard1
   [junit4]   2> 1384486 T5127 oasc.ChaosMonkey.monkeyLog monkey: init - expire sessions:false cause connection loss:false
   [junit4]   2> 1384486 T5127 oasc.AbstractFullDistribZkTestBase.createJettys Creating collection1 with stateFormat=2
   [junit4]   2> 1384486 T5127 oascc.SolrZkClient.createZkCredentialsToAddAutomatically Using default ZkCredentialsProvider
   [junit4]   2> 1384487 T5127 oascc.ConnectionManager.waitForConnected Waiting for client to connect to ZooKeeper
   [junit4]   2> 1384489 T5167 oascc.ConnectionManager.process Watcher org.apache.solr.common.cloud.ConnectionManager@113d238b name:ZooKeeperConnection Watcher:127.0.0.1:41594/solr got event WatchedEvent state:SyncConnected type:None path:null path:null type:None
   [junit4]   2> 1384489 T5127 oascc.ConnectionManager.waitForConnected Client is connected to ZooKeeper
   [junit4]   2> 1384490 T5127 oascc.SolrZkClient.createZkACLProvider Using default ZkACLProvider
   [junit4]   2> 1384490 T5153 oasc.DistributedQueue$LatchWatcher.process NodeChildrenChanged fired on path /overseer/queue state SyncConnected
   [junit4]   2> 1384492 T5154 oasc.Overseer$ClusterStateUpdater.run processMessage: queueSize: 1, message = {
   [junit4]   2> 	  "operation":"leader",
   [junit4]   2> 	  "shard":"shard1",
   [junit4]   2> 	  "collection":"control_collection",
   [junit4]   2> 	  "base_url":"http://127.0.0.1:63098/ne_/s",
   [junit4]   2> 	  "core":"collection1",
   [junit4]   2> 	  "state":"active"} current state version: 2
   [junit4]   2> 1384495 T5154 oasc.Overseer$ClusterStateUpdater.run processMessage: queueSize: 1, message = {
   [junit4]   2> 	  "operation":"create",
   [junit4]   2> 	  "name":"collection1",
   [junit4]   2> 	  "numShards":"1",
   [junit4]   2> 	  "stateFormat":"2"} current state version: 2
   [junit4]   2> 1384495 T5154 oasco.ClusterStateMutator.createCollection building a new cName: collection1
   [junit4]   2> 1384496 T5153 oascc.ZkStateReader$2.process A cluster state change: WatchedEvent state:SyncConnected type:NodeDataChanged path:/clusterstate.json, has occurred - updating... (live nodes size: 1)
   [junit4]   2> 1384496 T5164 oascc.ZkStateReader$2.process A cluster state change: WatchedEvent state:SyncConnected type:NodeDataChanged path:/clusterstate.json, has occurred - updating... (live nodes size: 1)
   [junit4]   2> 1384500 T5153 oasc.DistributedQueue$LatchWatcher.process NodeChildrenChanged fired on path /overseer/queue state SyncConnected
   [junit4]   2> 1384500 T5154 oasco.ZkStateWriter.writePendingUpdates going to create_collection /collections/collection1/state.json
   [junit4]   2> 1384502 T5153 oascc.ZkStateReader$2.process A cluster state change: WatchedEvent state:SyncConnected type:NodeDataChanged path:/clusterstate.json, has occurred - updating... (live nodes size: 1)
   [junit4]   2> 1384502 T5164 oascc.ZkStateReader$2.process A cluster state change: WatchedEvent state:SyncConnected type:NodeDataChanged path:/clusterstate.json, has occurred - updating... (live nodes size: 1)
   [junit4]   2> 1384541 T5161 C:control_collection S:shard1 oasc.ZkController.register We are http://127.0.0.1:63098/ne_/s/collection1/ and leader is http://127.0.0.1:63098/ne_/s/collection1/
   [junit4]   2> 1384542 T5161 C:control_collection S:shard1 oasc.ZkController.register No LogReplay needed for core=collection1 baseURL=http://127.0.0.1:63098/ne_/s
   [junit4]   2> 1384542 T5161 C:control_collection S:shard1 oasc.ZkController.checkRecovery I am the leader, no recovery necessary
   [junit4]   2> 1384542 T5161 C:control_collection S:shard1 c:collection1 oasc.ZkController.publish publishing core=collection1 state=active collection=control_collection
   [junit4]   2> 1384543 T5161 C:control_collection S:shard1 c:collection1 oasc.ZkController.publish numShards not found on descriptor - reading it from system property
   [junit4]   2> 1384544 T5153 oasc.DistributedQueue$LatchWatcher.process NodeChildrenChanged fired on path /overseer/queue state SyncConnected
   [junit4]   2> 1384545 T5154 oasc.Overseer$ClusterStateUpdater.run processMessage: queueSize: 1, message = {
   [junit4]   2> 	  "roles":null,
   [junit4]   2> 	  "collection":"control_collection",
   [junit4]   2> 	  "shard":"shard1",
   [junit4]   2> 	  "core":"collection1",
   [junit4]   2> 	  "node_name":"127.0.0.1:63098_ne_%2Fs",
   [junit4]   2> 	  "state":"active",
   [junit4]   2> 	  "base_url":"http://127.0.0.1:63098/ne_/s",
   [junit4]   2> 	  "operation":"state",
   [junit4]   2> 	  "core_node_name":"core_node1",
   [junit4]   2> 	  "numShards":"1"} current state version: 4
   [junit4]   2> 1384546 T5154 oasco.ReplicaMutator.updateState Update state numShards=1 message={
   [junit4]   2> 	  "roles":null,
   [junit4]   2> 	  "collection":"control_collection",
   [junit4]   2> 	  "shard":"shard1",
   [junit4]   2> 	  "core":"collection1",
   [junit4]   2> 	  "node_name":"127.0.0.1:63098_ne_%2Fs",
   [junit4]   2> 	  "state":"active",
   [junit4]   2> 	  "base_url":"http://127.0.0.1:63098/ne_/s",
   [junit4]   2> 	  "operation":"state",
   [junit4]   2> 	  "core_node_name":"core_node1",
   [junit4]   2> 	  "numShards":"1"}
   [junit4]   2> 1384650 T5164 oascc.ZkStateReader$2.process A cluster state change: WatchedEvent state:SyncConnected type:NodeDataChanged path:/clusterstate.json, has occurred - updating... (live nodes size: 1)
   [junit4]   2> 1384650 T5153 oascc.ZkStateReader$2.process A cluster state change: WatchedEvent state:SyncConnected type:NodeDataChanged path:/clusterstate.json, has occurred - updating... (live nodes size: 1)
   [junit4]   2> 1385914 T5127 oas.SolrTestCaseJ4.writeCoreProperties Writing core.properties file to /usr/home/jenkins/jenkins-slave/workspace/Lucene-Solr-NightlyTests-5.x/solr/build/solr-core/test/J0/temp/solr.cloud.RecoveryZkTest 2C3F78376E526F98-001/shard-1-001/cores/collection1
   [junit4]   2> 1385916 T5127 oasc.AbstractFullDistribZkTestBase.createJettys create jetty 1 in directory /usr/home/jenkins/jenkins-slave/workspace/Lucene-Solr-NightlyTests-5.x/solr/build/solr-core/test/J0/temp/solr.cloud.RecoveryZkTest 2C3F78376E526F98-001/shard-1-001
   [junit4]   2> 1385917 T5127 oejs.Server.doStart jetty-8.1.10.v20130312
   [junit4]   2> 1385919 T5127 oejs.AbstractConnector.doStart Started SocketConnector@127.0.0.1:63103
   [junit4]   2> 1385920 T5127 oascse.JettySolrRunner$1.lifeCycleStarted Jetty properties: {hostPort=63103, solrconfig=solrconfig.xml, coreRootDirectory=/usr/home/jenkins/jenkins-slave/workspace/Lucene-Solr-NightlyTests-5.x/solr/build/solr-core/test/J0/temp/solr.cloud.RecoveryZkTest 2C3F78376E526F98-001/shard-1-001/cores, solr.data.dir=/usr/home/jenkins/jenkins-slave/workspace/Lucene-Solr-NightlyTests-5.x/solr/build/solr-core/test/J0/temp/solr.cloud.RecoveryZkTest 2C3F78376E526F98-001/tempDir-001/jetty1, hostContext=/ne_/s}
   [junit4]   2> 1385920 T5127 oass.SolrDispatchFilter.init SolrDispatchFilter.init()sun.misc.Launcher$AppClassLoader@231bf785
   [junit4]   2> 1385920 T5127 oasc.SolrResourceLoader.<init> new SolrResourceLoader for directory: '/usr/home/jenkins/jenkins-slave/workspace/Lucene-Solr-NightlyTests-5.x/solr/build/solr-core/test/J0/temp/solr.cloud.RecoveryZkTest 2C3F78376E526F98-001/shard-1-001/'
   [junit4]   2> 1385952 T5127 oasc.SolrXmlConfig.fromFile Loading container configuration from /usr/home/jenkins/jenkins-slave/workspace/Lucene-Solr-NightlyTests-5.x/solr/build/solr-core/test/J0/temp/solr.cloud.RecoveryZkTest 2C3F78376E526F98-001/shard-1-001/solr.xml
   [junit4]   2> 1385988 T5127 oasc.CorePropertiesLocator.<init> Config-defined core root directory: /usr/home/jenkins/jenkins-slave/workspace/Lucene-Solr-NightlyTests-5.x/solr/build/solr-core/test/J0/temp/solr.cloud.RecoveryZkTest 2C3F78376E526F98-001/shard-1-001/cores
   [junit4]   2> 1385988 T5127 oasc.CoreContainer.<init> New CoreContainer 650824738
   [junit4]   2> 1385989 T5127 oasc.CoreContainer.load Loading cores into CoreContainer [instanceDir=/usr/home/jenkins/jenkins-slave/workspace/Lucene-Solr-NightlyTests-5.x/solr/build/solr-core/test/J0/temp/solr.cloud.RecoveryZkTest 2C3F78376E526F98-001/shard-1-001/]
   [junit4]   2> 1385989 T5127 oasc.CoreContainer.load loading shared library: /usr/home/jenkins/jenkins-slave/workspace/Lucene-Solr-NightlyTests-5.x/solr/build/solr-core/test/J0/temp/solr.cloud.RecoveryZkTest 2C3F78376E526F98-001/shard-1-001/lib
   [junit4]   2> 1385990 T5127 oasc.SolrResourceLoader.addToClassLoader WARN Can't find (or read) directory to add to classloader: lib (resolved as: /usr/home/jenkins/jenkins-slave/workspace/Lucene-Solr-NightlyTests-5.x/solr/build/solr-core/test/J0/temp/solr.cloud.RecoveryZkTest 2C3F78376E526F98-001/shard-1-001/lib).
   [junit4]   2> 1386000 T5127 oashc.HttpShardHandlerFactory.getParameter Setting socketTimeout to: 90000
   [junit4]   2> 1386001 T5127 oashc.HttpShardHandlerFactory.getParameter Setting urlScheme to: 
   [junit4]   2> 1386001 T5127 oashc.HttpShardHandlerFactory.getParameter Setting connTimeout to: 15000
   [junit4]   2> 1386001 T5127 oashc.HttpShardHandlerFactory.getParameter Setting maxConnectionsPerHost to: 20
   [junit4]   2> 1386002 T5127 oashc.HttpShardHandlerFactory.getParameter Setting maxConnections to: 10000
   [junit4]   2> 1386002 T5127 oashc.HttpShardHandlerFactory.getParameter Setting corePoolSize to: 0
   [junit4]   2> 1386002 T5127 oashc.HttpShardHandlerFactory.getParameter Setting maximumPoolSize to: 2147483647
   [junit4]   2> 1386002 T5127 oashc.HttpShardHandlerFactory.getParameter Setting maxThreadIdleTime to: 5
   [junit4]   2> 1386002 T5127 oashc.HttpShardHandlerFactory.getParameter Setting sizeOfQueue to: -1
   [junit4]   2> 1386003 T5127 oashc.HttpShardHandlerFactory.getParameter Setting fairnessPolicy to: false
   [junit4]   2> 1386003 T5127 oashc.HttpShardHandlerFactory.getParameter Setting useRetries to: false
   [junit4]   2> 1386008 T5127 oasu.UpdateShardHandler.<init> Creating UpdateShardHandler HTTP client with params: socketTimeout=340000&connTimeout=45000&retry=true
   [junit4]   2> 1386008 T5127 oasl.LogWatcher.createWatcher SLF4J impl is org.slf4j.impl.Log4jLoggerFactory
   [junit4]   2> 1386009 T5127 oasl.LogWatcher.newRegisteredLogWatcher Registering Log Listener [Log4j (org.slf4j.impl.Log4jLoggerFactory)]
   [junit4]   2> 1386009 T5127 oasc.CoreContainer.load Node Name: 127.0.0.1
   [junit4]   2> 1386009 T5127 oasc.ZkContainer.initZooKeeper Zookeeper client=127.0.0.1:41594/solr
   [junit4]   2> 1386009 T5127 oasc.ZkController.checkChrootPath zkHost includes chroot
   [junit4]   2> 1386010 T5127 oascc.SolrZkClient.createZkCredentialsToAddAutomatically Using default ZkCredentialsProvider
   [junit4]   2> 1386010 T5127 oascc.ConnectionManager.waitForConnected Waiting for client to connect to ZooKeeper
   [junit4]   2> 1386012 T5179 oascc.ConnectionManager.process Watcher org.apache.solr.common.cloud.ConnectionManager@658fbf04 name:ZooKeeperConnection Watcher:127.0.0.1:41594 got event WatchedEvent state:SyncConnected type:None path:null path:null type:None
   [junit4]   2> 1386013 T5127 oascc.ConnectionManager.waitForConnected Client is connected to ZooKeeper
   [junit4]   2> 1386014 T5127 oascc.SolrZkClient.createZkACLProvider Using default ZkACLProvider
   [junit4]   2> 1386016 T5127 oascc.ConnectionManager.waitForConnected Waiting for client to connect to ZooKeeper
   [junit4]   2> 1386017 T5182 oascc.ConnectionManager.process Watcher org.apache.solr.common.cloud.ConnectionManager@4a81eb40 name:ZooKeeperConnection Watcher:127.0.0.1:41594/solr got event WatchedEvent state:SyncConnected type:None path:null path:null type:None
   [junit4]   2> 1386017 T5127 oascc.ConnectionManager.waitForConnected Client is connected to ZooKeeper
   [junit4]   2> 1386021 T5127 oascc.ZkStateReader.createClusterStateWatchersAndUpdate Updating cluster state from ZooKeeper... 
   [junit4]   2> 1387027 T5127 oasc.ZkController.createEphemeralLiveNode Register node as live in ZooKeeper:/live_nodes/127.0.0.1:63103_ne_%2Fs
   [junit4]   2> 1387028 T5127 oascc.SolrZkClient.makePath makePath: /live_nodes/127.0.0.1:63103_ne_%2Fs
   [junit4]   2> 1387030 T5127 oasc.Overseer.close Overseer (id=null) closing
   [junit4]   2> 1387033 T5127 oasc.CorePropertiesLocator.discover Looking for core definitions underneath /usr/home/jenkins/jenkins-slave/workspace/Lucene-Solr-NightlyTests-5.x/solr/build/solr-core/test/J0/temp/solr.cloud.RecoveryZkTest 2C3F78376E526F98-001/shard-1-001/cores
   [junit4]   2> 1387035 T5127 oasc.CoreDescriptor.<init> CORE DESCRIPTOR: {absoluteInstDir=/usr/home/jenkins/jenkins-slave/workspace/Lucene-Solr-NightlyTests-5.x/solr/build/solr-core/test/J0/temp/solr.cloud.RecoveryZkTest 2C3F78376E526F98-001/shard-1-001/cores/collection1/, coreNodeName=, shard=, config=solrconfig.xml, instanceDir=/usr/home/jenkins/jenkins-slave/workspace/Lucene-Solr-NightlyTests-5.x/solr/build/solr-core/test/J0/temp/solr.cloud.RecoveryZkTest 2C3F78376E526F98-001/shard-1-001/cores/collection1, name=collection1, dataDir=data/, collection=collection1, transient=false, schema=schema.xml, loadOnStartup=true}
   [junit4]   2> 1387035 T5127 oasc.CorePropertiesLocator.discoverUnder Found core collection1 in /usr/home/jenkins/jenkins-slave/workspace/Lucene-Solr-NightlyTests-5.x/solr/build/solr-core/test/J0/temp/solr.cloud.RecoveryZkTest 2C3F78376E526F98-001/shard-1-001/cores/collection1/
   [junit4]   2> 1387036 T5127 oasc.CorePropertiesLocator.discover Found 1 core definitions
   [junit4]   2> 1387038 T5183 C:collection1 c:collection1 oasc.ZkController.publish publishing core=collection1 state=down collection=collection1
   [junit4]   2> 1387038 T5183 C:collection1 c:collection1 oasc.ZkController.publish numShards not found on descriptor - reading it from system property
   [junit4]   2> 1387039 T5153 oasc.DistributedQueue$LatchWatcher.process NodeChildrenChanged fired on path /overseer/queue state SyncConnected
   [junit4]   2> 1387040 T5183 C:collection1 c:collection1 oasc.ZkController.preRegister Registering watch for external collection collection1
   [junit4]   2> 1387040 T5183 C:collection1 c:collection1 oascc.ZkStateReader.addZkWatch addZkWatch collection1
   [junit4]   2> 1387040 T5154 oasc.Overseer$ClusterStateUpdater.run processMessage: queueSize: 1, message = {
   [junit4]   2> 	  "roles":null,
   [junit4]   2> 	  "collection":"collection1",
   [junit4]   2> 	  "shard":null,
   [junit4]   2> 	  "core":"collection1",
   [junit4]   2> 	  "node_name":"127.0.0.1:63103_ne_%2Fs",
   [junit4]   2> 	  "state":"down",
   [junit4]   2> 	  "base_url":"http://127.0.0.1:63103/ne_/s",
   [junit4]   2> 	  "operation":"state",
   [junit4]   2> 	  "numShards":"1"} current state version: 5
   [junit4]   2> 1387041 T5183 C:collection1 c:collection1 oascc.ZkStateReader.addZkWatch Updating collection state at /collections/collection1/state.json from ZooKeeper... 
   [junit4]   2> 1387041 T5154 oasco.ReplicaMutator.updateState Update state numShards=1 message={
   [junit4]   2> 	  "roles":null,
   [junit4]   2> 	  "collection":"collection1",
   [junit4]   2> 	  "shard":null,
   [junit4]   2> 	  "core":"collection1",
   [junit4]   2> 	  "node_name":"127.0.0.1:63103_ne_%2Fs",
   [junit4]   2> 	  "state":"down",
   [junit4]   2> 	  "base_url":"http://127.0.0.1:63103/ne_/s",
   [junit4]   2> 	  "operation":"state",
   [junit4]   2> 	  "numShards":"1"}
   [junit4]   2> 1387041 T5154 oasco.ReplicaMutator.updateState Collection already exists with numShards=1
   [junit4]   2> 1387042 T5154 oasco.ReplicaMutator.updateState Assigning new node to shard shard=shard1
   [junit4]   2> 1387042 T5183 C:collection1 c:collection1 oascc.ZkStateReader.updateWatchedCollection Updating data for collection1 to ver 0 
   [junit4]   2> 1387042 T5183 C:collection1 c:collection1 oasc.ZkController.waitForCoreNodeName look for our core node name
   [junit4]   2> 1387043 T5154 oasco.ZkStateWriter.writePendingUpdates going to update_collection /collections/collection1/state.json version: 0
   [junit4]   2> 1387043 T5182 oascc.ZkStateReader$7.process A cluster state change: WatchedEvent state:SyncConnected type:NodeDataChanged path:/collections/collection1/state.json for collection collection1 has occurred - updating... (live nodes size: 2)
   [junit4]   2> 1387044 T5182 oascc.ZkStateReader.updateWatchedCollection Updating data for collection1 to ver 1 
   [junit4]   2> 1388042 T5183 C:collection1 c:collection1 oasc.ZkController.waitForShardId waiting to find shard id in clusterstate for collection1
   [junit4]   2> 1388043 T5183 C:collection1 c:collection1 oasc.ZkController.createCollectionZkNode Check for collection zkNode:collection1
   [junit4]   2> 1388044 T5183 C:collection1 c:collection1 oasc.ZkController.createCollectionZkNode Collection zkNode exists
   [junit4]   2> 1388044 T5183 C:collection1 c:collection1 oascc.ZkStateReader.readConfigName Load collection config from:/collections/collection1
   [junit4]   2> 1388045 T5183 C:collection1 c:collection1 oascc.ZkStateReader.readConfigName path=/collections/collection1 configName=conf1 specified config exists in ZooKeeper
   [junit4]   2> 1388045 T5183 C:collection1 c:collection1 oasc.SolrResourceLoader.<init> new SolrResourceLoader for directory: '/usr/home/jenkins/jenkins-slave/workspace/Lucene-Solr-NightlyTests-5.x/solr/build/solr-core/test/J0/temp/solr.cloud.RecoveryZkTest 2C3F78376E526F98-001/shard-1-001/cores/collection1/'
   [junit4]   2> 1388062 T5183 C:collection1 c:collection1 oasc.ZkController.watchZKConfDir watch zkdir /configs/conf1
   [junit4]   2> 1388065 T5183 C:collection1 c:collection1 oasc.Config.<init> loaded config solrconfig.xml with version 0 
   [junit4]   2> 1388076 T5183 C:collection1 c:collection1 oasc.SolrConfig.refreshRequestParams current version of requestparams : -1
   [junit4]   2> 1388100 T5183 C:collection1 c:collection1 oasc.SolrConfig.<init> Using Lucene MatchVersion: 5.2.0
   [junit4]   2> 1388149 T5183 C:collection1 c:collection1 oasc.SolrConfig.<init> Loaded SolrConfig: solrconfig.xml
   [junit4]   2> 1388250 T5183 C:collection1 c:collection1 oass.IndexSchema.readSchema Reading Solr Schema from /configs/conf1/schema.xml
   [junit4]   2> 1388260 T5183 C:collection1 c:collection1 oass.IndexSchema.readSchema [collection1] Schema name=test
   [junit4]   2> 1388629 T5183 C:collection1 c:collection1 oass.IndexSchema.readSchema default search field in schema is text
   [junit4]   2> 1388633 T5183 C:collection1 c:collection1 oass.IndexSchema.readSchema unique key field: id
   [junit4]   2> 1388635 T5183 C:collection1 c:collection1 oass.FileExchangeRateProvider.reload Reloading exchange rates from file currency.xml
   [junit4]   2> 1388640 T5183 C:collection1 c:collection1 oass.FileExchangeRateProvider.reload Reloading exchange rates from file currency.xml
   [junit4]   2> 1388661 T5183 C:collection1 c:collection1 oasc.CoreContainer.create Creating SolrCore 'collection1' using configuration from collection collection1
   [junit4]   2> 1388661 T5183 C:collection1 c:collection1 oasc.SolrCore.initDirectoryFactory org.apache.solr.core.MockDirectoryFactory
   [junit4]   2> 1388661 T5183 C:collection1 c:collection1 oasc.SolrCore.<init> [collection1] Opening new SolrCore at /usr/home/jenkins/jenkins-slave/workspace/Lucene-Solr-NightlyTests-5.x/solr/build/solr-core/test/J0/temp/solr.cloud.RecoveryZkTest 2C3F78376E526F98-001/shard-1-001/cores/collection1/, dataDir=/usr/home/jenkins/jenkins-slave/workspace/Lucene-Solr-NightlyTests-5.x/solr/build/solr-core/test/J0/temp/solr.cloud.RecoveryZkTest 2C3F78376E526F98-001/shard-1-001/cores/collection1/data/
   [junit4]   2> 1388662 T5183 C:collection1 c:collection1 oasc.JmxMonitoredMap.<init> JMX monitoring is enabled. Adding Solr mbeans to JMX Server: com.sun.jmx.mbeanserver.JmxMBeanServer@1fe167f3
   [junit4]   2> 1388662 T5183 C:collection1 c:collection1 oasc.CachingDirectoryFactory.get return new directory for /usr/home/jenkins/jenkins-slave/workspace/Lucene-Solr-NightlyTests-5.x/solr/build/solr-core/test/J0/temp/solr.cloud.RecoveryZkTest 2C3F78376E526F98-001/shard-1-001/cores/collection1/data
   [junit4]   2> 1388663 T5183 C:collection1 c:collection1 oasc.SolrCore.getNewIndexDir New index directory detected: old=null new=/usr/home/jenkins/jenkins-slave/workspace/Lucene-Solr-NightlyTests-5.x/solr/build/solr-core/test/J0/temp/solr.cloud.RecoveryZkTest 2C3F78376E526F98-001/shard-1-001/cores/collection1/data/index/
   [junit4]   2> 1388663 T5183 C:collection1 c:collection1 oasc.SolrCore.initIndex WARN [collection1] Solr index directory '/usr/home/jenkins/jenkins-slave/workspace/Lucene-Solr-NightlyTests-5.x/solr/build/solr-core/test/J0/temp/solr.cloud.RecoveryZkTest 2C3F78376E526F98-001/shard-1-001/cores/collection1/data/index' doesn't exist. Creating new index...
   [junit4]   2> 1388664 T5183 C:collection1 c:collection1 oasc.CachingDirectoryFactory.get return new directory for /usr/home/jenkins/jenkins-slave/workspace/Lucene-Solr-NightlyTests-5.x/solr/build/solr-core/test/J0/temp/solr.cloud.RecoveryZkTest 2C3F78376E526F98-001/shard-1-001/cores/collection1/data/index
   [junit4]   2> 1388665 T5183 C:collection1 c:collection1 oasu.RandomMergePolicy.<init> RandomMergePolicy wrapping class org.apache.lucene.index.TieredMergePolicy: [TieredMergePolicy: maxMergeAtOnce=28, maxMergeAtOnceExplicit=13, maxMergedSegmentMB=87.6728515625, floorSegmentMB=1.197265625, forceMergeDeletesPctAllowed=15.735976729135663, segmentsPerTier=36.0, maxCFSSegmentSizeMB=8.796093022207999E12, noCFSRatio=0.2923950719088899
   [junit4]   2> 1388666 T5183 C:collection1 c:collection1 oasc.SolrDeletionPolicy.onCommit SolrDeletionPolicy.onCommit: commits: num=1
   [junit4]   2> 		commit{dir=MockDirectoryWrapper(RAMDirectory@6de49f01 lockFactory=org.apache.lucene.store.SingleInstanceLockFactory@3c833304),segFN=segments_1,generation=1}
   [junit4]   2> 1388666 T5183 C:collection1 c:collection1 oasc.SolrDeletionPolicy.updateCommits newest commit generation = 1
   [junit4]   2> 1388672 T5183 C:collection1 c:collection1 oasup.UpdateRequestProcessorChain.init creating updateRequestProcessorChain "nodistrib"
   [junit4]   2> 1388673 T5183 C:collection1 c:collection1 oasup.UpdateRequestProcessorChain.init creating updateRequestProcessorChain "dedupe"
   [junit4]   2> 1388673 T5183 C:collection1 c:collection1 oasup.UpdateRequestProcessorChain.init inserting DistributedUpdateProcessorFactory into updateRequestProcessorChain "dedupe"
   [junit4]   2> 1388673 T5183 C:collection1 c:collection1 oasup.UpdateRequestProcessorChain.init creating updateRequestProcessorChain "stored_sig"
   [junit4]   2> 1388674 T5183 C:collection1 c:collection1 oasup.UpdateRequestProcessorChain.init inserting DistributedUpdateProcessorFactory into updateRequestProcessorChain "stored_sig"
   [junit4]   2> 1388674 T5183 C:collection1 c:collection1 oasup.UpdateRequestProcessorChain.init creating updateRequestProcessorChain "distrib-dup-test-chain-explicit"
   [junit4]   2> 1388674 T5183 C:collection1 c:collection1 oasup.UpdateRequestProcessorChain.init creating updateRequestProcessorChain "distrib-dup-test-chain-implicit"
   [junit4]   2> 1388675 T5183 C:collection1 c:collection1 oasup.UpdateRequestProcessorChain.init inserting DistributedUpdateProcessorFactory into updateRequestProcessorChain "distrib-dup-test-chain-implicit"
   [junit4]   2> 1388675 T5183 C:collection1 c:collection1 oasc.SolrCore.loadUpdateProcessorChains no updateRequestProcessorChain defined as default, creating implicit default
   [junit4]   2> 1388703 T5183 C:collection1 c:collection1 oashl.XMLLoader.init xsltCacheLifetimeSeconds=60
   [junit4]   2> 1388706 T5183 C:collection1 c:collection1 oashl.XMLLoader.init xsltCacheLifetimeSeconds=60
   [junit4]   2> 1388709 T5183 C:collection1 c:collection1 oashl.XMLLoader.init xsltCacheLifetimeSeconds=60
   [junit4]   2> 1388711 T5183 C:collection1 c:collection1 oashl.XMLLoader.init xsltCacheLifetimeSeconds=60
   [junit4]   2> 1388720 T5183 C:collection1 c:collection1 oasc.RequestHandlers.initHandlersFromConfig Registered paths: /admin/ping,/admin/luke,/replication,/admin/logging,/update/csv,/update/json,/update,standard,/admin/mbeans,/admin/plugins,/admin/properties,/admin/threads,/config,/update/json/docs,/admin/system,/admin/file,/admin/segments,/get,/schema
   [junit4]   2> 1388722 T5183 C:collection1 c:collection1 oasc.SolrCore.initStatsCache Using default statsCache cache: org.apache.solr.search.stats.LocalStatsCache
   [junit4]   2> 1388724 T5183 C:collection1 c:collection1 oasu.UpdateHandler.<init> Using UpdateLog implementation: org.apache.solr.update.UpdateLog
   [junit4]   2> 1388724 T5183 C:collection1 c:collection1 oasu.UpdateLog.init Initializing UpdateLog: dataDir= defaultSyncLevel=FLUSH numRecordsToKeep=100 maxNumLogsToKeep=10
   [junit4]   2> 1388726 T5183 C:collection1 c:collection1 oasu.CommitTracker.<init> Hard AutoCommit: disabled
   [junit4]   2> 1388727 T5183 C:collection1 c:collection1 oasu.CommitTracker.<init> Soft AutoCommit: disabled
   [junit4]   2> 1388728 T5183 C:collection1 c:collection1 oasu.RandomMergePolicy.<init> RandomMergePolicy wrapping class org.apache.lucene.index.AlcoholicMergePolicy: [AlcoholicMergePolicy: minMergeSize=0, mergeFactor=10, maxMergeSize=1521501496, maxMergeSizeForForcedMerge=9223372036854775807, calibrateSizeByDeletes=true, maxMergeDocs=2147483647, maxCFSSegmentSizeMB=8.796093022207999E12, noCFSRatio=0.1]
   [junit4]   2> 1388729 T5183 C:collection1 c:collection1 oasc.SolrDeletionPolicy.onInit SolrDeletionPolicy.onInit: commits: num=1
   [junit4]   2> 		commit{dir=MockDirectoryWrapper(RAMDirectory@6de49f01 lockFactory=org.apache.lucene.store.SingleInstanceLockFactory@3c833304),segFN=segments_1,generation=1}
   [junit4]   2> 1388729 T5183 C:collection1 c:collection1 oasc.SolrDeletionPolicy.updateCommits newest commit generation = 1
   [junit4]   2> 1388730 T5183 C:collection1 c:collection1 oass.SolrIndexSearcher.<init> Opening Searcher@4f76fe19[collection1] main
   [junit4]   2> 1388730 T5183 C:collection1 c:collection1 oascc.ZkStateReader.readConfigName Load collection config from:/collections/collection1
   [junit4]   2> 1388731 T5183 C:collection1 c:collection1 oascc.ZkStateReader.readConfigName path=/collections/collection1 configName=conf1 specified config exists in ZooKeeper
   [junit4]   2> 1388731 T5183 C:collection1 c:collection1 oasr.ManagedResourceStorage.newStorageIO Setting up ZooKeeper-based storage for the RestManager with znodeBase: /configs/conf1
   [junit4]   2> 1388732 T5183 C:collection1 c:collection1 oasr.ManagedResourceStorage$ZooKeeperStorageIO.configure Configured ZooKeeperStorageIO with znodeBase: /configs/conf1
   [junit4]   2> 1388732 T5183 C:collection1 c:collection1 oasr.RestManager.init Initializing RestManager with initArgs: {}
   [junit4]   2> 1388732 T5183 C:collection1 c:collection1 oasr.ManagedResourceStorage.load Reading _rest_managed.json using ZooKeeperStorageIO:path=/configs/conf1
   [junit4]   2> 1388733 T5183 C:collection1 c:collection1 oasr.ManagedResourceStorage$ZooKeeperStorageIO.openInputStream No data found for znode /configs/conf1/_rest_managed.json
   [junit4]   2> 1388733 T5183 C:collection1 c:collection1 oasr.ManagedResourceStorage.load Loaded null at path _rest_managed.json using ZooKeeperStorageIO:path=/configs/conf1
   [junit4]   2> 1388733 T5183 C:collection1 c:collection1 oasr.RestManager.init Initializing 0 registered ManagedResources
   [junit4]   2> 1388734 T5183 C:collection1 c:collection1 oash.ReplicationHandler.inform Commits will be reserved for  10000
   [junit4]   2> 1388735 T5184 C:collection1 c:collection1 oasc.SolrCore.registerSearcher [collection1] Registered new searcher Searcher@4f76fe19[collection1] main{ExitableDirectoryReader(UninvertingDirectoryReader())}
   [junit4]   2> 1388735 T5183 C:collection1 c:collection1 oasc.CoreContainer.registerCore registering core: collection1
   [junit4]   2> 1388736 T5187 C:collection1 S:shard1 oasc.ZkController.register Register replica - core:collection1 address:http://127.0.0.1:63103/ne_/s collection:collection1 shard:shard1
   [junit4]   2> 1388736 T5127 oass.SolrDispatchFilter.init user.dir=/usr/home/jenkins/jenkins-slave/workspace/Lucene-Solr-NightlyTests-5.x/solr/build/solr-core/test/J0
   [junit4]   2> 1388737 T5127 oass.SolrDispatchFilter.init SolrDispatchFilter.init() done
   [junit4]   2> 1388737 T5187 C:collection1 S:shard1 oascc.SolrZkClient.makePath makePath: /collections/collection1/leader_elect/shard1/election
   [junit4]   2> 1388742 T5187 C:collection1 S:shard1 oasc.ShardLeaderElectionContext.runLeaderProcess Running the leader process for shard shard1
   [junit4]   2> 1388744 T5153 oasc.DistributedQueue$LatchWatcher.process NodeChildrenChanged fired on path /overseer/queue state SyncConnected
   [junit4]   2> 1388744 T5187 C:collection1 S:shard1 oasc.ShardLeaderElectionContext.waitForReplicasToComeUp Enough replicas found to continue.
   [junit4]   2> 1388744 T5187 C:collection1 S:shard1 oasc.ShardLeaderElectionContext.runLeaderProcess I may be the new leader - try and sync
   [junit4]   2> ASYNC  NEW_CORE C753 name=collection1 org.apache.solr.core.SolrCore@3cfd6af url=http://127.0.0.1:63103/ne_/s/collection1 node=127.0.0.1:63103_ne_%2Fs C753_STATE=coll:collection1 core:collection1 props:{core=collection1, node_name=127.0.0.1:63103_ne_%2Fs, state=down, base_url=http://127.0.0.1:63103/ne_/s}
   [junit4]   2> 1388745 T5187 C:collection1 S:shard1 C753 P63103 oasc.SyncStrategy.sync Sync replicas to http://127.0.0.1:63103/ne_/s/collection1/
   [junit4]   2> 1388745 T5154 oasc.Overseer$ClusterStateUpdater.run processMessage: queueSize: 1, message = {
   [junit4]   2> 	  "operation":"leader",
   [junit4]   2> 	  "shard":"shard1",
   [junit4]   2> 	  "collection":"collection1"} current state version: 5
   [junit4]   2> 1388745 T5187 C:collection1 S:shard1 C753 P63103 oasc.SyncStrategy.syncReplicas Sync Success - now sync replicas to me
   [junit4]   2> 1388746 T5187 C:collection1 S:shard1 C753 P63103 oasc.SyncStrategy.syncToMe http://127.0.0.1:63103/ne_/s/collection1/ has no replicas
   [junit4]   2> 1388746 T5187 C:collection1 S:shard1 oasc.ShardLeaderElectionContext.runLeaderProcess I am the new leader: http://127.0.0.1:63103/ne_/s/collection1/ shard1
   [junit4]   2> 1388746 T5187 C:collection1 S:shard1 oascc.SolrZkClient.makePath makePath: /collections/collection1/leaders/shard1
   [junit4]   2> 1388746 T5154 oasco.ZkStateWriter.writePendingUpdates going to update_collection /collections/collection1/state.json version: 1
   [junit4]   2> 1388747 T5182 oascc.ZkStateReader$7.process A cluster state change: WatchedEvent state:SyncConnected type:NodeDataChanged path:/collections/collection1/state.json for collection collection1 has occurred - updating... (live nodes size: 2)
   [junit4]   2> 1388748 T5182 oascc.ZkStateReader.updateWatchedCollection Updating data for collection1 to ver 2 
   [junit4]   2> 1388752 T5153 oasc.DistributedQueue$LatchWatcher.process NodeChildrenChanged fired on path /overseer/queue state SyncConnected
   [junit4]   2> 1388753 T5154 oasc.Overseer$ClusterStateUpdater.run processMessage: queueSize: 1, message = {
   [junit4]   2> 	  "operation":"leader",
   [junit4]   2> 	  "shard":"shard1",
   [junit4]   2> 	  "collection":"collection1",
   [junit4]   2> 	  "base_url":"http://127.0.0.1:63103/ne_/s",
   [junit4]   2> 	  "core":"collection1",
   [junit4]   2> 	  "state":"active"} current state version: 5
   [junit4]   2> 1388754 T5154 oasco.ZkStateWriter.writePendingUpdates going to update_collection /collections/collection1/state.json version: 2
   [junit4]   2> 1388755 T5182 oascc.ZkStateReader$7.process A cluster state change: WatchedEvent state:SyncConnected type:NodeDataChanged path:/collections/collection1/state.json for collection collection1 has occurred - updating... (live nodes size: 2)
   [junit4]   2> 1388756 T5182 oascc.ZkStateReader.updateWatchedCollection Updating data for collection1 to ver 3 
   [junit4]   2> 1388803 T5187 C:collection1 S:shard1 oasc.ZkController.register We are http://127.0.0.1:63103/ne_/s/collection1/ and leader is http://127.0.0.1:63103/ne_/s/collection1/
   [junit4]   2> 1388804 T5187 C:collection1 S:shard1 oasc.ZkController.register No LogReplay needed for core=collection1 baseURL=http://127.0.0.1:63103/ne_/s
   [junit4]   2> 1388804 T5187 C:collection1 S:shard1 oasc.ZkController.checkRecovery I am the leader, no recovery necessary
   [junit4]   2> 1388804 T5187 C:collection1 S:shard1 c:collection1 oasc.ZkController.publish publishing core=collection1 state=active collection=collection1
   [junit4]   2> 1388804 T5187 C:collection1 S:shard1 c:collection1 oasc.ZkController.publish numShards not found on descriptor - reading it from system property
   [junit4]   2> 1388806 T5153 oasc.DistributedQueue$LatchWatcher.process NodeChildrenChanged fired on path /overseer/queue state SyncConnected
   [junit4]   2> 1388807 T5154 oasc.Overseer$ClusterStateUpdater.run processMessage: queueSize: 1, message = {
   [junit4]   2> 	  "roles":null,
   [junit4]   2> 	  "collection":"collection1",
   [junit4]   2> 	  "shard":"shard1",
   [junit4]   2> 	  "core":"collection1",
   [junit4]   2> 	  "node_name":"127.0.0.1:63103_ne_%2Fs",
   [junit4]   2> 	  "state":"active",
   [junit4]   2> 	  "base_url":"http://127.0.0.1:63103/ne_/s",
   [junit4]   2> 	  "operation":"state",
   [junit4]   2> 	  "core_node_name":"core_node1",
   [junit4]   2> 	  "numShards":"1"} current state version: 5
   [junit4]   2> 1388807 T5154 oasco.ReplicaMutator.updateState Update state numShards=1 message={
   [junit4]   2> 	  "roles":null,
   [junit4]   2> 	  "collection":"collection1",
   [junit4]   2> 	  "shard":"shard1",
   [junit4]   2> 	  "core":"collection1",
   [junit4]   2> 	  "node_name":"127.0.0.1:63103_ne_%2Fs",
   [junit4]   2> 	  "state":"active",
   [junit4]   2> 	  "base_url":"http://127.0.0.1:63103/ne_/s",
   [junit4]   2> 	  "operation":"state",
   [junit4]   2> 	  "core_node_name":"core_node1",
   [junit4]   2> 	  "numShards":"1"}
   [junit4]   2> 1388808 T5187 C:collection1 S:shard1 oascc.ZkStateReader.updateWatchedCollection Updating data for collection1 to ver 3 
   [junit4]   2> 1388809 T5154 oasco.ZkStateWriter.writePendingUpdates going to update_collection /collections/collection1/state.json version: 3
   [junit4]   2> 1388809 T5182 oascc.ZkStateReader$7.process A cluster state change: WatchedEvent state:SyncConnected type:NodeDataChanged path:/collections/collection1/state.json for collection collection1 has occurred - updating... (live nodes size: 2)
   [junit4]   2> 1388810 T5182 oascc.ZkStateReader.updateWatchedCollection Updating data for collection1 to ver 4 
   [junit4]   2> 1390641 T5127 oas.SolrTestCaseJ4.writeCoreProperties Writing core.properties file to /usr/home/jenkins/jenkins-slave/workspace/Lucene-Solr-NightlyTests-5.x/solr/build/solr-core/test/J0/temp/solr.cloud.RecoveryZkTest 2C3F78376E526F98-001/shard-2-001/cores/collection1
   [junit4]   2> 1390644 T5127 oasc.AbstractFullDistribZkTestBase.createJettys create jetty 2 in directory /usr/home/jenkins/jenkins-slave/workspace/Lucene-Solr-NightlyTests-5.x/solr/build/solr-core/test/J0/temp/solr.cloud.RecoveryZkTest 2C3F78376E526F98-001/shard-2-001
   [junit4]   2> 1390645 T5127 oejs.Server.doStart jetty-8.1.10.v20130312
   [junit4]   2> 1390647 T5127 oejs.AbstractConnector.doStart Started SocketConnector@127.0.0.1:63106
   [junit4]   2> 1390648 T5127 oascse.JettySolrRunner$1.lifeCycleStarted Jetty properties: {solr.data.dir=/usr/home/jenkins/jenkins-slave/workspace/Lucene-Solr-NightlyTests-5.x/solr/build/solr-core/test/J0/temp/solr.cloud.RecoveryZkTest 2C3F78376E526F98-001/tempDir-001/jetty2, solrconfig=solrconfig.xml, hostContext=/ne_/s, coreRootDirectory=/usr/home/jenkins/jenkins-slave/workspace/Lucene-Solr-NightlyTests-5.x/solr/build/solr-core/test/J0/temp/solr.cloud.RecoveryZkTest 2C3F78376E526F98-001/shard-2-001/cores, hostPort=63106}
   [junit4]   2> 1390648 T5127 oass.SolrDispatchFilter.init SolrDispatchFilter.init()sun.misc.Launcher$AppClassLoader@231bf785
   [junit4]   2> 1390648 T5127 oasc.SolrResourceLoader.<init> new SolrResourceLoader for directory: '/usr/home/jenkins/jenkins-slave/workspace/Lucene-Solr-NightlyTests-5.x/solr/build/solr-core/test/J0/temp/solr.cloud.RecoveryZkTest 2C3F78376E526F98-001/shard-2-001/'
   [junit4]   2> 1390680 T5127 oasc.SolrXmlConfig.fromFile Loading container configuration from /usr/home/jenkins/jenkins-slave/workspace/Lucene-Solr-NightlyTests-5.x/solr/build/solr-core/test/J0/temp/solr.cloud.RecoveryZkTest 2C3F78376E526F98-001/shard-2-001/solr.xml
   [junit4]   2> 1390746 T5127 oasc.CorePropertiesLocator.<init> Config-defined core root directory: /usr/home/jenkins/jenkins-slave/workspace/Lucene-Solr-NightlyTests-5.x/solr/build/solr-core/test/J0/temp/solr.cloud.RecoveryZkTest 2C3F78376E526F98-001/shard-2-001/cores
   [junit4]   2> 1390746 T5127 oasc.CoreContainer.<init> New CoreContainer 507398925
   [junit4]   2> 1390747 T5127 oasc.CoreContainer.load Loading cores into CoreContainer [instanceDir=/usr/home/jenkins/jenkins-slave/workspace/Lucene-Solr-NightlyTests-5.x/solr/build/solr-core/test/J0/temp/solr.cloud.RecoveryZkTest 2C3F78376E526F98-001/shard-2-001/]
   [junit4]   2> 1390747 T5127 oasc.CoreContainer.load loading shared library: /usr/home/jenkins/jenkins-slave/workspace/Lucene-Solr-NightlyTests-5.x/solr/build/solr-core/test/J0/temp/solr.cloud.RecoveryZkTest 2C3F78376E526F98-001/shard-2-001/lib
   [junit4]   2> 1390748 T5127 oasc.SolrResourceLoader.addToClassLoader WARN Can't find (or read) directory to add to classloader: lib (resolved as: /usr/home/jenkins/jenkins-slave/workspace/Lucene-Solr-NightlyTests-5.x/solr/build/solr-core/test/J0/temp/solr.cloud.RecoveryZkTest 2C3F78376E526F98-001/shard-2-001/lib).
   [junit4]   2> 1390761 T5127 oashc.HttpShardHandlerFactory.getParameter Setting socketTimeout to: 90000
   [junit4]   2> 1390761 T5127 oashc.HttpShardHandlerFactory.getParameter Setting urlScheme to: 
   [junit4]   2> 1390762 T5127 oashc.HttpShardHandlerFactory.getParameter Setting connTimeout to: 15000
   [junit4]   2> 1390762 T5127 oashc.HttpShardHandlerFactory.getParameter Setting maxConnectionsPerHost to: 20
   [junit4]   2> 1390762 T5127 oashc.HttpShardHandlerFactory.getParameter Setting maxConnections to: 10000
   [junit4]   2> 1390763 T5127 oashc.HttpShardHandlerFactory.getParameter Setting corePoolSize to: 0
   [junit4]   2> 1390763 T5127 oashc.HttpShardHandlerFactory.getParameter Setting maximumPoolSize to: 2147483647
   [junit4]   2> 1390763 T5127 oashc.HttpShardHandlerFactory.getParameter Setting maxThreadIdleTime to: 5
   [junit4]   2> 1390764 T5127 oashc.HttpShardHandlerFactory.getParameter Setting sizeOfQueue to: -1
   [junit4]   2> 1390764 T5127 oashc.HttpShardHandlerFactory.getParameter Setting fairnessPolicy to: false
   [junit4]   2> 1390764 T5127 oashc.HttpShardHandlerFactory.getParameter Setting useRetries to: false
   [junit4]   2> 1390771 T5127 oasu.UpdateShardHandler.<init> Creating UpdateShardHandler HTTP client with params: socketTimeout=340000&connTimeout=45000&retry=true
   [junit4]   2> 1390772 T5127 oasl.LogWatcher.createWatcher SLF4J impl is org.slf4j.impl.Log4jLoggerFactory
   [junit4]   2> 1390773 T5127 oasl.LogWatcher.newRegisteredLogWatcher Registering Log Listener [Log4j (org.slf4j.impl.Log4jLoggerFactory)]
   [junit4]   2> 1390773 T5127 oasc.CoreContainer.load Node Name: 127.0.0.1
   [junit4]   2> 1390773 T5127 oasc.ZkContainer.initZooKeeper Zookeeper client=127.0.0.1:41594/solr
   [junit4]   2> 1390774 T5127 oasc.ZkController.checkChrootPath zkHost includes chroot
   [junit4]   2> 1390774 T5127 oascc.SolrZkClient.createZkCredentialsToAddAutomatically Using default ZkCredentialsProvider
   [junit4]   2> 1390775 T5127 oascc.ConnectionManager.waitForConnected Waiting for client to connect to ZooKeeper
   [junit4]   2> 1390777 T5199 oascc.ConnectionManager.process Watcher org.apache.solr.common.cloud.ConnectionManager@389ed5 name:ZooKeeperConnection Watcher:127.0.0.1:41594 got event WatchedEvent state:SyncConnected type:None path:null path:null type:None
   [junit4]   2> 1390777 T5127 oascc.ConnectionManager.waitForConnected Client is connected to ZooKeeper
   [junit4]   2> 1390778 T5127 oascc.SolrZkClient.createZkACLProvider Using default ZkACLProvider
   [junit4]   2> 1390780 T5127 oascc.ConnectionManager.waitForConnected Waiting for client to connect to ZooKeeper
   [junit4]   2> 1390781 T5202 oascc.ConnectionManager.process Watcher org.apache.solr.common.cloud.ConnectionManager@77ba6427 name:ZooKeeperConnection Watcher:127.0.0.1:41594/solr got event WatchedEvent state:SyncConnected type:None path:null path:null type:None
   [junit4]   2> 1390782 T5127 oascc.ConnectionManager.waitForConnected Client is connected to ZooKeeper
   [junit4]   2> 1390787 T5127 oascc.ZkStateReader.createClusterStateWatchersAndUpdate Updating cluster state from ZooKeeper... 
   [junit4]   2> 1391793 T5127 oasc.ZkController.createEphemeralLiveNode Register node as live in ZooKeeper:/live_nodes/127.0.0.1:63106_ne_%2Fs
   [junit4]   2> 1391794 T5127 oascc.SolrZkClient.makePath makePath: /live_nodes/127.0.0.1:63106_ne_%2Fs
   [junit4]   2> 1391797 T5127 oasc.Overseer.close Overseer (id=null) closing
   [junit4]   2> 1391799 T5127 oasc.CorePropertiesLocator.discover Looking for core definitions underneath /usr/home/jenkins/jenkins-slave/workspace/Lucene-Solr-NightlyTests-5.x/solr/build/solr-core/test/J0/temp/solr.cloud.RecoveryZkTest 2C3F78376E526F98-001/shard-2-001/cores
   [junit4]   2> 1391801 T5127 oasc.CoreDescriptor.<init> CORE DESCRIPTOR: {loadOnStartup=true, name=collection1, coreNodeName=, instanceDir=/usr/home/jenkins/jenkins-slave/workspace/Lucene-Solr-NightlyTests-5.x/solr/build/solr-core/test/J0/temp/solr.cloud.RecoveryZkTest 2C3F78376E526F98-001/shard-2-001/cores/collection1, config=solrconfig.xml, dataDir=data/, schema=schema.xml, shard=, transient=false, collection=collection1, absoluteInstDir=/usr/home/jenkins/jenkins-slave/workspace/Lucene-Solr-NightlyTests-5.x/solr/build/solr-core/test/J0/temp/solr.cloud.RecoveryZkTest 2C3F78376E526F98-001/shard-2-001/cores/collection1/}
   [junit4]   2> 1391802 T5127 oasc.CorePropertiesLocator.discoverUnder Found core collection1 in /usr/home/jenkins/jenkins-slave/workspace/Lucene-Solr-NightlyTests-5.x/solr/build/solr-core/test/J0/temp/solr.cloud.RecoveryZkTest 2C3F78376E526F98-001/shard-2-001/cores/collection1/
   [junit4]   2> 1391802 T5127 oasc.CorePropertiesLocator.discover Found 1 core definitions
   [junit4]   2> 1391804 T5203 C:collection1 c:collection1 oasc.ZkController.publish publishing core=collection1 state=down collection=collection1
   [junit4]   2> 1391805 T5203 C:collection1 c:collection1 oasc.ZkController.publish numShards not found on descriptor - reading it from system property
   [junit4]   2> 1391806 T5153 oasc.DistributedQueue$LatchWatcher.process NodeChildrenChanged fired on path /overseer/queue state SyncConnected
   [junit4]   2> 1391807 T5203 C:collection1 c:collection1 oasc.ZkController.preRegister Registering watch for external collection collection1
   [junit4]   2> 1391807 T5154 oasc.Overseer$ClusterStateUpdater.run processMessage: queueSize: 1, message = {
   [junit4]   2> 	  "roles":null,
   [junit4]   2> 	  "collection":"collection1",
   [junit4]   2> 	  "shard":null,
   [junit4]   2> 	  "core":"collection1",
   [junit4]   2> 	  "node_name":"127.0.0.1:63106_ne_%2Fs",
   [junit4]   2> 	  "state":"down",
   [junit4]   2> 	  "base_url":"http://127.0.0.1:63106/ne_/s",
   [junit4]   2> 	  "operation":"state",
   [junit4]   2> 	  "numShards":"1"} current state version: 5
   [junit4]   2> 1391807 T5203 C:collection1 c:collection1 oascc.ZkStateReader.addZkWatch addZkWatch collection1
   [junit4]   2> 1391808 T5154 oasco.ReplicaMutator.updateState Update state numShards=1 message={
   [junit4]   2> 	  "roles":null,
   [junit4]   2> 	  "collection":"collection1",
   [junit4]   2> 	  "shard":null,
   [junit4]   2> 	  "core":"collection1",
   [junit4]   2> 	  "node_name":"127.0.0.1:63106_ne_%2Fs",
   [junit4]   2> 	  "state":"down",
   [junit4]   2> 	  "base_url":"http://127.0.0.1:63106/ne_/s",
   [junit4]   2> 	  "operation":"state",
   [junit4]   2> 	  "numShards":"1"}
   [junit4]   2> 1391808 T5203 C:collection1 c:collection1 oascc.ZkStateReader.addZkWatch Updating collection state at /collections/collection1/state.json from ZooKeeper... 
   [junit4]   2> 1391808 T5154 oasco.ReplicaMutator.updateState Collection already exists with numShards=1
   [junit4]   2> 1391809 T5154 oasco.ReplicaMutator.updateState Assigning new node to shard shard=shard1
   [junit4]   2> 1391809 T5203 C:collection1 c:collection1 oascc.ZkStateReader.updateWatchedCollection Updating data for collection1 to ver 4 
   [junit4]   2> 1391810 T5203 C:collection1 c:collection1 oasc.ZkController.waitForCoreNodeName look for our core node name
   [junit4]   2> 1391810 T5154 oasco.ZkStateWriter.writePendingUpdates going to update_collection /collections/collection1/state.json version: 4
   [junit4]   2> 1391810 T5182 oascc.ZkStateReader$7.process A cluster state change: WatchedEvent state:SyncConnected type:NodeDataChanged path:/collections/collection1/state.json for collection collection1 has occurred - updating... (live nodes size: 3)
   [junit4]   2> 1391810 T5202 oascc.ZkStateReader$7.process A cluster state change: WatchedEvent state:SyncConnected type:NodeDataChanged path:/collections/collection1/state.json for collection collection1 has occurred - updating... (live nodes size: 3)
   [junit4]   2> 1391811 T5182 oascc.ZkStateReader.updateWatchedCollection Updating data for collection1 to ver 5 
   [junit4]   2> 1391812 T5202 oascc.ZkStateReader.updateWatchedCollection Updating data for collection1 to ver 5 
   [junit4]   2> 1392810 T5203 C:collection1 c:collection1 oasc.ZkController.waitForShardId waiting to find shard id in clusterstate for collection1
   [junit4]   2> 1392811 T5203 C:collection1 c:collection1 oasc.ZkController.createCollectionZkNode Check for collection zkNode:collection1
   [junit4]   2> 1392811 T5203 C:collection1 c:collection1 oasc.ZkController.createCollectionZkNode Collection zkNode exists
   [junit4]   2> 1392812 T5203 C:collection1 c:collection1 oascc.ZkStateReader.readConfigName Load collection config from:/collections/collection1
   [junit4]   2> 1392812 T5203 C:collection1 c:collection1 oascc.ZkStateReader.readConfigName path=/collections/collection1 configName=conf1 specified config exists in ZooKeeper
   [junit4]   2> 1392813 T5203 C:collection1 c:collection1 oasc.SolrResourceLoader.<init> new SolrResourceLoader for directory: '/usr/home/jenkins/jenkins-slave/workspace/Lucene-Solr-NightlyTests-5.x/solr/build/solr-core/test/J0/temp/solr.cloud.RecoveryZkTest 2C3F78376E526F98-001/shard-2-001/cores/collection1/'
   [junit4]   2> 1392830 T5203 C:collection1 c:collection1 oasc.ZkController.watchZKConfDir watch zkdir /configs/conf1
   [junit4]   2> 1392833 T5203 C:collection1 c:collection1 oasc.Config.<init> loaded config solrconfig.xml with version 0 
   [junit4]   2> 1392844 T5203 C:collection1 c:collection1 oasc.SolrConfig.refreshRequestParams current version of requestparams : -1
   [junit4]   2> 1392866 T5203 C:collection1 c:collection1 oasc.SolrConfig.<init> Using Lucene MatchVersion: 5.2.0
   [junit4]   2> 1392916 T5203 C:collection1 c:collection1 oasc.SolrConfig.<init> Loaded SolrConfig: solrconfig.xml
   [junit4]   2> 1393017 T5203 C:collection1 c:collection1 oass.IndexSchema.readSchema Reading Solr Schema from /configs/conf1/schema.xml
   [junit4]   2> 1393027 T5203 C:collection1 c:collection1 oass.IndexSchema.readSchema [collection1] Schema name=test
   [junit4]   2> 1393382 T5203 C:collection1 c:collection1 oass.IndexSchema.readSchema default search field in schema is text
   [junit4]   2> 1393385 T5203 C:collection1 c:collection1 oass.IndexSchema.readSchema unique key field: id
   [junit4]   2> 1393387 T5203 C:collection1 c:collection1 oass.FileExchangeRateProvider.reload Reloading exchange rates from file currency.xml
   [junit4]   2> 1393392 T5203 C:collection1 c:collection1 oass.FileExchangeRateProvider.reload Reloading exchange rates from file currency.xml
   [junit4]   2> 1393415 T5203 C:collection1 c:collection1 oasc.CoreContainer.create Creating SolrCore 'collection1' using configuration from collection collection1
   [junit4]   2> 1393415 T5203 C:collection1 c:collection1 oasc.SolrCore.initDirectoryFactory org.apache.solr.core.MockDirectoryFactory
   [junit4]   2> 1393416 T5203 C:collection1 c:collection1 oasc.SolrCore.<init> [collection1] Opening new SolrCore at /usr/home/jenkins/jenkins-slave/workspace/Lucene-Solr-NightlyTests-5.x/solr/build/solr-core/test/J0/temp/solr.cloud.RecoveryZkTest 2C3F78376E526F98-001/shard-2-001/cores/collection1/, dataDir=/usr/home/jenkins/jenkins-slave/workspace/Lucene-Solr-NightlyTests-5.x/solr/build/solr-core/test/J0/temp/solr.cloud.RecoveryZkTest 2C3F78376E526F98-001/shard-2-001/cores/collection1/data/
   [junit4]   2> 1393416 T5203 C:collection1 c:collection1 oasc.JmxMonitoredMap.<init> JMX monitoring is enabled. Adding Solr mbeans to JMX Server: com.sun.jmx.mbeanserver.JmxMBeanServer@1fe167f3
   [junit4]   2> 1393417 T5203 C:collection1 c:collection1 oasc.CachingDirectoryFactory.get return new directory for /usr/home/jenkins/jenkins-slave/workspace/Lucene-Solr-NightlyTests-5.x/solr/build/solr-core/test/J0/temp/solr.cloud.RecoveryZkTest 2C3F78376E526F98-001/shard-2-001/cores/collection1/data
   [junit4]   2> 1393418 T5203 C:collection1 c:collection1 oasc.SolrCore.getNewIndexDir New index directory detected: old=null new=/usr/home/jenkins/jenkins-slave/workspace/Lucene-Solr-NightlyTests-5.x/solr/build/solr-core/test/J0/temp/solr.cloud.RecoveryZkTest 2C3F78376E526F98-001/shard-2-001/cores/collection1/data/index/
   [junit4]   2> 1393418 T5203 C:collection1 c:collection1 oasc.SolrCore.initIndex WARN [collection1] Solr index directory '/usr/home/jenkins/jenkins-slave/workspace/Lucene-Solr-NightlyTests-5.x/solr/build/solr-core/test/J0/temp/solr.cloud.RecoveryZkTest 2C3F78376E526F98-001/shard-2-001/cores/collection1/data/index' doesn't exist. Creating new index...
   [junit4]   2> 1393419 T5203 C:collection1 c:collection1 oasc.CachingDirectoryFactory.get return new directory for /usr/home/jenkins/jenkins-slave/workspace/Lucene-Solr-NightlyTests-5.x/solr/build/solr-core/test/J0/temp/solr.cloud.RecoveryZkTest 2C3F78376E526F98-001/shard-2-001/cores/collection1/data/index
   [junit4]   2> 1393419 T5203 C:collection1 c:collection1 oasu.RandomMergePolicy.<init> RandomMergePolicy wrapping class org.apache.lucene.index.TieredMergePolicy: [TieredMergePolicy: maxMergeAtOnce=28, maxMergeAtOnceExplicit=13, maxMergedSegmentMB=87.6728515625, floorSegmentMB=1.197265625, forceMergeDeletesPctAllowed=15.735976729135663, segmentsPerTier=36.0, maxCFSSegmentSizeMB=8.796093022207999E12, noCFSRatio=0.2923950719088899
   [junit4]   2> 1393420 T5203 C:collection1 c:collection1 oasc.SolrDeletionPolicy.onCommit SolrDeletionPolicy.onCommit: commits: num=1
   [junit4]   2> 		commit{dir=MockDirectoryWrapper(RAMDirectory@2ba68443 lockFactory=org.apache.lucene.store.SingleInstanceLockFactory@41356118),segFN=segments_1,generation=1}
   [junit4]   2> 1393420 T5203 C:collection1 c:collection1 oasc.SolrDeletionPolicy.updateCommits 

[...truncated too long message...]

joinLeaderElection Not rejoining election because CoreContainer is closed
   [junit4]   2> 1553027 T5245 C:collection1 S:shard1 c:collection1 oasc.SolrCore.close [collection1]  CLOSING SolrCore org.apache.solr.core.SolrCore@18c83cda
   [junit4]   2> 1553028 T5245 C:collection1 S:shard1 c:collection1 oasc.ZkController.unRegisterConfListener  a listener was removed because of core close
   [junit4]   2> 1553029 T5245 C:collection1 S:shard1 c:collection1 oasu.DirectUpdateHandler2.close closing DirectUpdateHandler2{commits=63,autocommits=0,soft autocommits=0,optimizes=0,rollbacks=0,expungeDeletes=0,docsPending=0,adds=0,deletesById=0,deletesByQuery=0,errors=0,cumulative_adds=351,cumulative_deletesById=167,cumulative_deletesByQuery=0,cumulative_errors=0,transaction_logs_total_size=32882,transaction_logs_total_number=1}
   [junit4]   2> 1553029 T5245 C:collection1 S:shard1 c:collection1 oasu.SolrCoreState.decrefSolrCoreState Closing SolrCoreState
   [junit4]   2> 1553029 T5245 C:collection1 S:shard1 c:collection1 oasu.DefaultSolrCoreState.closeIndexWriter SolrCoreState ref count has reached 0 - closing IndexWriter
   [junit4]   2> 1553029 T5245 C:collection1 S:shard1 c:collection1 oasu.DefaultSolrCoreState.closeIndexWriter closing IndexWriter with IndexWriterCloser
   [junit4]   2> 1553030 T5245 C:collection1 S:shard1 c:collection1 oasc.SolrCore.closeSearcher [collection1] Closing main searcher on request.
   [junit4]   2> 1553037 T5245 C:collection1 S:shard1 c:collection1 oasc.CachingDirectoryFactory.close Closing MockDirectoryFactory - 2 directories currently being tracked
   [junit4]   2> 1553037 T5245 C:collection1 S:shard1 c:collection1 oasc.CachingDirectoryFactory.closeCacheValue looking to close /usr/home/jenkins/jenkins-slave/workspace/Lucene-Solr-NightlyTests-5.x/solr/build/solr-core/test/J0/temp/solr.cloud.RecoveryZkTest 2C3F78376E526F98-001/shard-2-001/cores/collection1/data [CachedDir<<refCount=0;path=/usr/home/jenkins/jenkins-slave/workspace/Lucene-Solr-NightlyTests-5.x/solr/build/solr-core/test/J0/temp/solr.cloud.RecoveryZkTest 2C3F78376E526F98-001/shard-2-001/cores/collection1/data;done=false>>]
   [junit4]   2> 1553037 T5245 C:collection1 S:shard1 c:collection1 oasc.CachingDirectoryFactory.close Closing directory: /usr/home/jenkins/jenkins-slave/workspace/Lucene-Solr-NightlyTests-5.x/solr/build/solr-core/test/J0/temp/solr.cloud.RecoveryZkTest 2C3F78376E526F98-001/shard-2-001/cores/collection1/data
   [junit4]   2> 1553037 T5245 C:collection1 S:shard1 c:collection1 oasc.CachingDirectoryFactory.closeCacheValue looking to close /usr/home/jenkins/jenkins-slave/workspace/Lucene-Solr-NightlyTests-5.x/solr/build/solr-core/test/J0/temp/solr.cloud.RecoveryZkTest 2C3F78376E526F98-001/shard-2-001/cores/collection1/data/index [CachedDir<<refCount=0;path=/usr/home/jenkins/jenkins-slave/workspace/Lucene-Solr-NightlyTests-5.x/solr/build/solr-core/test/J0/temp/solr.cloud.RecoveryZkTest 2C3F78376E526F98-001/shard-2-001/cores/collection1/data/index;done=false>>]
   [junit4]   2> 1553038 T5245 C:collection1 S:shard1 c:collection1 oasc.CachingDirectoryFactory.close Closing directory: /usr/home/jenkins/jenkins-slave/workspace/Lucene-Solr-NightlyTests-5.x/solr/build/solr-core/test/J0/temp/solr.cloud.RecoveryZkTest 2C3F78376E526F98-001/shard-2-001/cores/collection1/data/index
   [junit4]   2> 1553039 T5127 C:collection1 S:shard1 c:collection1 oejsh.ContextHandler.doStop stopped o.e.j.s.ServletContextHandler{/ne_/s,null}
   [junit4]   2> 1553242 T5127 C:collection1 S:shard1 c:collection1 oasc.ZkTestServer.send4LetterWord connecting to 127.0.0.1:41594 41594
   [junit4]   2> 1553387 T5128 oasc.ZkTestServer.send4LetterWord connecting to 127.0.0.1:41594 41594
   [junit4]   2> 1553388 T5128 oasc.ZkTestServer$ZKServerMain.runFromConfig WARN Watch limit violations: 
   [junit4]   2> 	Maximum concurrent create/delete watches above limit:
   [junit4]   2> 	
   [junit4]   2> 		5	/solr/clusterstate.json
   [junit4]   2> 		5	/solr/aliases.json
   [junit4]   2> 		4	/solr/configs/conf1
   [junit4]   2> 		3	/solr/collections/collection1/state.json
   [junit4]   2> 	
   [junit4]   2> 	Maximum concurrent data watches above limit:
   [junit4]   2> 	
   [junit4]   2> 		2	/solr/overseer_elect/election/93635670365437959-127.0.0.1:63103_ne_%2Fs-n_0000000001
   [junit4]   2> 		2	/solr/collections/collection1/leader_elect/shard1/election/93635670365437959-core_node1-n_0000000000
   [junit4]   2> 	
   [junit4]   2> 	Maximum concurrent children watches above limit:
   [junit4]   2> 	
   [junit4]   2> 		4	/solr/live_nodes
   [junit4]   2> 		3	/solr/overseer/collection-queue-work
   [junit4]   2> 		3	/solr/overseer/queue
   [junit4]   2> 	
   [junit4]   2> NOTE: download the large Jenkins line-docs file by running 'ant get-jenkins-line-docs' in the lucene directory.
   [junit4]   2> NOTE: reproduce with: ant test  -Dtestcase=RecoveryZkTest -Dtests.method=test -Dtests.seed=2C3F78376E526F98 -Dtests.multiplier=2 -Dtests.nightly=true -Dtests.slow=true -Dtests.linedocsfile=/home/jenkins/lucene-data/enwiki.random.lines.txt -Dtests.locale=sq -Dtests.timezone=Africa/Banjul -Dtests.asserts=true -Dtests.file.encoding=ISO-8859-1
   [junit4] FAILURE  172s J0 | RecoveryZkTest.test <<<
   [junit4]    > Throwable #1: java.lang.AssertionError: shard1 is not consistent.  Got 862 from http://127.0.0.1:63103/ne_/s/collection1lastClient and got 192 from http://127.0.0.1:63106/ne_/s/collection1
   [junit4]    > 	at __randomizedtesting.SeedInfo.seed([2C3F78376E526F98:A46B47EDC0AE0260]:0)
   [junit4]    > 	at org.apache.solr.cloud.RecoveryZkTest.test(RecoveryZkTest.java:123)
   [junit4]    > 	at org.apache.solr.BaseDistributedSearchTestCase$ShardsRepeatRule$ShardsFixedStatement.callStatement(BaseDistributedSearchTestCase.java:960)
   [junit4]    > 	at org.apache.solr.BaseDistributedSearchTestCase$ShardsRepeatRule$ShardsStatement.evaluate(BaseDistributedSearchTestCase.java:935)
   [junit4]    > 	at java.lang.Thread.run(Thread.java:745)
   [junit4]   2> 1553405 T5127 C:collection1 S:shard1 c:collection1 oas.SolrTestCaseJ4.deleteCore ###deleteCore
   [junit4]   2> NOTE: leaving temporary files on disk at: /usr/home/jenkins/jenkins-slave/workspace/Lucene-Solr-NightlyTests-5.x/solr/build/solr-core/test/J0/temp/solr.cloud.RecoveryZkTest 2C3F78376E526F98-001
   [junit4]   2> NOTE: test params are: codec=Asserting(Lucene50): {id=Lucene50(blocksize=128), a_i=Lucene50(blocksize=128), a_t=PostingsFormat(name=Direct), rnd_b=Lucene50(blocksize=128), _version_=FST50}, docValues:{}, sim=DefaultSimilarity, locale=sq, timezone=Africa/Banjul
   [junit4]   2> NOTE: FreeBSD 9.1-RELEASE-p3 amd64/Oracle Corporation 1.7.0_65 (64-bit)/cpus=16,threads=1,free=70845808,total=332398592
   [junit4]   2> NOTE: All tests run in this JVM: [DistributedQueryElevationComponentTest, DistributedFacetPivotSmallAdvancedTest, TestRandomFaceting, TestDynamicLoading, HdfsBasicDistributedZk2Test, SolrCmdDistributorTest, TestSolrIndexConfig, XmlUpdateRequestHandlerTest, SegmentsInfoRequestHandlerTest, DeleteShardTest, TestTrie, TestPartialUpdateDeduplication, TestCloudInspectUtil, SpellCheckCollatorTest, DistributedSpellCheckComponentTest, HighlighterConfigTest, OpenExchangeRatesOrgProviderTest, TestDefaultSearchFieldResource, TestSort, SolrTestCaseJ4Test, TestUpdate, MBeansHandlerTest, RequiredFieldsTest, DistributedFacetPivotWhiteBoxTest, TestIBSimilarityFactory, TestSolrDeletionPolicy2, OverseerTest, SolrIndexConfigTest, TestSolrCoreProperties, ShowFileRequestHandlerTest, TestNoOpRegenerator, SharedFSAutoReplicaFailoverUtilsTest, CursorPagingTest, DebugComponentTest, MinimalSchemaTest, DistanceFunctionTest, ZkNodePropsTest, TestXIncludeConfig, TestExactStatsCache, ExternalFileFieldSortTest, TestFaceting, TestDFRSimilarityFactory, StressHdfsTest, TestLRUStatsCache, DocValuesMissingTest, SignatureUpdateProcessorFactoryTest, QueryParsingTest, OverseerCollectionProcessorTest, StatelessScriptUpdateProcessorFactoryTest, TestManagedResourceStorage, DOMUtilTest, TestManagedStopFilterFactory, HdfsRecoveryZkTest, TestMissingGroups, DateRangeFieldTest, TestMiniSolrCloudClusterSSL, ReplicationFactorTest, BasicDistributedZkTest, ChaosMonkeySafeLeaderTest, BasicDistributedZk2Test, LeaderElectionIntegrationTest, RecoveryZkTest]
   [junit4] Completed [191/482] on J0 in 172.37s, 1 test, 1 failure <<< FAILURES!

[...truncated 939 lines...]
BUILD FAILED
/usr/home/jenkins/jenkins-slave/workspace/Lucene-Solr-NightlyTests-5.x/build.xml:543: The following error occurred while executing this line:
/usr/home/jenkins/jenkins-slave/workspace/Lucene-Solr-NightlyTests-5.x/build.xml:484: The following error occurred while executing this line:
/usr/home/jenkins/jenkins-slave/workspace/Lucene-Solr-NightlyTests-5.x/build.xml:61: The following error occurred while executing this line:
/usr/home/jenkins/jenkins-slave/workspace/Lucene-Solr-NightlyTests-5.x/extra-targets.xml:39: The following error occurred while executing this line:
/usr/home/jenkins/jenkins-slave/workspace/Lucene-Solr-NightlyTests-5.x/solr/build.xml:229: The following error occurred while executing this line:
/usr/home/jenkins/jenkins-slave/workspace/Lucene-Solr-NightlyTests-5.x/solr/common-build.xml:510: The following error occurred while executing this line:
/usr/home/jenkins/jenkins-slave/workspace/Lucene-Solr-NightlyTests-5.x/lucene/common-build.xml:1434: The following error occurred while executing this line:
/usr/home/jenkins/jenkins-slave/workspace/Lucene-Solr-NightlyTests-5.x/lucene/common-build.xml:991: There were test failures: 482 suites, 1914 tests, 1 failure, 59 ignored (9 assumptions)

Total time: 158 minutes 23 seconds
Build step 'Invoke Ant' marked build as failure
Archiving artifacts
Sending artifact delta relative to Lucene-Solr-NightlyTests-5.x #716
Archived 5 artifacts
Archive block size is 32768
Received 0 blocks and 915691096 bytes
Compression is 0.0%
Took 2 min 45 sec
Recording test results
Email was triggered for: Failure
Sending email for trigger: Failure



Mime
View raw message