lucene-dev mailing list archives

Site index · List index
Message view « Date » · « Thread »
Top « Date » · « Thread »
From Apache Jenkins Server <jenk...@builds.apache.org>
Subject [JENKINS] Lucene-Solr-NightlyTests-5.x - Build # 806 - Still Failing
Date Fri, 03 Apr 2015 15:52:34 GMT
Build: https://builds.apache.org/job/Lucene-Solr-NightlyTests-5.x/806/

1 tests failed.
REGRESSION:  org.apache.lucene.search.suggest.document.SuggestFieldTest.testDupSuggestFieldValues

Error Message:
MockDirectoryWrapper: cannot close: there are still open files: {_ak_completion_0.lkp=1, _aj_completion_0.lkp=1,
_ak_completion_0.tim=1, _ak_completion_0.doc=1, _ak.nvd=1, _aj_completion_0.pay=1, _aj_completion_0.pos=1,
_ak_completion_0.pos=1, _ak.fdt=1, _aj.nvd=1, _aj_completion_0.tim=1, _aj_completion_0.doc=1,
_ak_completion_0.pay=1, _aj.fdt=1}

Stack Trace:
java.lang.RuntimeException: MockDirectoryWrapper: cannot close: there are still open files:
{_ak_completion_0.lkp=1, _aj_completion_0.lkp=1, _ak_completion_0.tim=1, _ak_completion_0.doc=1,
_ak.nvd=1, _aj_completion_0.pay=1, _aj_completion_0.pos=1, _ak_completion_0.pos=1, _ak.fdt=1,
_aj.nvd=1, _aj_completion_0.tim=1, _aj_completion_0.doc=1, _ak_completion_0.pay=1, _aj.fdt=1}
	at org.apache.lucene.store.MockDirectoryWrapper.close(MockDirectoryWrapper.java:747)
	at org.apache.lucene.search.suggest.document.SuggestFieldTest.after(SuggestFieldTest.java:80)
	at sun.reflect.NativeMethodAccessorImpl.invoke0(Native Method)
	at sun.reflect.NativeMethodAccessorImpl.invoke(NativeMethodAccessorImpl.java:57)
	at sun.reflect.DelegatingMethodAccessorImpl.invoke(DelegatingMethodAccessorImpl.java:43)
	at java.lang.reflect.Method.invoke(Method.java:606)
	at com.carrotsearch.randomizedtesting.RandomizedRunner.invoke(RandomizedRunner.java:1627)
	at com.carrotsearch.randomizedtesting.RandomizedRunner$8.evaluate(RandomizedRunner.java:894)
	at org.apache.lucene.util.TestRuleSetupTeardownChained$1.evaluate(TestRuleSetupTeardownChained.java:50)
	at org.apache.lucene.util.AbstractBeforeAfterRule$1.evaluate(AbstractBeforeAfterRule.java:46)
	at org.apache.lucene.util.TestRuleThreadAndTestName$1.evaluate(TestRuleThreadAndTestName.java:49)
	at org.apache.lucene.util.TestRuleIgnoreAfterMaxFailures$1.evaluate(TestRuleIgnoreAfterMaxFailures.java:65)
	at org.apache.lucene.util.TestRuleMarkFailure$1.evaluate(TestRuleMarkFailure.java:48)
	at com.carrotsearch.randomizedtesting.rules.StatementAdapter.evaluate(StatementAdapter.java:36)
	at com.carrotsearch.randomizedtesting.ThreadLeakControl$StatementRunner.run(ThreadLeakControl.java:365)
	at com.carrotsearch.randomizedtesting.ThreadLeakControl.forkTimeoutingTask(ThreadLeakControl.java:798)
	at com.carrotsearch.randomizedtesting.ThreadLeakControl$3.evaluate(ThreadLeakControl.java:458)
	at com.carrotsearch.randomizedtesting.RandomizedRunner.runSingleTest(RandomizedRunner.java:845)
	at com.carrotsearch.randomizedtesting.RandomizedRunner$3.evaluate(RandomizedRunner.java:747)
	at com.carrotsearch.randomizedtesting.RandomizedRunner$4.evaluate(RandomizedRunner.java:781)
	at com.carrotsearch.randomizedtesting.RandomizedRunner$5.evaluate(RandomizedRunner.java:792)
	at org.apache.lucene.util.AbstractBeforeAfterRule$1.evaluate(AbstractBeforeAfterRule.java:46)
	at com.carrotsearch.randomizedtesting.rules.StatementAdapter.evaluate(StatementAdapter.java:36)
	at org.apache.lucene.util.TestRuleStoreClassName$1.evaluate(TestRuleStoreClassName.java:42)
	at com.carrotsearch.randomizedtesting.rules.NoShadowingOrOverridesOnMethodsRule$1.evaluate(NoShadowingOrOverridesOnMethodsRule.java:39)
	at com.carrotsearch.randomizedtesting.rules.NoShadowingOrOverridesOnMethodsRule$1.evaluate(NoShadowingOrOverridesOnMethodsRule.java:39)
	at com.carrotsearch.randomizedtesting.rules.StatementAdapter.evaluate(StatementAdapter.java:36)
	at com.carrotsearch.randomizedtesting.rules.StatementAdapter.evaluate(StatementAdapter.java:36)
	at com.carrotsearch.randomizedtesting.rules.StatementAdapter.evaluate(StatementAdapter.java:36)
	at org.apache.lucene.util.TestRuleAssertionsRequired$1.evaluate(TestRuleAssertionsRequired.java:54)
	at org.apache.lucene.util.TestRuleMarkFailure$1.evaluate(TestRuleMarkFailure.java:48)
	at org.apache.lucene.util.TestRuleIgnoreAfterMaxFailures$1.evaluate(TestRuleIgnoreAfterMaxFailures.java:65)
	at org.apache.lucene.util.TestRuleIgnoreTestSuites$1.evaluate(TestRuleIgnoreTestSuites.java:55)
	at com.carrotsearch.randomizedtesting.rules.StatementAdapter.evaluate(StatementAdapter.java:36)
	at com.carrotsearch.randomizedtesting.ThreadLeakControl$StatementRunner.run(ThreadLeakControl.java:365)
	at java.lang.Thread.run(Thread.java:745)
Caused by: java.lang.RuntimeException: unclosed IndexInput: _aj_completion_0.pos
	at org.apache.lucene.store.MockDirectoryWrapper.addFileHandle(MockDirectoryWrapper.java:622)
	at org.apache.lucene.store.MockDirectoryWrapper.openInput(MockDirectoryWrapper.java:666)
	at org.apache.lucene.codecs.lucene50.Lucene50PostingsReader.<init>(Lucene50PostingsReader.java:92)
	at org.apache.lucene.codecs.lucene50.Lucene50PostingsFormat.fieldsProducer(Lucene50PostingsFormat.java:443)
	at org.apache.lucene.search.suggest.document.CompletionFieldsProducer.<init>(CompletionFieldsProducer.java:93)
	at org.apache.lucene.search.suggest.document.CompletionPostingsFormat.fieldsProducer(CompletionPostingsFormat.java:119)
	at org.apache.lucene.codecs.perfield.PerFieldPostingsFormat$FieldsReader.<init>(PerFieldPostingsFormat.java:258)
	at org.apache.lucene.codecs.perfield.PerFieldPostingsFormat.fieldsProducer(PerFieldPostingsFormat.java:336)
	at org.apache.lucene.index.SegmentCoreReaders.<init>(SegmentCoreReaders.java:104)
	at org.apache.lucene.index.SegmentReader.<init>(SegmentReader.java:65)
	at org.apache.lucene.index.ReadersAndUpdates.getReader(ReadersAndUpdates.java:132)
	at org.apache.lucene.index.ReadersAndUpdates.getReadOnlyClone(ReadersAndUpdates.java:184)
	at org.apache.lucene.index.StandardDirectoryReader.open(StandardDirectoryReader.java:99)
	at org.apache.lucene.index.IndexWriter.getReader(IndexWriter.java:430)
	at org.apache.lucene.index.RandomIndexWriter.getReader(RandomIndexWriter.java:352)
	at org.apache.lucene.index.RandomIndexWriter.getReader(RandomIndexWriter.java:280)
	at org.apache.lucene.search.suggest.document.SuggestFieldTest.testDupSuggestFieldValues(SuggestFieldTest.java:162)
	at sun.reflect.NativeMethodAccessorImpl.invoke0(Native Method)
	at sun.reflect.NativeMethodAccessorImpl.invoke(NativeMethodAccessorImpl.java:57)
	at sun.reflect.DelegatingMethodAccessorImpl.invoke(DelegatingMethodAccessorImpl.java:43)
	at java.lang.reflect.Method.invoke(Method.java:606)
	at com.carrotsearch.randomizedtesting.RandomizedRunner.invoke(RandomizedRunner.java:1627)
	at com.carrotsearch.randomizedtesting.RandomizedRunner$6.evaluate(RandomizedRunner.java:836)
	at com.carrotsearch.randomizedtesting.RandomizedRunner$7.evaluate(RandomizedRunner.java:872)
	at com.carrotsearch.randomizedtesting.RandomizedRunner$8.evaluate(RandomizedRunner.java:886)
	... 28 more




Build Log:
[...truncated 8852 lines...]
   [junit4] Suite: org.apache.lucene.search.suggest.document.SuggestFieldTest
   [junit4]   2> NOTE: download the large Jenkins line-docs file by running 'ant get-jenkins-line-docs'
in the lucene directory.
   [junit4]   2> NOTE: reproduce with: ant test  -Dtestcase=SuggestFieldTest -Dtests.method=testDupSuggestFieldValues
-Dtests.seed=21CC108D79B60A32 -Dtests.multiplier=2 -Dtests.nightly=true -Dtests.slow=true
-Dtests.linedocsfile=/home/jenkins/lucene-data/enwiki.random.lines.txt -Dtests.locale=bg_BG
-Dtests.timezone=Asia/Colombo -Dtests.asserts=true -Dtests.file.encoding=US-ASCII
   [junit4] ERROR   8.26s J3 | SuggestFieldTest.testDupSuggestFieldValues <<<
   [junit4]    > Throwable #1: java.lang.AssertionError: 
   [junit4]    > Expected: <1736>
   [junit4]    >      got: <1362>
   [junit4]    > 	at org.apache.lucene.search.suggest.document.SuggestFieldTest.assertSuggestions(SuggestFieldTest.java:740)
   [junit4]    > 	at org.apache.lucene.search.suggest.document.SuggestFieldTest.testDupSuggestFieldValues(SuggestFieldTest.java:171)
   [junit4]    > 	at java.lang.Thread.run(Thread.java:745)Throwable #2: java.lang.RuntimeException:
MockDirectoryWrapper: cannot close: there are still open files: {_ak_completion_0.lkp=1, _aj_completion_0.lkp=1,
_ak_completion_0.tim=1, _ak_completion_0.doc=1, _ak.nvd=1, _aj_completion_0.pay=1, _aj_completion_0.pos=1,
_ak_completion_0.pos=1, _ak.fdt=1, _aj.nvd=1, _aj_completion_0.tim=1, _aj_completion_0.doc=1,
_ak_completion_0.pay=1, _aj.fdt=1}
   [junit4]    > 	at org.apache.lucene.store.MockDirectoryWrapper.close(MockDirectoryWrapper.java:747)
   [junit4]    > 	at org.apache.lucene.search.suggest.document.SuggestFieldTest.after(SuggestFieldTest.java:80)
   [junit4]    > 	at java.lang.Thread.run(Thread.java:745)
   [junit4]    > Caused by: java.lang.RuntimeException: unclosed IndexInput: _aj_completion_0.pos
   [junit4]    > 	at org.apache.lucene.store.MockDirectoryWrapper.addFileHandle(MockDirectoryWrapper.java:622)
   [junit4]    > 	at org.apache.lucene.store.MockDirectoryWrapper.openInput(MockDirectoryWrapper.java:666)
   [junit4]    > 	at org.apache.lucene.codecs.lucene50.Lucene50PostingsReader.<init>(Lucene50PostingsReader.java:92)
   [junit4]    > 	at org.apache.lucene.codecs.lucene50.Lucene50PostingsFormat.fieldsProducer(Lucene50PostingsFormat.java:443)
   [junit4]    > 	at org.apache.lucene.search.suggest.document.CompletionFieldsProducer.<init>(CompletionFieldsProducer.java:93)
   [junit4]    > 	at org.apache.lucene.search.suggest.document.CompletionPostingsFormat.fieldsProducer(CompletionPostingsFormat.java:119)
   [junit4]    > 	at org.apache.lucene.codecs.perfield.PerFieldPostingsFormat$FieldsReader.<init>(PerFieldPostingsFormat.java:258)
   [junit4]    > 	at org.apache.lucene.codecs.perfield.PerFieldPostingsFormat.fieldsProducer(PerFieldPostingsFormat.java:336)
   [junit4]    > 	at org.apache.lucene.index.SegmentCoreReaders.<init>(SegmentCoreReaders.java:104)
   [junit4]    > 	at org.apache.lucene.index.SegmentReader.<init>(SegmentReader.java:65)
   [junit4]    > 	at org.apache.lucene.index.ReadersAndUpdates.getReader(ReadersAndUpdates.java:132)
   [junit4]    > 	at org.apache.lucene.index.ReadersAndUpdates.getReadOnlyClone(ReadersAndUpdates.java:184)
   [junit4]    > 	at org.apache.lucene.index.StandardDirectoryReader.open(StandardDirectoryReader.java:99)
   [junit4]    > 	at org.apache.lucene.index.IndexWriter.getReader(IndexWriter.java:430)
   [junit4]    > 	at org.apache.lucene.index.RandomIndexWriter.getReader(RandomIndexWriter.java:352)
   [junit4]    > 	at org.apache.lucene.index.RandomIndexWriter.getReader(RandomIndexWriter.java:280)
   [junit4]    > 	at org.apache.lucene.search.suggest.document.SuggestFieldTest.testDupSuggestFieldValues(SuggestFieldTest.java:162)
   [junit4]    > 	... 28 more
   [junit4]   2> NOTE: leaving temporary files on disk at: /usr/home/jenkins/jenkins-slave/workspace/Lucene-Solr-NightlyTests-5.x/lucene/build/suggest/test/J3/temp/lucene.search.suggest.document.SuggestFieldTest
21CC108D79B60A32-001
   [junit4]   2> NOTE: test params are: codec=Asserting(Lucene50): {}, docValues:{}, sim=DefaultSimilarity,
locale=bg_BG, timezone=Asia/Colombo
   [junit4]   2> NOTE: FreeBSD 9.1-RELEASE-p3 amd64/Oracle Corporation 1.7.0_65 (64-bit)/cpus=16,threads=1,free=199522176,total=373293056
   [junit4]   2> NOTE: All tests run in this JVM: [TestDirectSpellChecker, TestWordBreakSpellChecker,
BytesRefSortersTest, BlendedInfixSuggesterTest, FSTCompletionTest, PersistenceTest, TestLevenshteinDistance,
TestHighFrequencyDictionary, TestJaroWinklerDistance, TestNGramDistance, TestInputIterator,
TestFreeTextSuggester, TestSuggestStopFilter, SuggestFieldTest]
   [junit4] Completed on J3 in 41.18s, 16 tests, 1 error <<< FAILURES!

[...truncated 12 lines...]
BUILD FAILED
/usr/home/jenkins/jenkins-slave/workspace/Lucene-Solr-NightlyTests-5.x/build.xml:536: The
following error occurred while executing this line:
/usr/home/jenkins/jenkins-slave/workspace/Lucene-Solr-NightlyTests-5.x/build.xml:477: The
following error occurred while executing this line:
/usr/home/jenkins/jenkins-slave/workspace/Lucene-Solr-NightlyTests-5.x/build.xml:61: The following
error occurred while executing this line:
/usr/home/jenkins/jenkins-slave/workspace/Lucene-Solr-NightlyTests-5.x/extra-targets.xml:39:
The following error occurred while executing this line:
/usr/home/jenkins/jenkins-slave/workspace/Lucene-Solr-NightlyTests-5.x/lucene/build.xml:456:
The following error occurred while executing this line:
/usr/home/jenkins/jenkins-slave/workspace/Lucene-Solr-NightlyTests-5.x/lucene/common-build.xml:2166:
The following error occurred while executing this line:
/usr/home/jenkins/jenkins-slave/workspace/Lucene-Solr-NightlyTests-5.x/lucene/module-build.xml:58:
The following error occurred while executing this line:
/usr/home/jenkins/jenkins-slave/workspace/Lucene-Solr-NightlyTests-5.x/lucene/common-build.xml:1370:
The following error occurred while executing this line:
/usr/home/jenkins/jenkins-slave/workspace/Lucene-Solr-NightlyTests-5.x/lucene/common-build.xml:976:
There were test failures: 26 suites, 162 tests, 1 error, 1 ignored

Total time: 107 minutes 56 seconds
Build step 'Invoke Ant' marked build as failure
Archiving artifacts
Sending artifact delta relative to Lucene-Solr-NightlyTests-5.x #716
Archived 5 artifacts
Archive block size is 32768
Received 0 blocks and 240072 bytes
Compression is 0.0%
Took 0.43 sec
Recording test results
Email was triggered for: Failure
Sending email for trigger: Failure



Mime
View raw message