lucene-dev mailing list archives

Site index · List index
Message view « Date » · « Thread »
Top « Date » · « Thread »
From Apache Jenkins Server <jenk...@builds.apache.org>
Subject [JENKINS] Lucene-Solr-NightlyTests-5.x - Build # 812 - Still Failing
Date Thu, 09 Apr 2015 17:42:57 GMT
Build: https://builds.apache.org/job/Lucene-Solr-NightlyTests-5.x/812/

2 tests failed.
REGRESSION:  org.apache.lucene.facet.taxonomy.TestSearcherTaxonomyManager.testDirectory

Error Message:
Test abandoned because suite timeout was reached.

Stack Trace:
java.lang.Exception: Test abandoned because suite timeout was reached.
	at __randomizedtesting.SeedInfo.seed([39FAAAC972D62F74]:0)


FAILED:  junit.framework.TestSuite.org.apache.lucene.facet.taxonomy.TestSearcherTaxonomyManager

Error Message:
Suite timeout exceeded (>= 7200000 msec).

Stack Trace:
java.lang.Exception: Suite timeout exceeded (>= 7200000 msec).
	at __randomizedtesting.SeedInfo.seed([39FAAAC972D62F74]:0)




Build Log:
[...truncated 7355 lines...]
   [junit4] Suite: org.apache.lucene.facet.taxonomy.TestSearcherTaxonomyManager
   [junit4]   2> ??? 09, 2015 11:12:48 AM com.carrotsearch.randomizedtesting.ThreadLeakControl$2
evaluate
   [junit4]   2> WARNING: Suite execution timed out: org.apache.lucene.facet.taxonomy.TestSearcherTaxonomyManager
   [junit4]   2>    1) Thread[id=88, name=Thread-56, state=RUNNABLE, group=TGRP-TestSearcherTaxonomyManager]
   [junit4]   2>         at org.apache.lucene.util.fst.FST.readNextRealArc(FST.java:1099)
   [junit4]   2>         at org.apache.lucene.util.fst.FST.readFirstRealTargetArc(FST.java:1001)
   [junit4]   2>         at org.apache.lucene.util.fst.NodeHash.nodesEqual(NodeHash.java:43)
   [junit4]   2>         at org.apache.lucene.util.fst.NodeHash.add(NodeHash.java:136)
   [junit4]   2>         at org.apache.lucene.util.fst.Builder.compileNode(Builder.java:189)
   [junit4]   2>         at org.apache.lucene.util.fst.Builder.freezeTail(Builder.java:277)
   [junit4]   2>         at org.apache.lucene.util.fst.Builder.add(Builder.java:381)
   [junit4]   2>         at org.apache.lucene.codecs.memory.FSTOrdTermsWriter$TermsWriter.finishTerm(FSTOrdTermsWriter.java:349)
   [junit4]   2>         at org.apache.lucene.codecs.memory.FSTOrdTermsWriter.write(FSTOrdTermsWriter.java:210)
   [junit4]   2>         at org.apache.lucene.codecs.perfield.PerFieldPostingsFormat$FieldsWriter.write(PerFieldPostingsFormat.java:198)
   [junit4]   2>         at org.apache.lucene.codecs.FieldsConsumer.merge(FieldsConsumer.java:105)
   [junit4]   2>         at org.apache.lucene.index.SegmentMerger.mergeTerms(SegmentMerger.java:193)
   [junit4]   2>         at org.apache.lucene.index.SegmentMerger.merge(SegmentMerger.java:95)
   [junit4]   2>         at org.apache.lucene.index.IndexWriter.mergeMiddle(IndexWriter.java:3944)
   [junit4]   2>         at org.apache.lucene.index.IndexWriter.merge(IndexWriter.java:3525)
   [junit4]   2>         at org.apache.lucene.index.SerialMergeScheduler.merge(SerialMergeScheduler.java:40)
   [junit4]   2>         at org.apache.lucene.index.IndexWriter.maybeMerge(IndexWriter.java:1814)
   [junit4]   2>         at org.apache.lucene.index.IndexWriter.doAfterSegmentFlushed(IndexWriter.java:4583)
   [junit4]   2>         at org.apache.lucene.index.DocumentsWriter$MergePendingEvent.process(DocumentsWriter.java:704)
   [junit4]   2>         at org.apache.lucene.index.IndexWriter.processEvents(IndexWriter.java:4609)
   [junit4]   2>         at org.apache.lucene.index.IndexWriter.processEvents(IndexWriter.java:4600)
   [junit4]   2>         at org.apache.lucene.index.IndexWriter.updateDocument(IndexWriter.java:1361)
   [junit4]   2>         at org.apache.lucene.index.IndexWriter.addDocument(IndexWriter.java:1139)
   [junit4]   2>         at org.apache.lucene.facet.taxonomy.TestSearcherTaxonomyManager$IndexerThread.run(TestSearcherTaxonomyManager.java:95)
   [junit4]   2>    2) Thread[id=1, name=main, state=WAITING, group=main]
   [junit4]   2>         at java.lang.Object.wait(Native Method)
   [junit4]   2>         at java.lang.Thread.join(Thread.java:1281)
   [junit4]   2>         at java.lang.Thread.join(Thread.java:1355)
   [junit4]   2>         at com.carrotsearch.randomizedtesting.RandomizedRunner.runSuite(RandomizedRunner.java:578)
   [junit4]   2>         at com.carrotsearch.randomizedtesting.RandomizedRunner.run(RandomizedRunner.java:444)
   [junit4]   2>         at com.carrotsearch.ant.tasks.junit4.slave.SlaveMain.execute(SlaveMain.java:199)
   [junit4]   2>         at com.carrotsearch.ant.tasks.junit4.slave.SlaveMain.main(SlaveMain.java:310)
   [junit4]   2>         at com.carrotsearch.ant.tasks.junit4.slave.SlaveMainSafe.main(SlaveMainSafe.java:12)
   [junit4]   2>    3) Thread[id=9, name=JUnit4-serializer-daemon, state=TIMED_WAITING,
group=main]
   [junit4]   2>         at java.lang.Thread.sleep(Native Method)
   [junit4]   2>         at com.carrotsearch.ant.tasks.junit4.events.Serializer$1.run(Serializer.java:47)
   [junit4]   2>    4) Thread[id=87, name=TEST-TestSearcherTaxonomyManager.testDirectory-seed#[39FAAAC972D62F74],
state=RUNNABLE, group=TGRP-TestSearcherTaxonomyManager]
   [junit4]   2>         at org.apache.lucene.store.RAMInputStream.readBytes(RAMInputStream.java:90)
   [junit4]   2>         at org.apache.lucene.store.MockIndexInputWrapper.readBytes(MockIndexInputWrapper.java:138)
   [junit4]   2>         at org.apache.lucene.codecs.lucene50.Lucene50DocValuesProducer$6.get(Lucene50DocValuesProducer.java:519)
   [junit4]   2>         at org.apache.lucene.codecs.lucene50.Lucene50DocValuesProducer$LongBinaryDocValues.get(Lucene50DocValuesProducer.java:858)
   [junit4]   2>         at org.apache.lucene.facet.taxonomy.DocValuesOrdinalsReader$1.get(DocValuesOrdinalsReader.java:57)
   [junit4]   2>         at org.apache.lucene.facet.taxonomy.CachedOrdinalsReader$CachedOrds.<init>(CachedOrdinalsReader.java:122)
   [junit4]   2>         at org.apache.lucene.facet.taxonomy.CachedOrdinalsReader.getCachedOrds(CachedOrdinalsReader.java:75)
   [junit4]   2>         at org.apache.lucene.facet.taxonomy.CachedOrdinalsReader.getReader(CachedOrdinalsReader.java:89)
   [junit4]   2>         at org.apache.lucene.facet.taxonomy.TaxonomyFacetCounts.count(TaxonomyFacetCounts.java:51)
   [junit4]   2>         at org.apache.lucene.facet.taxonomy.TaxonomyFacetCounts.<init>(TaxonomyFacetCounts.java:45)
   [junit4]   2>         at org.apache.lucene.facet.FacetTestCase.getTaxonomyFacetCounts(FacetTestCase.java:54)
   [junit4]   2>         at org.apache.lucene.facet.FacetTestCase.getTaxonomyFacetCounts(FacetTestCase.java:42)
   [junit4]   2>         at org.apache.lucene.facet.taxonomy.TestSearcherTaxonomyManager.testDirectory(TestSearcherTaxonomyManager.java:236)
   [junit4]   2>         at sun.reflect.NativeMethodAccessorImpl.invoke0(Native Method)
   [junit4]   2>         at sun.reflect.NativeMethodAccessorImpl.invoke(NativeMethodAccessorImpl.java:57)
   [junit4]   2>         at sun.reflect.DelegatingMethodAccessorImpl.invoke(DelegatingMethodAccessorImpl.java:43)
   [junit4]   2>         at java.lang.reflect.Method.invoke(Method.java:606)
   [junit4]   2>         at com.carrotsearch.randomizedtesting.RandomizedRunner.invoke(RandomizedRunner.java:1627)
   [junit4]   2>         at com.carrotsearch.randomizedtesting.RandomizedRunner$6.evaluate(RandomizedRunner.java:836)
   [junit4]   2>         at com.carrotsearch.randomizedtesting.RandomizedRunner$7.evaluate(RandomizedRunner.java:872)
   [junit4]   2>         at com.carrotsearch.randomizedtesting.RandomizedRunner$8.evaluate(RandomizedRunner.java:886)
   [junit4]   2>         at org.apache.lucene.util.TestRuleSetupTeardownChained$1.evaluate(TestRuleSetupTeardownChained.java:50)
   [junit4]   2>         at org.apache.lucene.util.AbstractBeforeAfterRule$1.evaluate(AbstractBeforeAfterRule.java:46)
   [junit4]   2>         at org.apache.lucene.util.TestRuleThreadAndTestName$1.evaluate(TestRuleThreadAndTestName.java:49)
   [junit4]   2>         at org.apache.lucene.util.TestRuleIgnoreAfterMaxFailures$1.evaluate(TestRuleIgnoreAfterMaxFailures.java:65)
   [junit4]   2>         at org.apache.lucene.util.TestRuleMarkFailure$1.evaluate(TestRuleMarkFailure.java:48)
   [junit4]   2>         at com.carrotsearch.randomizedtesting.rules.StatementAdapter.evaluate(StatementAdapter.java:36)
   [junit4]   2>         at com.carrotsearch.randomizedtesting.ThreadLeakControl$StatementRunner.run(ThreadLeakControl.java:365)
   [junit4]   2>         at com.carrotsearch.randomizedtesting.ThreadLeakControl.forkTimeoutingTask(ThreadLeakControl.java:798)
   [junit4]   2>         at com.carrotsearch.randomizedtesting.ThreadLeakControl$3.evaluate(ThreadLeakControl.java:458)
   [junit4]   2>         at com.carrotsearch.randomizedtesting.RandomizedRunner.runSingleTest(RandomizedRunner.java:845)
   [junit4]   2>         at com.carrotsearch.randomizedtesting.RandomizedRunner$3.evaluate(RandomizedRunner.java:747)
   [junit4]   2>         at com.carrotsearch.randomizedtesting.RandomizedRunner$4.evaluate(RandomizedRunner.java:781)
   [junit4]   2>         at com.carrotsearch.randomizedtesting.RandomizedRunner$5.evaluate(RandomizedRunner.java:792)
   [junit4]   2>         at org.apache.lucene.util.AbstractBeforeAfterRule$1.evaluate(AbstractBeforeAfterRule.java:46)
   [junit4]   2>         at com.carrotsearch.randomizedtesting.rules.StatementAdapter.evaluate(StatementAdapter.java:36)
   [junit4]   2>         at org.apache.lucene.util.TestRuleStoreClassName$1.evaluate(TestRuleStoreClassName.java:42)
   [junit4]   2>         at com.carrotsearch.randomizedtesting.rules.NoShadowingOrOverridesOnMethodsRule$1.evaluate(NoShadowingOrOverridesOnMethodsRule.java:39)
   [junit4]   2>         at com.carrotsearch.randomizedtesting.rules.NoShadowingOrOverridesOnMethodsRule$1.evaluate(NoShadowingOrOverridesOnMethodsRule.java:39)
   [junit4]   2>         at com.carrotsearch.randomizedtesting.rules.StatementAdapter.evaluate(StatementAdapter.java:36)
   [junit4]   2>         at com.carrotsearch.randomizedtesting.rules.StatementAdapter.evaluate(StatementAdapter.java:36)
   [junit4]   2>         at com.carrotsearch.randomizedtesting.rules.StatementAdapter.evaluate(StatementAdapter.java:36)
   [junit4]   2>         at org.apache.lucene.util.TestRuleAssertionsRequired$1.evaluate(TestRuleAssertionsRequired.java:54)
   [junit4]   2>         at org.apache.lucene.util.TestRuleMarkFailure$1.evaluate(TestRuleMarkFailure.java:48)
   [junit4]   2>         at org.apache.lucene.util.TestRuleIgnoreAfterMaxFailures$1.evaluate(TestRuleIgnoreAfterMaxFailures.java:65)
   [junit4]   2>         at org.apache.lucene.util.TestRuleIgnoreTestSuites$1.evaluate(TestRuleIgnoreTestSuites.java:55)
   [junit4]   2>         at com.carrotsearch.randomizedtesting.rules.StatementAdapter.evaluate(StatementAdapter.java:36)
   [junit4]   2>         at com.carrotsearch.randomizedtesting.ThreadLeakControl$StatementRunner.run(ThreadLeakControl.java:365)
   [junit4]   2>         at java.lang.Thread.run(Thread.java:745)
   [junit4]   2>    5) Thread[id=86, name=SUITE-TestSearcherTaxonomyManager-seed#[39FAAAC972D62F74],
state=RUNNABLE, group=TGRP-TestSearcherTaxonomyManager]
   [junit4]   2>         at java.lang.Thread.getStackTrace(Thread.java:1589)
   [junit4]   2>         at com.carrotsearch.randomizedtesting.ThreadLeakControl.getThreadsWithTraces(ThreadLeakControl.java:690)
   [junit4]   2>         at com.carrotsearch.randomizedtesting.ThreadLeakControl.formatThreadStacksFull(ThreadLeakControl.java:679)
   [junit4]   2>         at com.carrotsearch.randomizedtesting.ThreadLeakControl.access$900(ThreadLeakControl.java:62)
   [junit4]   2>         at com.carrotsearch.randomizedtesting.ThreadLeakControl$2.evaluate(ThreadLeakControl.java:412)
   [junit4]   2>         at com.carrotsearch.randomizedtesting.RandomizedRunner.runSuite(RandomizedRunner.java:651)
   [junit4]   2>         at com.carrotsearch.randomizedtesting.RandomizedRunner.access$200(RandomizedRunner.java:138)
   [junit4]   2>         at com.carrotsearch.randomizedtesting.RandomizedRunner$1.run(RandomizedRunner.java:568)
   [junit4]   2> NOTE: download the large Jenkins line-docs file by running 'ant get-jenkins-line-docs'
in the lucene directory.
   [junit4]   2> NOTE: reproduce with: ant test  -Dtestcase=TestSearcherTaxonomyManager
-Dtests.method=testDirectory -Dtests.seed=39FAAAC972D62F74 -Dtests.multiplier=2 -Dtests.nightly=true
-Dtests.slow=true -Dtests.linedocsfile=/home/jenkins/lucene-data/enwiki.random.lines.txt -Dtests.locale=be
-Dtests.timezone=America/Managua -Dtests.asserts=true -Dtests.file.encoding=UTF-8
   [junit4] ERROR   7200s J2 | TestSearcherTaxonomyManager.testDirectory <<<
   [junit4]    > Throwable #1: java.lang.Exception: Test abandoned because suite timeout
was reached.
   [junit4]    > 	at __randomizedtesting.SeedInfo.seed([39FAAAC972D62F74]:0)
   [junit4]   2> ??? 09, 2015 11:12:48 AM com.carrotsearch.randomizedtesting.ThreadLeakControl
checkThreadLeaks
   [junit4]   2> WARNING: Will linger awaiting termination of 2 leaked thread(s).
   [junit4]   2> ??? 09, 2015 11:13:08 AM com.carrotsearch.randomizedtesting.ThreadLeakControl
checkThreadLeaks
   [junit4]   2> SEVERE: 2 threads leaked from SUITE scope at org.apache.lucene.facet.taxonomy.TestSearcherTaxonomyManager:

   [junit4]   2>    1) Thread[id=88, name=Thread-56, state=RUNNABLE, group=TGRP-TestSearcherTaxonomyManager]
   [junit4]   2>         at org.apache.lucene.util.fst.Builder.validOutput(Builder.java:440)
   [junit4]   2>         at org.apache.lucene.util.fst.Builder.access$100(Builder.java:53)
   [junit4]   2>         at org.apache.lucene.util.fst.Builder$UnCompiledNode.prependOutput(Builder.java:619)
   [junit4]   2>         at org.apache.lucene.util.fst.Builder.add(Builder.java:414)
   [junit4]   2>         at org.apache.lucene.codecs.memory.FSTOrdTermsWriter$TermsWriter.finishTerm(FSTOrdTermsWriter.java:349)
   [junit4]   2>         at org.apache.lucene.codecs.memory.FSTOrdTermsWriter.write(FSTOrdTermsWriter.java:210)
   [junit4]   2>         at org.apache.lucene.codecs.perfield.PerFieldPostingsFormat$FieldsWriter.write(PerFieldPostingsFormat.java:198)
   [junit4]   2>         at org.apache.lucene.codecs.FieldsConsumer.merge(FieldsConsumer.java:105)
   [junit4]   2>         at org.apache.lucene.index.SegmentMerger.mergeTerms(SegmentMerger.java:193)
   [junit4]   2>         at org.apache.lucene.index.SegmentMerger.merge(SegmentMerger.java:95)
   [junit4]   2>         at org.apache.lucene.index.IndexWriter.mergeMiddle(IndexWriter.java:3944)
   [junit4]   2>         at org.apache.lucene.index.IndexWriter.merge(IndexWriter.java:3525)
   [junit4]   2>         at org.apache.lucene.index.SerialMergeScheduler.merge(SerialMergeScheduler.java:40)
   [junit4]   2>         at org.apache.lucene.index.IndexWriter.maybeMerge(IndexWriter.java:1814)
   [junit4]   2>         at org.apache.lucene.index.IndexWriter.doAfterSegmentFlushed(IndexWriter.java:4583)
   [junit4]   2>         at org.apache.lucene.index.DocumentsWriter$MergePendingEvent.process(DocumentsWriter.java:704)
   [junit4]   2>         at org.apache.lucene.index.IndexWriter.processEvents(IndexWriter.java:4609)
   [junit4]   2>         at org.apache.lucene.index.IndexWriter.processEvents(IndexWriter.java:4600)
   [junit4]   2>         at org.apache.lucene.index.IndexWriter.updateDocument(IndexWriter.java:1361)
   [junit4]   2>         at org.apache.lucene.index.IndexWriter.addDocument(IndexWriter.java:1139)
   [junit4]   2>         at org.apache.lucene.facet.taxonomy.TestSearcherTaxonomyManager$IndexerThread.run(TestSearcherTaxonomyManager.java:95)
   [junit4]   2>    2) Thread[id=87, name=TEST-TestSearcherTaxonomyManager.testDirectory-seed#[39FAAAC972D62F74],
state=RUNNABLE, group=TGRP-TestSearcherTaxonomyManager]
   [junit4]   2>         at org.apache.lucene.util.packed.MonotonicBlockPackedReader.get(MonotonicBlockPackedReader.java:108)
   [junit4]   2>         at org.apache.lucene.codecs.lucene50.Lucene50DocValuesProducer$6.get(Lucene50DocValuesProducer.java:514)
   [junit4]   2>         at org.apache.lucene.codecs.lucene50.Lucene50DocValuesProducer$LongBinaryDocValues.get(Lucene50DocValuesProducer.java:858)
   [junit4]   2>         at org.apache.lucene.facet.taxonomy.FastTaxonomyFacetCounts.count(FastTaxonomyFacetCounts.java:63)
   [junit4]   2>         at org.apache.lucene.facet.taxonomy.FastTaxonomyFacetCounts.<init>(FastTaxonomyFacetCounts.java:49)
   [junit4]   2>         at org.apache.lucene.facet.FacetTestCase.getTaxonomyFacetCounts(FacetTestCase.java:48)
   [junit4]   2>         at org.apache.lucene.facet.FacetTestCase.getTaxonomyFacetCounts(FacetTestCase.java:42)
   [junit4]   2>         at org.apache.lucene.facet.taxonomy.TestSearcherTaxonomyManager.testDirectory(TestSearcherTaxonomyManager.java:236)
   [junit4]   2>         at sun.reflect.NativeMethodAccessorImpl.invoke0(Native Method)
   [junit4]   2>         at sun.reflect.NativeMethodAccessorImpl.invoke(NativeMethodAccessorImpl.java:57)
   [junit4]   2>         at sun.reflect.DelegatingMethodAccessorImpl.invoke(DelegatingMethodAccessorImpl.java:43)
   [junit4]   2>         at java.lang.reflect.Method.invoke(Method.java:606)
   [junit4]   2>         at com.carrotsearch.randomizedtesting.RandomizedRunner.invoke(RandomizedRunner.java:1627)
   [junit4]   2>         at com.carrotsearch.randomizedtesting.RandomizedRunner$6.evaluate(RandomizedRunner.java:836)
   [junit4]   2>         at com.carrotsearch.randomizedtesting.RandomizedRunner$7.evaluate(RandomizedRunner.java:872)
   [junit4]   2>         at com.carrotsearch.randomizedtesting.RandomizedRunner$8.evaluate(RandomizedRunner.java:886)
   [junit4]   2>         at org.apache.lucene.util.TestRuleSetupTeardownChained$1.evaluate(TestRuleSetupTeardownChained.java:50)
   [junit4]   2>         at org.apache.lucene.util.AbstractBeforeAfterRule$1.evaluate(AbstractBeforeAfterRule.java:46)
   [junit4]   2>         at org.apache.lucene.util.TestRuleThreadAndTestName$1.evaluate(TestRuleThreadAndTestName.java:49)
   [junit4]   2>         at org.apache.lucene.util.TestRuleIgnoreAfterMaxFailures$1.evaluate(TestRuleIgnoreAfterMaxFailures.java:65)
   [junit4]   2>         at org.apache.lucene.util.TestRuleMarkFailure$1.evaluate(TestRuleMarkFailure.java:48)
   [junit4]   2>         at com.carrotsearch.randomizedtesting.rules.StatementAdapter.evaluate(StatementAdapter.java:36)
   [junit4]   2>         at com.carrotsearch.randomizedtesting.ThreadLeakControl$StatementRunner.run(ThreadLeakControl.java:365)
   [junit4]   2>         at com.carrotsearch.randomizedtesting.ThreadLeakControl.forkTimeoutingTask(ThreadLeakControl.java:798)
   [junit4]   2>         at com.carrotsearch.randomizedtesting.ThreadLeakControl$3.evaluate(ThreadLeakControl.java:458)
   [junit4]   2>         at com.carrotsearch.randomizedtesting.RandomizedRunner.runSingleTest(RandomizedRunner.java:845)
   [junit4]   2>         at com.carrotsearch.randomizedtesting.RandomizedRunner$3.evaluate(RandomizedRunner.java:747)
   [junit4]   2>         at com.carrotsearch.randomizedtesting.RandomizedRunner$4.evaluate(RandomizedRunner.java:781)
   [junit4]   2>         at com.carrotsearch.randomizedtesting.RandomizedRunner$5.evaluate(RandomizedRunner.java:792)
   [junit4]   2>         at org.apache.lucene.util.AbstractBeforeAfterRule$1.evaluate(AbstractBeforeAfterRule.java:46)
   [junit4]   2>         at com.carrotsearch.randomizedtesting.rules.StatementAdapter.evaluate(StatementAdapter.java:36)
   [junit4]   2>         at org.apache.lucene.util.TestRuleStoreClassName$1.evaluate(TestRuleStoreClassName.java:42)
   [junit4]   2>         at com.carrotsearch.randomizedtesting.rules.NoShadowingOrOverridesOnMethodsRule$1.evaluate(NoShadowingOrOverridesOnMethodsRule.java:39)
   [junit4]   2>         at com.carrotsearch.randomizedtesting.rules.NoShadowingOrOverridesOnMethodsRule$1.evaluate(NoShadowingOrOverridesOnMethodsRule.java:39)
   [junit4]   2>         at com.carrotsearch.randomizedtesting.rules.StatementAdapter.evaluate(StatementAdapter.java:36)
   [junit4]   2>         at com.carrotsearch.randomizedtesting.rules.StatementAdapter.evaluate(StatementAdapter.java:36)
   [junit4]   2>         at com.carrotsearch.randomizedtesting.rules.StatementAdapter.evaluate(StatementAdapter.java:36)
   [junit4]   2>         at org.apache.lucene.util.TestRuleAssertionsRequired$1.evaluate(TestRuleAssertionsRequired.java:54)
   [junit4]   2>         at org.apache.lucene.util.TestRuleMarkFailure$1.evaluate(TestRuleMarkFailure.java:48)
   [junit4]   2>         at org.apache.lucene.util.TestRuleIgnoreAfterMaxFailures$1.evaluate(TestRuleIgnoreAfterMaxFailures.java:65)
   [junit4]   2>         at org.apache.lucene.util.TestRuleIgnoreTestSuites$1.evaluate(TestRuleIgnoreTestSuites.java:55)
   [junit4]   2>         at com.carrotsearch.randomizedtesting.rules.StatementAdapter.evaluate(StatementAdapter.java:36)
   [junit4]   2>         at com.carrotsearch.randomizedtesting.ThreadLeakControl$StatementRunner.run(ThreadLeakControl.java:365)
   [junit4]   2>         at java.lang.Thread.run(Thread.java:745)
   [junit4]   2> ??? 09, 2015 11:13:08 AM com.carrotsearch.randomizedtesting.ThreadLeakControl
tryToInterruptAll
   [junit4]   2> INFO: Starting to interrupt leaked threads:
   [junit4]   2>    1) Thread[id=88, name=Thread-56, state=RUNNABLE, group=TGRP-TestSearcherTaxonomyManager]
   [junit4]   2>    2) Thread[id=87, name=TEST-TestSearcherTaxonomyManager.testDirectory-seed#[39FAAAC972D62F74],
state=RUNNABLE, group=TGRP-TestSearcherTaxonomyManager]
   [junit4]   2> ??? 09, 2015 11:13:11 AM com.carrotsearch.randomizedtesting.ThreadLeakControl
tryToInterruptAll
   [junit4]   2> SEVERE: There are still zombie threads that couldn't be terminated:
   [junit4]   2>    1) Thread[id=88, name=Thread-56, state=RUNNABLE, group=TGRP-TestSearcherTaxonomyManager]
   [junit4]   2>         at org.apache.lucene.util.fst.FSTEnum.pushFirst(FSTEnum.java:488)
   [junit4]   2>         at org.apache.lucene.util.fst.FSTEnum.doNext(FSTEnum.java:111)
   [junit4]   2>         at org.apache.lucene.util.fst.BytesRefFSTEnum.next(BytesRefFSTEnum.java:57)
   [junit4]   2>         at org.apache.lucene.codecs.memory.FSTOrdTermsReader$TermsReader$SegmentTermsEnum.next(FSTOrdTermsReader.java:499)
   [junit4]   2>         at org.apache.lucene.index.MultiTermsEnum.pushTop(MultiTermsEnum.java:269)
   [junit4]   2>         at org.apache.lucene.index.MultiTermsEnum.next(MultiTermsEnum.java:295)
   [junit4]   2>         at org.apache.lucene.index.FilterLeafReader$FilterTermsEnum.next(FilterLeafReader.java:194)
   [junit4]   2>         at org.apache.lucene.codecs.memory.FSTOrdTermsWriter.write(FSTOrdTermsWriter.java:204)
   [junit4]   2>         at org.apache.lucene.codecs.perfield.PerFieldPostingsFormat$FieldsWriter.write(PerFieldPostingsFormat.java:198)
   [junit4]   2>         at org.apache.lucene.codecs.FieldsConsumer.merge(FieldsConsumer.java:105)
   [junit4]   2>         at org.apache.lucene.index.SegmentMerger.mergeTerms(SegmentMerger.java:193)
   [junit4]   2>         at org.apache.lucene.index.SegmentMerger.merge(SegmentMerger.java:95)
   [junit4]   2>         at org.apache.lucene.index.IndexWriter.mergeMiddle(IndexWriter.java:3944)
   [junit4]   2>         at org.apache.lucene.index.IndexWriter.merge(IndexWriter.java:3525)
   [junit4]   2>         at org.apache.lucene.index.SerialMergeScheduler.merge(SerialMergeScheduler.java:40)
   [junit4]   2>         at org.apache.lucene.index.IndexWriter.maybeMerge(IndexWriter.java:1814)
   [junit4]   2>         at org.apache.lucene.index.IndexWriter.doAfterSegmentFlushed(IndexWriter.java:4583)
   [junit4]   2>         at org.apache.lucene.index.DocumentsWriter$MergePendingEvent.process(DocumentsWriter.java:704)
   [junit4]   2>         at org.apache.lucene.index.IndexWriter.processEvents(IndexWriter.java:4609)
   [junit4]   2>         at org.apache.lucene.index.IndexWriter.processEvents(IndexWriter.java:4600)
   [junit4]   2>         at org.apache.lucene.index.IndexWriter.updateDocument(IndexWriter.java:1361)
   [junit4]   2>         at org.apache.lucene.index.IndexWriter.addDocument(IndexWriter.java:1139)
   [junit4]   2>         at org.apache.lucene.facet.taxonomy.TestSearcherTaxonomyManager$IndexerThread.run(TestSearcherTaxonomyManager.java:95)
   [junit4]   2>    2) Thread[id=87, name=TEST-TestSearcherTaxonomyManager.testDirectory-seed#[39FAAAC972D62F74],
state=RUNNABLE, group=TGRP-TestSearcherTaxonomyManager]
   [junit4]   2>         at org.apache.lucene.store.RAMInputStream.readBytes(RAMInputStream.java:90)
   [junit4]   2>         at org.apache.lucene.store.MockIndexInputWrapper.readBytes(MockIndexInputWrapper.java:138)
   [junit4]   2>         at org.apache.lucene.codecs.lucene50.Lucene50DocValuesProducer$6.get(Lucene50DocValuesProducer.java:519)
   [junit4]   2>         at org.apache.lucene.codecs.lucene50.Lucene50DocValuesProducer$LongBinaryDocValues.get(Lucene50DocValuesProducer.java:858)
   [junit4]   2>         at org.apache.lucene.facet.taxonomy.DocValuesOrdinalsReader$1.get(DocValuesOrdinalsReader.java:57)
   [junit4]   2>         at org.apache.lucene.facet.taxonomy.TaxonomyFacetCounts.count(TaxonomyFacetCounts.java:56)
   [junit4]   2>         at org.apache.lucene.facet.taxonomy.TaxonomyFacetCounts.<init>(TaxonomyFacetCounts.java:45)
   [junit4]   2>         at org.apache.lucene.facet.FacetTestCase.getTaxonomyFacetCounts(FacetTestCase.java:54)
   [junit4]   2>         at org.apache.lucene.facet.FacetTestCase.getTaxonomyFacetCounts(FacetTestCase.java:42)
   [junit4]   2>         at org.apache.lucene.facet.taxonomy.TestSearcherTaxonomyManager.testDirectory(TestSearcherTaxonomyManager.java:236)
   [junit4]   2>         at sun.reflect.NativeMethodAccessorImpl.invoke0(Native Method)
   [junit4]   2>         at sun.reflect.NativeMethodAccessorImpl.invoke(NativeMethodAccessorImpl.java:57)
   [junit4]   2>         at sun.reflect.DelegatingMethodAccessorImpl.invoke(DelegatingMethodAccessorImpl.java:43)
   [junit4]   2>         at java.lang.reflect.Method.invoke(Method.java:606)
   [junit4]   2>         at com.carrotsearch.randomizedtesting.RandomizedRunner.invoke(RandomizedRunner.java:1627)
   [junit4]   2>         at com.carrotsearch.randomizedtesting.RandomizedRunner$6.evaluate(RandomizedRunner.java:836)
   [junit4]   2>         at com.carrotsearch.randomizedtesting.RandomizedRunner$7.evaluate(RandomizedRunner.java:872)
   [junit4]   2>         at com.carrotsearch.randomizedtesting.RandomizedRunner$8.evaluate(RandomizedRunner.java:886)
   [junit4]   2>         at org.apache.lucene.util.TestRuleSetupTeardownChained$1.evaluate(TestRuleSetupTeardownChained.java:50)
   [junit4]   2>         at org.apache.lucene.util.AbstractBeforeAfterRule$1.evaluate(AbstractBeforeAfterRule.java:46)
   [junit4]   2>         at org.apache.lucene.util.TestRuleThreadAndTestName$1.evaluate(TestRuleThreadAndTestName.java:49)
   [junit4]   2>         at org.apache.lucene.util.TestRuleIgnoreAfterMaxFailures$1.evaluate(TestRuleIgnoreAfterMaxFailures.java:65)
   [junit4]   2>         at org.apache.lucene.util.TestRuleMarkFailure$1.evaluate(TestRuleMarkFailure.java:48)
   [junit4]   2>         at com.carrotsearch.randomizedtesting.rules.StatementAdapter.evaluate(StatementAdapter.java:36)
   [junit4]   2>         at com.carrotsearch.randomizedtesting.ThreadLeakControl$StatementRunner.run(ThreadLeakControl.java:365)
   [junit4]   2>         at com.carrotsearch.randomizedtesting.ThreadLeakControl.forkTimeoutingTask(ThreadLeakControl.java:798)
   [junit4]   2>         at com.carrotsearch.randomizedtesting.ThreadLeakControl$3.evaluate(ThreadLeakControl.java:458)
   [junit4]   2>         at com.carrotsearch.randomizedtesting.RandomizedRunner.runSingleTest(RandomizedRunner.java:845)
   [junit4]   2>         at com.carrotsearch.randomizedtesting.RandomizedRunner$3.evaluate(RandomizedRunner.java:747)
   [junit4]   2>         at com.carrotsearch.randomizedtesting.RandomizedRunner$4.evaluate(RandomizedRunner.java:781)
   [junit4]   2>         at com.carrotsearch.randomizedtesting.RandomizedRunner$5.evaluate(RandomizedRunner.java:792)
   [junit4]   2>         at org.apache.lucene.util.AbstractBeforeAfterRule$1.evaluate(AbstractBeforeAfterRule.java:46)
   [junit4]   2>         at com.carrotsearch.randomizedtesting.rules.StatementAdapter.evaluate(StatementAdapter.java:36)
   [junit4]   2>         at org.apache.lucene.util.TestRuleStoreClassName$1.evaluate(TestRuleStoreClassName.java:42)
   [junit4]   2>         at com.carrotsearch.randomizedtesting.rules.NoShadowingOrOverridesOnMethodsRule$1.evaluate(NoShadowingOrOverridesOnMethodsRule.java:39)
   [junit4]   2>         at com.carrotsearch.randomizedtesting.rules.NoShadowingOrOverridesOnMethodsRule$1.evaluate(NoShadowingOrOverridesOnMethodsRule.java:39)
   [junit4]   2>         at com.carrotsearch.randomizedtesting.rules.StatementAdapter.evaluate(StatementAdapter.java:36)
   [junit4]   2>         at com.carrotsearch.randomizedtesting.rules.StatementAdapter.evaluate(StatementAdapter.java:36)
   [junit4]   2>         at com.carrotsearch.randomizedtesting.rules.StatementAdapter.evaluate(StatementAdapter.java:36)
   [junit4]   2>         at org.apache.lucene.util.TestRuleAssertionsRequired$1.evaluate(TestRuleAssertionsRequired.java:54)
   [junit4]   2>         at org.apache.lucene.util.TestRuleMarkFailure$1.evaluate(TestRuleMarkFailure.java:48)
   [junit4]   2>         at org.apache.lucene.util.TestRuleIgnoreAfterMaxFailures$1.evaluate(TestRuleIgnoreAfterMaxFailures.java:65)
   [junit4]   2>         at org.apache.lucene.util.TestRuleIgnoreTestSuites$1.evaluate(TestRuleIgnoreTestSuites.java:55)
   [junit4]   2>         at com.carrotsearch.randomizedtesting.rules.StatementAdapter.evaluate(StatementAdapter.java:36)
   [junit4]   2>         at com.carrotsearch.randomizedtesting.ThreadLeakControl$StatementRunner.run(ThreadLeakControl.java:365)
   [junit4]   2>         at java.lang.Thread.run(Thread.java:745)
   [junit4]   2> NOTE: test params are: codec=Asserting(Lucene50): {$facets=FSTOrd50, $payloads$=FST50,
$full_path$=FST50}, docValues:{$facets=DocValuesFormat(name=Lucene50)}, sim=RandomSimilarityProvider(queryNorm=true,coord=no):
{}, locale=be, timezone=America/Managua
   [junit4]   2> NOTE: FreeBSD 9.1-RELEASE-p3 amd64/Oracle Corporation 1.7.0_65 (64-bit)/cpus=16,threads=3,free=192153976,total=492830720
   [junit4]   2> NOTE: All tests run in this JVM: [TestCachedOrdinalsReader, TestTaxonomyFacetSumValueSource,
TestTaxonomyFacetCounts, TestDirectoryTaxonomyWriter, TestConcurrentFacetedIndexing, TestDirectoryTaxonomyReader,
TestFacetLabel, TestLRUHashMap, TestOrdinalMappingLeafReader, TestSearcherTaxonomyManager]
   [junit4]   2> NOTE: download the large Jenkins line-docs file by running 'ant get-jenkins-line-docs'
in the lucene directory.
   [junit4]   2> NOTE: reproduce with: ant test  -Dtestcase=TestSearcherTaxonomyManager
-Dtests.seed=39FAAAC972D62F74 -Dtests.multiplier=2 -Dtests.nightly=true -Dtests.slow=true
-Dtests.linedocsfile=/home/jenkins/lucene-data/enwiki.random.lines.txt -Dtests.locale=be -Dtests.timezone=America/Managua
-Dtests.asserts=true -Dtests.file.encoding=UTF-8
   [junit4] ERROR   0.00s J2 | TestSearcherTaxonomyManager (suite) <<<
   [junit4]    > Throwable #1: java.lang.Exception: Suite timeout exceeded (>= 7200000
msec).
   [junit4]    > 	at __randomizedtesting.SeedInfo.seed([39FAAAC972D62F74]:0)
   [junit4] Completed [23/23] on J2 in 7223.29s, 1 test, 2 errors <<< FAILURES!

[...truncated 13 lines...]
BUILD FAILED
/usr/home/jenkins/jenkins-slave/workspace/Lucene-Solr-NightlyTests-5.x/build.xml:543: The
following error occurred while executing this line:
/usr/home/jenkins/jenkins-slave/workspace/Lucene-Solr-NightlyTests-5.x/build.xml:484: The
following error occurred while executing this line:
/usr/home/jenkins/jenkins-slave/workspace/Lucene-Solr-NightlyTests-5.x/build.xml:61: The following
error occurred while executing this line:
/usr/home/jenkins/jenkins-slave/workspace/Lucene-Solr-NightlyTests-5.x/extra-targets.xml:39:
The following error occurred while executing this line:
/usr/home/jenkins/jenkins-slave/workspace/Lucene-Solr-NightlyTests-5.x/lucene/build.xml:457:
The following error occurred while executing this line:
/usr/home/jenkins/jenkins-slave/workspace/Lucene-Solr-NightlyTests-5.x/lucene/common-build.xml:2230:
The following error occurred while executing this line:
/usr/home/jenkins/jenkins-slave/workspace/Lucene-Solr-NightlyTests-5.x/lucene/module-build.xml:58:
The following error occurred while executing this line:
/usr/home/jenkins/jenkins-slave/workspace/Lucene-Solr-NightlyTests-5.x/lucene/common-build.xml:1434:
The following error occurred while executing this line:
/usr/home/jenkins/jenkins-slave/workspace/Lucene-Solr-NightlyTests-5.x/lucene/common-build.xml:991:
There were test failures: 23 suites, 152 tests, 1 suite-level error, 1 error

Total time: 219 minutes 10 seconds
Build step 'Invoke Ant' marked build as failure
Archiving artifacts
Sending artifact delta relative to Lucene-Solr-NightlyTests-5.x #716
Archived 5 artifacts
Archive block size is 32768
Received 0 blocks and 238480 bytes
Compression is 0.0%
Took 0.22 sec
Recording test results
Email was triggered for: Failure
Sending email for trigger: Failure



Mime
View raw message