lucene-dev mailing list archives

Site index · List index
Message view « Date » · « Thread »
Top « Date » · « Thread »
From Apache Jenkins Server <jenk...@builds.apache.org>
Subject [JENKINS] Lucene-Solr-Tests-5.x-Java7 - Build # 2894 - Still Failing
Date Sun, 05 Apr 2015 19:45:25 GMT
Build: https://builds.apache.org/job/Lucene-Solr-Tests-5.x-Java7/2894/

3 tests failed.
FAILED:  org.apache.solr.cloud.LeaderInitiatedRecoveryOnCommitTest.test

Error Message:
IOException occured when talking to server at: http://127.0.0.1:48409/c8n_1x3_commits_shard1_replica3

Stack Trace:
org.apache.solr.client.solrj.SolrServerException: IOException occured when talking to server at: http://127.0.0.1:48409/c8n_1x3_commits_shard1_replica3
	at __randomizedtesting.SeedInfo.seed([A6DBB2D7042F4A95:2E8F8D0DAAD3276D]:0)
	at org.apache.solr.client.solrj.impl.HttpSolrClient.executeMethod(HttpSolrClient.java:570)
	at org.apache.solr.client.solrj.impl.HttpSolrClient.request(HttpSolrClient.java:233)
	at org.apache.solr.client.solrj.impl.HttpSolrClient.request(HttpSolrClient.java:225)
	at org.apache.solr.client.solrj.SolrRequest.process(SolrRequest.java:135)
	at org.apache.solr.client.solrj.SolrClient.commit(SolrClient.java:483)
	at org.apache.solr.client.solrj.SolrClient.commit(SolrClient.java:464)
	at org.apache.solr.cloud.LeaderInitiatedRecoveryOnCommitTest.oneShardTest(LeaderInitiatedRecoveryOnCommitTest.java:132)
	at org.apache.solr.cloud.LeaderInitiatedRecoveryOnCommitTest.test(LeaderInitiatedRecoveryOnCommitTest.java:64)
	at sun.reflect.NativeMethodAccessorImpl.invoke0(Native Method)
	at sun.reflect.NativeMethodAccessorImpl.invoke(NativeMethodAccessorImpl.java:57)
	at sun.reflect.DelegatingMethodAccessorImpl.invoke(DelegatingMethodAccessorImpl.java:43)
	at java.lang.reflect.Method.invoke(Method.java:606)
	at com.carrotsearch.randomizedtesting.RandomizedRunner.invoke(RandomizedRunner.java:1627)
	at com.carrotsearch.randomizedtesting.RandomizedRunner$6.evaluate(RandomizedRunner.java:836)
	at com.carrotsearch.randomizedtesting.RandomizedRunner$7.evaluate(RandomizedRunner.java:872)
	at com.carrotsearch.randomizedtesting.RandomizedRunner$8.evaluate(RandomizedRunner.java:886)
	at org.apache.solr.BaseDistributedSearchTestCase$ShardsRepeatRule$ShardsFixedStatement.callStatement(BaseDistributedSearchTestCase.java:960)
	at org.apache.solr.BaseDistributedSearchTestCase$ShardsRepeatRule$ShardsStatement.evaluate(BaseDistributedSearchTestCase.java:935)
	at com.carrotsearch.randomizedtesting.rules.SystemPropertiesRestoreRule$1.evaluate(SystemPropertiesRestoreRule.java:53)
	at org.apache.lucene.util.TestRuleSetupTeardownChained$1.evaluate(TestRuleSetupTeardownChained.java:50)
	at org.apache.lucene.util.AbstractBeforeAfterRule$1.evaluate(AbstractBeforeAfterRule.java:46)
	at org.apache.lucene.util.TestRuleThreadAndTestName$1.evaluate(TestRuleThreadAndTestName.java:49)
	at org.apache.lucene.util.TestRuleIgnoreAfterMaxFailures$1.evaluate(TestRuleIgnoreAfterMaxFailures.java:65)
	at org.apache.lucene.util.TestRuleMarkFailure$1.evaluate(TestRuleMarkFailure.java:48)
	at com.carrotsearch.randomizedtesting.rules.StatementAdapter.evaluate(StatementAdapter.java:36)
	at com.carrotsearch.randomizedtesting.ThreadLeakControl$StatementRunner.run(ThreadLeakControl.java:365)
	at com.carrotsearch.randomizedtesting.ThreadLeakControl.forkTimeoutingTask(ThreadLeakControl.java:798)
	at com.carrotsearch.randomizedtesting.ThreadLeakControl$3.evaluate(ThreadLeakControl.java:458)
	at com.carrotsearch.randomizedtesting.RandomizedRunner.runSingleTest(RandomizedRunner.java:845)
	at com.carrotsearch.randomizedtesting.RandomizedRunner$3.evaluate(RandomizedRunner.java:747)
	at com.carrotsearch.randomizedtesting.RandomizedRunner$4.evaluate(RandomizedRunner.java:781)
	at com.carrotsearch.randomizedtesting.RandomizedRunner$5.evaluate(RandomizedRunner.java:792)
	at com.carrotsearch.randomizedtesting.rules.StatementAdapter.evaluate(StatementAdapter.java:36)
	at com.carrotsearch.randomizedtesting.rules.SystemPropertiesRestoreRule$1.evaluate(SystemPropertiesRestoreRule.java:53)
	at org.apache.lucene.util.AbstractBeforeAfterRule$1.evaluate(AbstractBeforeAfterRule.java:46)
	at com.carrotsearch.randomizedtesting.rules.StatementAdapter.evaluate(StatementAdapter.java:36)
	at org.apache.lucene.util.TestRuleStoreClassName$1.evaluate(TestRuleStoreClassName.java:42)
	at com.carrotsearch.randomizedtesting.rules.NoShadowingOrOverridesOnMethodsRule$1.evaluate(NoShadowingOrOverridesOnMethodsRule.java:39)
	at com.carrotsearch.randomizedtesting.rules.NoShadowingOrOverridesOnMethodsRule$1.evaluate(NoShadowingOrOverridesOnMethodsRule.java:39)
	at com.carrotsearch.randomizedtesting.rules.StatementAdapter.evaluate(StatementAdapter.java:36)
	at com.carrotsearch.randomizedtesting.rules.StatementAdapter.evaluate(StatementAdapter.java:36)
	at com.carrotsearch.randomizedtesting.rules.StatementAdapter.evaluate(StatementAdapter.java:36)
	at org.apache.lucene.util.TestRuleAssertionsRequired$1.evaluate(TestRuleAssertionsRequired.java:54)
	at org.apache.lucene.util.TestRuleMarkFailure$1.evaluate(TestRuleMarkFailure.java:48)
	at org.apache.lucene.util.TestRuleIgnoreAfterMaxFailures$1.evaluate(TestRuleIgnoreAfterMaxFailures.java:65)
	at org.apache.lucene.util.TestRuleIgnoreTestSuites$1.evaluate(TestRuleIgnoreTestSuites.java:55)
	at com.carrotsearch.randomizedtesting.rules.StatementAdapter.evaluate(StatementAdapter.java:36)
	at com.carrotsearch.randomizedtesting.ThreadLeakControl$StatementRunner.run(ThreadLeakControl.java:365)
	at java.lang.Thread.run(Thread.java:745)
Caused by: org.apache.http.NoHttpResponseException: 127.0.0.1:48409 failed to respond
	at org.apache.http.impl.conn.DefaultHttpResponseParser.parseHead(DefaultHttpResponseParser.java:143)
	at org.apache.http.impl.conn.DefaultHttpResponseParser.parseHead(DefaultHttpResponseParser.java:57)
	at org.apache.http.impl.io.AbstractMessageParser.parse(AbstractMessageParser.java:261)
	at org.apache.http.impl.AbstractHttpClientConnection.receiveResponseHeader(AbstractHttpClientConnection.java:283)
	at org.apache.http.impl.conn.DefaultClientConnection.receiveResponseHeader(DefaultClientConnection.java:251)
	at org.apache.http.impl.conn.ManagedClientConnectionImpl.receiveResponseHeader(ManagedClientConnectionImpl.java:197)
	at org.apache.http.protocol.HttpRequestExecutor.doReceiveResponse(HttpRequestExecutor.java:272)
	at org.apache.http.protocol.HttpRequestExecutor.execute(HttpRequestExecutor.java:124)
	at org.apache.http.impl.client.DefaultRequestDirector.tryExecute(DefaultRequestDirector.java:685)
	at org.apache.http.impl.client.DefaultRequestDirector.execute(DefaultRequestDirector.java:487)
	at org.apache.http.impl.client.AbstractHttpClient.doExecute(AbstractHttpClient.java:882)
	at org.apache.http.impl.client.CloseableHttpClient.execute(CloseableHttpClient.java:82)
	at org.apache.http.impl.client.CloseableHttpClient.execute(CloseableHttpClient.java:107)
	at org.apache.http.impl.client.CloseableHttpClient.execute(CloseableHttpClient.java:55)
	at org.apache.solr.client.solrj.impl.HttpSolrClient.executeMethod(HttpSolrClient.java:462)
	... 48 more


FAILED:  org.apache.solr.cloud.RecoveryAfterSoftCommitTest.test

Error Message:
org.apache.solr.client.solrj.SolrServerException: IOException occured when talking to server at: http://127.0.0.1:48539/collection1

Stack Trace:
org.apache.solr.client.solrj.SolrServerException: org.apache.solr.client.solrj.SolrServerException: IOException occured when talking to server at: http://127.0.0.1:48539/collection1
	at __randomizedtesting.SeedInfo.seed([A6DBB2D7042F4A95:2E8F8D0DAAD3276D]:0)
	at org.apache.solr.client.solrj.impl.CloudSolrClient.directUpdate(CloudSolrClient.java:625)
	at org.apache.solr.client.solrj.impl.CloudSolrClient.sendRequest(CloudSolrClient.java:948)
	at org.apache.solr.client.solrj.impl.CloudSolrClient.requestWithRetryOnStaleState(CloudSolrClient.java:839)
	at org.apache.solr.client.solrj.impl.CloudSolrClient.request(CloudSolrClient.java:782)
	at org.apache.solr.client.solrj.SolrRequest.process(SolrRequest.java:135)
	at org.apache.solr.client.solrj.SolrClient.add(SolrClient.java:174)
	at org.apache.solr.client.solrj.SolrClient.add(SolrClient.java:139)
	at org.apache.solr.client.solrj.SolrClient.add(SolrClient.java:153)
	at org.apache.solr.cloud.RecoveryAfterSoftCommitTest.test(RecoveryAfterSoftCommitTest.java:88)
	at sun.reflect.NativeMethodAccessorImpl.invoke0(Native Method)
	at sun.reflect.NativeMethodAccessorImpl.invoke(NativeMethodAccessorImpl.java:57)
	at sun.reflect.DelegatingMethodAccessorImpl.invoke(DelegatingMethodAccessorImpl.java:43)
	at java.lang.reflect.Method.invoke(Method.java:606)
	at com.carrotsearch.randomizedtesting.RandomizedRunner.invoke(RandomizedRunner.java:1627)
	at com.carrotsearch.randomizedtesting.RandomizedRunner$6.evaluate(RandomizedRunner.java:836)
	at com.carrotsearch.randomizedtesting.RandomizedRunner$7.evaluate(RandomizedRunner.java:872)
	at com.carrotsearch.randomizedtesting.RandomizedRunner$8.evaluate(RandomizedRunner.java:886)
	at org.apache.solr.BaseDistributedSearchTestCase$ShardsRepeatRule$ShardsFixedStatement.callStatement(BaseDistributedSearchTestCase.java:960)
	at org.apache.solr.BaseDistributedSearchTestCase$ShardsRepeatRule$ShardsStatement.evaluate(BaseDistributedSearchTestCase.java:935)
	at com.carrotsearch.randomizedtesting.rules.SystemPropertiesRestoreRule$1.evaluate(SystemPropertiesRestoreRule.java:53)
	at org.apache.lucene.util.TestRuleSetupTeardownChained$1.evaluate(TestRuleSetupTeardownChained.java:50)
	at org.apache.lucene.util.AbstractBeforeAfterRule$1.evaluate(AbstractBeforeAfterRule.java:46)
	at org.apache.lucene.util.TestRuleThreadAndTestName$1.evaluate(TestRuleThreadAndTestName.java:49)
	at org.apache.lucene.util.TestRuleIgnoreAfterMaxFailures$1.evaluate(TestRuleIgnoreAfterMaxFailures.java:65)
	at org.apache.lucene.util.TestRuleMarkFailure$1.evaluate(TestRuleMarkFailure.java:48)
	at com.carrotsearch.randomizedtesting.rules.StatementAdapter.evaluate(StatementAdapter.java:36)
	at com.carrotsearch.randomizedtesting.ThreadLeakControl$StatementRunner.run(ThreadLeakControl.java:365)
	at com.carrotsearch.randomizedtesting.ThreadLeakControl.forkTimeoutingTask(ThreadLeakControl.java:798)
	at com.carrotsearch.randomizedtesting.ThreadLeakControl$3.evaluate(ThreadLeakControl.java:458)
	at com.carrotsearch.randomizedtesting.RandomizedRunner.runSingleTest(RandomizedRunner.java:845)
	at com.carrotsearch.randomizedtesting.RandomizedRunner$3.evaluate(RandomizedRunner.java:747)
	at com.carrotsearch.randomizedtesting.RandomizedRunner$4.evaluate(RandomizedRunner.java:781)
	at com.carrotsearch.randomizedtesting.RandomizedRunner$5.evaluate(RandomizedRunner.java:792)
	at com.carrotsearch.randomizedtesting.rules.StatementAdapter.evaluate(StatementAdapter.java:36)
	at com.carrotsearch.randomizedtesting.rules.SystemPropertiesRestoreRule$1.evaluate(SystemPropertiesRestoreRule.java:53)
	at org.apache.lucene.util.AbstractBeforeAfterRule$1.evaluate(AbstractBeforeAfterRule.java:46)
	at com.carrotsearch.randomizedtesting.rules.StatementAdapter.evaluate(StatementAdapter.java:36)
	at org.apache.lucene.util.TestRuleStoreClassName$1.evaluate(TestRuleStoreClassName.java:42)
	at com.carrotsearch.randomizedtesting.rules.NoShadowingOrOverridesOnMethodsRule$1.evaluate(NoShadowingOrOverridesOnMethodsRule.java:39)
	at com.carrotsearch.randomizedtesting.rules.NoShadowingOrOverridesOnMethodsRule$1.evaluate(NoShadowingOrOverridesOnMethodsRule.java:39)
	at com.carrotsearch.randomizedtesting.rules.StatementAdapter.evaluate(StatementAdapter.java:36)
	at com.carrotsearch.randomizedtesting.rules.StatementAdapter.evaluate(StatementAdapter.java:36)
	at com.carrotsearch.randomizedtesting.rules.StatementAdapter.evaluate(StatementAdapter.java:36)
	at org.apache.lucene.util.TestRuleAssertionsRequired$1.evaluate(TestRuleAssertionsRequired.java:54)
	at org.apache.lucene.util.TestRuleMarkFailure$1.evaluate(TestRuleMarkFailure.java:48)
	at org.apache.lucene.util.TestRuleIgnoreAfterMaxFailures$1.evaluate(TestRuleIgnoreAfterMaxFailures.java:65)
	at org.apache.lucene.util.TestRuleIgnoreTestSuites$1.evaluate(TestRuleIgnoreTestSuites.java:55)
	at com.carrotsearch.randomizedtesting.rules.StatementAdapter.evaluate(StatementAdapter.java:36)
	at com.carrotsearch.randomizedtesting.ThreadLeakControl$StatementRunner.run(ThreadLeakControl.java:365)
	at java.lang.Thread.run(Thread.java:745)
Caused by: org.apache.solr.client.solrj.SolrServerException: IOException occured when talking to server at: http://127.0.0.1:48539/collection1
	at org.apache.solr.client.solrj.impl.HttpSolrClient.executeMethod(HttpSolrClient.java:570)
	at org.apache.solr.client.solrj.impl.HttpSolrClient.request(HttpSolrClient.java:233)
	at org.apache.solr.client.solrj.impl.HttpSolrClient.request(HttpSolrClient.java:225)
	at org.apache.solr.client.solrj.impl.LBHttpSolrClient.doRequest(LBHttpSolrClient.java:370)
	at org.apache.solr.client.solrj.impl.LBHttpSolrClient.request(LBHttpSolrClient.java:325)
	at org.apache.solr.client.solrj.impl.CloudSolrClient.directUpdate(CloudSolrClient.java:622)
	... 49 more
Caused by: org.apache.http.NoHttpResponseException: 127.0.0.1:48539 failed to respond
	at org.apache.http.impl.conn.DefaultHttpResponseParser.parseHead(DefaultHttpResponseParser.java:143)
	at org.apache.http.impl.conn.DefaultHttpResponseParser.parseHead(DefaultHttpResponseParser.java:57)
	at org.apache.http.impl.io.AbstractMessageParser.parse(AbstractMessageParser.java:261)
	at org.apache.http.impl.AbstractHttpClientConnection.receiveResponseHeader(AbstractHttpClientConnection.java:283)
	at org.apache.http.impl.conn.DefaultClientConnection.receiveResponseHeader(DefaultClientConnection.java:251)
	at org.apache.http.impl.conn.ManagedClientConnectionImpl.receiveResponseHeader(ManagedClientConnectionImpl.java:197)
	at org.apache.http.protocol.HttpRequestExecutor.doReceiveResponse(HttpRequestExecutor.java:272)
	at org.apache.http.protocol.HttpRequestExecutor.execute(HttpRequestExecutor.java:124)
	at org.apache.http.impl.client.DefaultRequestDirector.tryExecute(DefaultRequestDirector.java:685)
	at org.apache.http.impl.client.DefaultRequestDirector.execute(DefaultRequestDirector.java:487)
	at org.apache.http.impl.client.AbstractHttpClient.doExecute(AbstractHttpClient.java:882)
	at org.apache.http.impl.client.CloseableHttpClient.execute(CloseableHttpClient.java:82)
	at org.apache.http.impl.client.CloseableHttpClient.execute(CloseableHttpClient.java:107)
	at org.apache.http.impl.client.CloseableHttpClient.execute(CloseableHttpClient.java:55)
	at org.apache.solr.client.solrj.impl.HttpSolrClient.executeMethod(HttpSolrClient.java:462)
	... 54 more


FAILED:  org.apache.solr.cloud.ReplicationFactorTest.test

Error Message:
org.apache.solr.client.solrj.SolrServerException: IOException occured when talking to server at: http://127.0.0.1:50207/zt_/rp/repfacttest_c8n_1x3_shard1_replica2

Stack Trace:
org.apache.solr.client.solrj.SolrServerException: org.apache.solr.client.solrj.SolrServerException: IOException occured when talking to server at: http://127.0.0.1:50207/zt_/rp/repfacttest_c8n_1x3_shard1_replica2
	at __randomizedtesting.SeedInfo.seed([A6DBB2D7042F4A95:2E8F8D0DAAD3276D]:0)
	at org.apache.solr.client.solrj.impl.CloudSolrClient.directUpdate(CloudSolrClient.java:625)
	at org.apache.solr.client.solrj.impl.CloudSolrClient.sendRequest(CloudSolrClient.java:948)
	at org.apache.solr.client.solrj.impl.CloudSolrClient.requestWithRetryOnStaleState(CloudSolrClient.java:839)
	at org.apache.solr.client.solrj.impl.CloudSolrClient.request(CloudSolrClient.java:782)
	at org.apache.solr.client.solrj.SolrClient.request(SolrClient.java:1220)
	at org.apache.solr.cloud.ReplicationFactorTest.sendDoc(ReplicationFactorTest.java:308)
	at org.apache.solr.cloud.ReplicationFactorTest.testRf3(ReplicationFactorTest.java:234)
	at org.apache.solr.cloud.ReplicationFactorTest.test(ReplicationFactorTest.java:113)
	at sun.reflect.NativeMethodAccessorImpl.invoke0(Native Method)
	at sun.reflect.NativeMethodAccessorImpl.invoke(NativeMethodAccessorImpl.java:57)
	at sun.reflect.DelegatingMethodAccessorImpl.invoke(DelegatingMethodAccessorImpl.java:43)
	at java.lang.reflect.Method.invoke(Method.java:606)
	at com.carrotsearch.randomizedtesting.RandomizedRunner.invoke(RandomizedRunner.java:1627)
	at com.carrotsearch.randomizedtesting.RandomizedRunner$6.evaluate(RandomizedRunner.java:836)
	at com.carrotsearch.randomizedtesting.RandomizedRunner$7.evaluate(RandomizedRunner.java:872)
	at com.carrotsearch.randomizedtesting.RandomizedRunner$8.evaluate(RandomizedRunner.java:886)
	at org.apache.solr.BaseDistributedSearchTestCase$ShardsRepeatRule$ShardsFixedStatement.callStatement(BaseDistributedSearchTestCase.java:960)
	at org.apache.solr.BaseDistributedSearchTestCase$ShardsRepeatRule$ShardsStatement.evaluate(BaseDistributedSearchTestCase.java:935)
	at com.carrotsearch.randomizedtesting.rules.SystemPropertiesRestoreRule$1.evaluate(SystemPropertiesRestoreRule.java:53)
	at org.apache.lucene.util.TestRuleSetupTeardownChained$1.evaluate(TestRuleSetupTeardownChained.java:50)
	at org.apache.lucene.util.AbstractBeforeAfterRule$1.evaluate(AbstractBeforeAfterRule.java:46)
	at org.apache.lucene.util.TestRuleThreadAndTestName$1.evaluate(TestRuleThreadAndTestName.java:49)
	at org.apache.lucene.util.TestRuleIgnoreAfterMaxFailures$1.evaluate(TestRuleIgnoreAfterMaxFailures.java:65)
	at org.apache.lucene.util.TestRuleMarkFailure$1.evaluate(TestRuleMarkFailure.java:48)
	at com.carrotsearch.randomizedtesting.rules.StatementAdapter.evaluate(StatementAdapter.java:36)
	at com.carrotsearch.randomizedtesting.ThreadLeakControl$StatementRunner.run(ThreadLeakControl.java:365)
	at com.carrotsearch.randomizedtesting.ThreadLeakControl.forkTimeoutingTask(ThreadLeakControl.java:798)
	at com.carrotsearch.randomizedtesting.ThreadLeakControl$3.evaluate(ThreadLeakControl.java:458)
	at com.carrotsearch.randomizedtesting.RandomizedRunner.runSingleTest(RandomizedRunner.java:845)
	at com.carrotsearch.randomizedtesting.RandomizedRunner$3.evaluate(RandomizedRunner.java:747)
	at com.carrotsearch.randomizedtesting.RandomizedRunner$4.evaluate(RandomizedRunner.java:781)
	at com.carrotsearch.randomizedtesting.RandomizedRunner$5.evaluate(RandomizedRunner.java:792)
	at com.carrotsearch.randomizedtesting.rules.StatementAdapter.evaluate(StatementAdapter.java:36)
	at com.carrotsearch.randomizedtesting.rules.SystemPropertiesRestoreRule$1.evaluate(SystemPropertiesRestoreRule.java:53)
	at org.apache.lucene.util.AbstractBeforeAfterRule$1.evaluate(AbstractBeforeAfterRule.java:46)
	at com.carrotsearch.randomizedtesting.rules.StatementAdapter.evaluate(StatementAdapter.java:36)
	at org.apache.lucene.util.TestRuleStoreClassName$1.evaluate(TestRuleStoreClassName.java:42)
	at com.carrotsearch.randomizedtesting.rules.NoShadowingOrOverridesOnMethodsRule$1.evaluate(NoShadowingOrOverridesOnMethodsRule.java:39)
	at com.carrotsearch.randomizedtesting.rules.NoShadowingOrOverridesOnMethodsRule$1.evaluate(NoShadowingOrOverridesOnMethodsRule.java:39)
	at com.carrotsearch.randomizedtesting.rules.StatementAdapter.evaluate(StatementAdapter.java:36)
	at com.carrotsearch.randomizedtesting.rules.StatementAdapter.evaluate(StatementAdapter.java:36)
	at com.carrotsearch.randomizedtesting.rules.StatementAdapter.evaluate(StatementAdapter.java:36)
	at org.apache.lucene.util.TestRuleAssertionsRequired$1.evaluate(TestRuleAssertionsRequired.java:54)
	at org.apache.lucene.util.TestRuleMarkFailure$1.evaluate(TestRuleMarkFailure.java:48)
	at org.apache.lucene.util.TestRuleIgnoreAfterMaxFailures$1.evaluate(TestRuleIgnoreAfterMaxFailures.java:65)
	at org.apache.lucene.util.TestRuleIgnoreTestSuites$1.evaluate(TestRuleIgnoreTestSuites.java:55)
	at com.carrotsearch.randomizedtesting.rules.StatementAdapter.evaluate(StatementAdapter.java:36)
	at com.carrotsearch.randomizedtesting.ThreadLeakControl$StatementRunner.run(ThreadLeakControl.java:365)
	at java.lang.Thread.run(Thread.java:745)
Caused by: org.apache.solr.client.solrj.SolrServerException: IOException occured when talking to server at: http://127.0.0.1:50207/zt_/rp/repfacttest_c8n_1x3_shard1_replica2
	at org.apache.solr.client.solrj.impl.HttpSolrClient.executeMethod(HttpSolrClient.java:570)
	at org.apache.solr.client.solrj.impl.HttpSolrClient.request(HttpSolrClient.java:233)
	at org.apache.solr.client.solrj.impl.HttpSolrClient.request(HttpSolrClient.java:225)
	at org.apache.solr.client.solrj.impl.LBHttpSolrClient.doRequest(LBHttpSolrClient.java:370)
	at org.apache.solr.client.solrj.impl.LBHttpSolrClient.request(LBHttpSolrClient.java:325)
	at org.apache.solr.client.solrj.impl.CloudSolrClient.directUpdate(CloudSolrClient.java:622)
	... 48 more
Caused by: org.apache.http.NoHttpResponseException: 127.0.0.1:50207 failed to respond
	at org.apache.http.impl.conn.DefaultHttpResponseParser.parseHead(DefaultHttpResponseParser.java:143)
	at org.apache.http.impl.conn.DefaultHttpResponseParser.parseHead(DefaultHttpResponseParser.java:57)
	at org.apache.http.impl.io.AbstractMessageParser.parse(AbstractMessageParser.java:261)
	at org.apache.http.impl.AbstractHttpClientConnection.receiveResponseHeader(AbstractHttpClientConnection.java:283)
	at org.apache.http.impl.conn.DefaultClientConnection.receiveResponseHeader(DefaultClientConnection.java:251)
	at org.apache.http.impl.conn.ManagedClientConnectionImpl.receiveResponseHeader(ManagedClientConnectionImpl.java:197)
	at org.apache.http.protocol.HttpRequestExecutor.doReceiveResponse(HttpRequestExecutor.java:272)
	at org.apache.http.protocol.HttpRequestExecutor.execute(HttpRequestExecutor.java:124)
	at org.apache.http.impl.client.DefaultRequestDirector.tryExecute(DefaultRequestDirector.java:685)
	at org.apache.http.impl.client.DefaultRequestDirector.execute(DefaultRequestDirector.java:487)
	at org.apache.http.impl.client.AbstractHttpClient.doExecute(AbstractHttpClient.java:882)
	at org.apache.http.impl.client.CloseableHttpClient.execute(CloseableHttpClient.java:82)
	at org.apache.http.impl.client.CloseableHttpClient.execute(CloseableHttpClient.java:107)
	at org.apache.http.impl.client.CloseableHttpClient.execute(CloseableHttpClient.java:55)
	at org.apache.solr.client.solrj.impl.HttpSolrClient.executeMethod(HttpSolrClient.java:462)
	... 53 more




Build Log:
[...truncated 9964 lines...]
   [junit4] Suite: org.apache.solr.cloud.ReplicationFactorTest
   [junit4]   2> Creating dataDir: /usr/home/jenkins/jenkins-slave/workspace/Lucene-Solr-Tests-5.x-Java7/solr/build/solr-core/test/J0/temp/solr.cloud.ReplicationFactorTest A6DBB2D7042F4A95-001/init-core-data-001
   [junit4]   2> 1132617 T2416 oas.BaseDistributedSearchTestCase.initHostContext Setting hostContext system property: /zt_/rp
   [junit4]   2> 1132621 T2416 oasc.ZkTestServer.run STARTING ZK TEST SERVER
   [junit4]   1> client port:0.0.0.0/0.0.0.0:0
   [junit4]   2> 1132622 T2417 oasc.ZkTestServer$ZKServerMain.runFromConfig Starting server
   [junit4]   2> 1132722 T2416 oasc.ZkTestServer.run start zk server on port:50202
   [junit4]   2> 1132723 T2416 oascc.SolrZkClient.createZkCredentialsToAddAutomatically Using default ZkCredentialsProvider
   [junit4]   2> 1132724 T2416 oascc.ConnectionManager.waitForConnected Waiting for client to connect to ZooKeeper
   [junit4]   2> 1132727 T2424 oascc.ConnectionManager.process Watcher org.apache.solr.common.cloud.ConnectionManager@4ffe3d82 name:ZooKeeperConnection Watcher:127.0.0.1:50202 got event WatchedEvent state:SyncConnected type:None path:null path:null type:None
   [junit4]   2> 1132727 T2416 oascc.ConnectionManager.waitForConnected Client is connected to ZooKeeper
   [junit4]   2> 1132728 T2416 oascc.SolrZkClient.createZkACLProvider Using default ZkACLProvider
   [junit4]   2> 1132728 T2416 oascc.SolrZkClient.makePath makePath: /solr
   [junit4]   2> 1132730 T2416 oascc.SolrZkClient.createZkCredentialsToAddAutomatically Using default ZkCredentialsProvider
   [junit4]   2> 1132732 T2416 oascc.ConnectionManager.waitForConnected Waiting for client to connect to ZooKeeper
   [junit4]   2> 1132733 T2427 oascc.ConnectionManager.process Watcher org.apache.solr.common.cloud.ConnectionManager@530007a8 name:ZooKeeperConnection Watcher:127.0.0.1:50202/solr got event WatchedEvent state:SyncConnected type:None path:null path:null type:None
   [junit4]   2> 1132734 T2416 oascc.ConnectionManager.waitForConnected Client is connected to ZooKeeper
   [junit4]   2> 1132734 T2416 oascc.SolrZkClient.createZkACLProvider Using default ZkACLProvider
   [junit4]   2> 1132734 T2416 oascc.SolrZkClient.makePath makePath: /collections/collection1
   [junit4]   2> 1132737 T2416 oascc.SolrZkClient.makePath makePath: /collections/collection1/shards
   [junit4]   2> 1132738 T2416 oascc.SolrZkClient.makePath makePath: /collections/control_collection
   [junit4]   2> 1132740 T2416 oascc.SolrZkClient.makePath makePath: /collections/control_collection/shards
   [junit4]   2> 1132742 T2416 oasc.AbstractZkTestCase.putConfig put /usr/home/jenkins/jenkins-slave/workspace/Lucene-Solr-Tests-5.x-Java7/solr/core/src/test-files/solr/collection1/conf/solrconfig-tlog.xml to /configs/conf1/solrconfig.xml
   [junit4]   2> 1132743 T2416 oascc.SolrZkClient.makePath makePath: /configs/conf1/solrconfig.xml
   [junit4]   2> 1132745 T2416 oasc.AbstractZkTestCase.putConfig put /usr/home/jenkins/jenkins-slave/workspace/Lucene-Solr-Tests-5.x-Java7/solr/core/src/test-files/solr/collection1/conf/schema.xml to /configs/conf1/schema.xml
   [junit4]   2> 1132746 T2416 oascc.SolrZkClient.makePath makePath: /configs/conf1/schema.xml
   [junit4]   2> 1132848 T2416 oasc.AbstractZkTestCase.putConfig put /usr/home/jenkins/jenkins-slave/workspace/Lucene-Solr-Tests-5.x-Java7/solr/core/src/test-files/solr/collection1/conf/solrconfig.snippet.randomindexconfig.xml to /configs/conf1/solrconfig.snippet.randomindexconfig.xml
   [junit4]   2> 1132849 T2416 oascc.SolrZkClient.makePath makePath: /configs/conf1/solrconfig.snippet.randomindexconfig.xml
   [junit4]   2> 1132850 T2416 oasc.AbstractZkTestCase.putConfig put /usr/home/jenkins/jenkins-slave/workspace/Lucene-Solr-Tests-5.x-Java7/solr/core/src/test-files/solr/collection1/conf/stopwords.txt to /configs/conf1/stopwords.txt
   [junit4]   2> 1132851 T2416 oascc.SolrZkClient.makePath makePath: /configs/conf1/stopwords.txt
   [junit4]   2> 1132852 T2416 oasc.AbstractZkTestCase.putConfig put /usr/home/jenkins/jenkins-slave/workspace/Lucene-Solr-Tests-5.x-Java7/solr/core/src/test-files/solr/collection1/conf/protwords.txt to /configs/conf1/protwords.txt
   [junit4]   2> 1132853 T2416 oascc.SolrZkClient.makePath makePath: /configs/conf1/protwords.txt
   [junit4]   2> 1132854 T2416 oasc.AbstractZkTestCase.putConfig put /usr/home/jenkins/jenkins-slave/workspace/Lucene-Solr-Tests-5.x-Java7/solr/core/src/test-files/solr/collection1/conf/currency.xml to /configs/conf1/currency.xml
   [junit4]   2> 1132855 T2416 oascc.SolrZkClient.makePath makePath: /configs/conf1/currency.xml
   [junit4]   2> 1132856 T2416 oasc.AbstractZkTestCase.putConfig put /usr/home/jenkins/jenkins-slave/workspace/Lucene-Solr-Tests-5.x-Java7/solr/core/src/test-files/solr/collection1/conf/enumsConfig.xml to /configs/conf1/enumsConfig.xml
   [junit4]   2> 1132857 T2416 oascc.SolrZkClient.makePath makePath: /configs/conf1/enumsConfig.xml
   [junit4]   2> 1132858 T2416 oasc.AbstractZkTestCase.putConfig put /usr/home/jenkins/jenkins-slave/workspace/Lucene-Solr-Tests-5.x-Java7/solr/core/src/test-files/solr/collection1/conf/open-exchange-rates.json to /configs/conf1/open-exchange-rates.json
   [junit4]   2> 1132859 T2416 oascc.SolrZkClient.makePath makePath: /configs/conf1/open-exchange-rates.json
   [junit4]   2> 1132860 T2416 oasc.AbstractZkTestCase.putConfig put /usr/home/jenkins/jenkins-slave/workspace/Lucene-Solr-Tests-5.x-Java7/solr/core/src/test-files/solr/collection1/conf/mapping-ISOLatin1Accent.txt to /configs/conf1/mapping-ISOLatin1Accent.txt
   [junit4]   2> 1132861 T2416 oascc.SolrZkClient.makePath makePath: /configs/conf1/mapping-ISOLatin1Accent.txt
   [junit4]   2> 1132862 T2416 oasc.AbstractZkTestCase.putConfig put /usr/home/jenkins/jenkins-slave/workspace/Lucene-Solr-Tests-5.x-Java7/solr/core/src/test-files/solr/collection1/conf/old_synonyms.txt to /configs/conf1/old_synonyms.txt
   [junit4]   2> 1132863 T2416 oascc.SolrZkClient.makePath makePath: /configs/conf1/old_synonyms.txt
   [junit4]   2> 1132864 T2416 oasc.AbstractZkTestCase.putConfig put /usr/home/jenkins/jenkins-slave/workspace/Lucene-Solr-Tests-5.x-Java7/solr/core/src/test-files/solr/collection1/conf/synonyms.txt to /configs/conf1/synonyms.txt
   [junit4]   2> 1132865 T2416 oascc.SolrZkClient.makePath makePath: /configs/conf1/synonyms.txt
   [junit4]   2> 1134404 T2416 oas.SolrTestCaseJ4.writeCoreProperties Writing core.properties file to /usr/home/jenkins/jenkins-slave/workspace/Lucene-Solr-Tests-5.x-Java7/solr/build/solr-core/test/J0/temp/solr.cloud.ReplicationFactorTest A6DBB2D7042F4A95-001/control-001/cores/collection1
   [junit4]   2> 1134406 T2416 oejs.Server.doStart jetty-8.1.10.v20130312
   [junit4]   2> 1134410 T2416 oejs.AbstractConnector.doStart Started SocketConnector@127.0.0.1:50208
   [junit4]   2> 1134410 T2416 oascse.JettySolrRunner$1.lifeCycleStarted Jetty properties: {hostContext=/zt_/rp, coreRootDirectory=/usr/home/jenkins/jenkins-slave/workspace/Lucene-Solr-Tests-5.x-Java7/solr/build/solr-core/test/J0/temp/solr.cloud.ReplicationFactorTest A6DBB2D7042F4A95-001/control-001/cores, solr.data.dir=/usr/home/jenkins/jenkins-slave/workspace/Lucene-Solr-Tests-5.x-Java7/solr/build/solr-core/test/J0/temp/solr.cloud.ReplicationFactorTest A6DBB2D7042F4A95-001/tempDir-001/control/data, hostPort=50207}
   [junit4]   2> 1134411 T2416 oass.SolrDispatchFilter.init SolrDispatchFilter.init()sun.misc.Launcher$AppClassLoader@631d75b9
   [junit4]   2> 1134411 T2416 oasc.SolrResourceLoader.<init> new SolrResourceLoader for directory: '/usr/home/jenkins/jenkins-slave/workspace/Lucene-Solr-Tests-5.x-Java7/solr/build/solr-core/test/J0/temp/solr.cloud.ReplicationFactorTest A6DBB2D7042F4A95-001/control-001/'
   [junit4]   2> 1134444 T2416 oasc.SolrXmlConfig.fromFile Loading container configuration from /usr/home/jenkins/jenkins-slave/workspace/Lucene-Solr-Tests-5.x-Java7/solr/build/solr-core/test/J0/temp/solr.cloud.ReplicationFactorTest A6DBB2D7042F4A95-001/control-001/solr.xml
   [junit4]   2> 1134486 T2416 oasc.CorePropertiesLocator.<init> Config-defined core root directory: /usr/home/jenkins/jenkins-slave/workspace/Lucene-Solr-Tests-5.x-Java7/solr/build/solr-core/test/J0/temp/solr.cloud.ReplicationFactorTest A6DBB2D7042F4A95-001/control-001/cores
   [junit4]   2> 1134486 T2416 oasc.CoreContainer.<init> New CoreContainer 1897583399
   [junit4]   2> 1134486 T2416 oasc.CoreContainer.load Loading cores into CoreContainer [instanceDir=/usr/home/jenkins/jenkins-slave/workspace/Lucene-Solr-Tests-5.x-Java7/solr/build/solr-core/test/J0/temp/solr.cloud.ReplicationFactorTest A6DBB2D7042F4A95-001/control-001/]
   [junit4]   2> 1134486 T2416 oasc.CoreContainer.load loading shared library: /usr/home/jenkins/jenkins-slave/workspace/Lucene-Solr-Tests-5.x-Java7/solr/build/solr-core/test/J0/temp/solr.cloud.ReplicationFactorTest A6DBB2D7042F4A95-001/control-001/lib
   [junit4]   2> 1134487 T2416 oasc.SolrResourceLoader.addToClassLoader WARN Can't find (or read) directory to add to classloader: lib (resolved as: /usr/home/jenkins/jenkins-slave/workspace/Lucene-Solr-Tests-5.x-Java7/solr/build/solr-core/test/J0/temp/solr.cloud.ReplicationFactorTest A6DBB2D7042F4A95-001/control-001/lib).
   [junit4]   2> 1134497 T2416 oashc.HttpShardHandlerFactory.getParameter Setting socketTimeout to: 90000
   [junit4]   2> 1134497 T2416 oashc.HttpShardHandlerFactory.getParameter Setting urlScheme to: 
   [junit4]   2> 1134497 T2416 oashc.HttpShardHandlerFactory.getParameter Setting connTimeout to: 15000
   [junit4]   2> 1134497 T2416 oashc.HttpShardHandlerFactory.getParameter Setting maxConnectionsPerHost to: 20
   [junit4]   2> 1134497 T2416 oashc.HttpShardHandlerFactory.getParameter Setting maxConnections to: 10000
   [junit4]   2> 1134498 T2416 oashc.HttpShardHandlerFactory.getParameter Setting corePoolSize to: 0
   [junit4]   2> 1134498 T2416 oashc.HttpShardHandlerFactory.getParameter Setting maximumPoolSize to: 2147483647
   [junit4]   2> 1134498 T2416 oashc.HttpShardHandlerFactory.getParameter Setting maxThreadIdleTime to: 5
   [junit4]   2> 1134498 T2416 oashc.HttpShardHandlerFactory.getParameter Setting sizeOfQueue to: -1
   [junit4]   2> 1134499 T2416 oashc.HttpShardHandlerFactory.getParameter Setting fairnessPolicy to: false
   [junit4]   2> 1134499 T2416 oashc.HttpShardHandlerFactory.getParameter Setting useRetries to: false
   [junit4]   2> 1134504 T2416 oasu.UpdateShardHandler.<init> Creating UpdateShardHandler HTTP client with params: socketTimeout=340000&connTimeout=45000&retry=true
   [junit4]   2> 1134505 T2416 oasl.LogWatcher.createWatcher SLF4J impl is org.slf4j.impl.Log4jLoggerFactory
   [junit4]   2> 1134505 T2416 oasl.LogWatcher.newRegisteredLogWatcher Registering Log Listener [Log4j (org.slf4j.impl.Log4jLoggerFactory)]
   [junit4]   2> 1134505 T2416 oasc.CoreContainer.load Node Name: 127.0.0.1
   [junit4]   2> 1134506 T2416 oasc.ZkContainer.initZooKeeper Zookeeper client=127.0.0.1:50202/solr
   [junit4]   2> 1134506 T2416 oasc.ZkController.checkChrootPath zkHost includes chroot
   [junit4]   2> 1134506 T2416 oascc.SolrZkClient.createZkCredentialsToAddAutomatically Using default ZkCredentialsProvider
   [junit4]   2> 1134507 T2416 oascc.ConnectionManager.waitForConnected Waiting for client to connect to ZooKeeper
   [junit4]   2> 1134508 T2439 oascc.ConnectionManager.process Watcher org.apache.solr.common.cloud.ConnectionManager@39533a61 name:ZooKeeperConnection Watcher:127.0.0.1:50202 got event WatchedEvent state:SyncConnected type:None path:null path:null type:None
   [junit4]   2> 1134509 T2416 oascc.ConnectionManager.waitForConnected Client is connected to ZooKeeper
   [junit4]   2> 1134510 T2416 oascc.SolrZkClient.createZkACLProvider Using default ZkACLProvider
   [junit4]   2> 1134511 T2416 oascc.ConnectionManager.waitForConnected Waiting for client to connect to ZooKeeper
   [junit4]   2> 1134512 T2442 oascc.ConnectionManager.process Watcher org.apache.solr.common.cloud.ConnectionManager@5211b59d name:ZooKeeperConnection Watcher:127.0.0.1:50202/solr got event WatchedEvent state:SyncConnected type:None path:null path:null type:None
   [junit4]   2> 1134513 T2416 oascc.ConnectionManager.waitForConnected Client is connected to ZooKeeper
   [junit4]   2> 1134514 T2416 oascc.SolrZkClient.makePath makePath: /overseer/queue
   [junit4]   2> 1134516 T2416 oascc.SolrZkClient.makePath makePath: /overseer/collection-queue-work
   [junit4]   2> 1134517 T2416 oascc.SolrZkClient.makePath makePath: /overseer/collection-map-running
   [junit4]   2> 1134519 T2416 oascc.SolrZkClient.makePath makePath: /overseer/collection-map-completed
   [junit4]   2> 1134520 T2416 oascc.SolrZkClient.makePath makePath: /overseer/collection-map-failure
   [junit4]   2> 1134522 T2416 oascc.SolrZkClient.makePath makePath: /live_nodes
   [junit4]   2> 1134523 T2416 oascc.SolrZkClient.makePath makePath: /aliases.json
   [junit4]   2> 1134524 T2416 oascc.SolrZkClient.makePath makePath: /clusterstate.json
   [junit4]   2> 1134525 T2416 oasc.ZkController.createEphemeralLiveNode Register node as live in ZooKeeper:/live_nodes/127.0.0.1:50207_zt_%2Frp
   [junit4]   2> 1134525 T2416 oascc.SolrZkClient.makePath makePath: /live_nodes/127.0.0.1:50207_zt_%2Frp
   [junit4]   2> 1134526 T2416 oascc.SolrZkClient.makePath makePath: /overseer_elect
   [junit4]   2> 1134527 T2416 oascc.SolrZkClient.makePath makePath: /overseer_elect/election
   [junit4]   2> 1134528 T2416 oasc.Overseer.close Overseer (id=null) closing
   [junit4]   2> 1134529 T2416 oasc.OverseerElectionContext.runLeaderProcess I am going to be the leader 127.0.0.1:50207_zt_%2Frp
   [junit4]   2> 1134529 T2416 oascc.SolrZkClient.makePath makePath: /overseer_elect/leader
   [junit4]   2> 1134530 T2416 oasc.Overseer.start Overseer (id=93602473946251267-127.0.0.1:50207_zt_%2Frp-n_0000000000) starting
   [junit4]   2> 1134532 T2416 oascc.SolrZkClient.makePath makePath: /overseer/queue-work
   [junit4]   2> 1134536 T2416 oasc.OverseerAutoReplicaFailoverThread.<init> Starting OverseerAutoReplicaFailoverThread autoReplicaFailoverWorkLoopDelay=10000 autoReplicaFailoverWaitAfterExpiration=30000 autoReplicaFailoverBadNodeExpiration=60000
   [junit4]   2> 1134536 T2444 oasc.OverseerCollectionProcessor.run Process current queue of collection creations
   [junit4]   2> 1134536 T2416 oascc.ZkStateReader.createClusterStateWatchersAndUpdate Updating cluster state from ZooKeeper... 
   [junit4]   2> 1134536 T2443 oasc.Overseer$ClusterStateUpdater.run Starting to work on the main queue
   [junit4]   2> 1134539 T2416 oasc.CorePropertiesLocator.discover Looking for core definitions underneath /usr/home/jenkins/jenkins-slave/workspace/Lucene-Solr-Tests-5.x-Java7/solr/build/solr-core/test/J0/temp/solr.cloud.ReplicationFactorTest A6DBB2D7042F4A95-001/control-001/cores
   [junit4]   2> 1134542 T2416 oasc.CoreDescriptor.<init> CORE DESCRIPTOR: {dataDir=data/, absoluteInstDir=/usr/home/jenkins/jenkins-slave/workspace/Lucene-Solr-Tests-5.x-Java7/solr/build/solr-core/test/J0/temp/solr.cloud.ReplicationFactorTest A6DBB2D7042F4A95-001/control-001/cores/collection1/, coreNodeName=, instanceDir=/usr/home/jenkins/jenkins-slave/workspace/Lucene-Solr-Tests-5.x-Java7/solr/build/solr-core/test/J0/temp/solr.cloud.ReplicationFactorTest A6DBB2D7042F4A95-001/control-001/cores/collection1, shard=, name=collection1, config=solrconfig.xml, transient=false, loadOnStartup=true, collection=control_collection, schema=schema.xml}
   [junit4]   2> 1134542 T2416 oasc.CorePropertiesLocator.discoverUnder Found core collection1 in /usr/home/jenkins/jenkins-slave/workspace/Lucene-Solr-Tests-5.x-Java7/solr/build/solr-core/test/J0/temp/solr.cloud.ReplicationFactorTest A6DBB2D7042F4A95-001/control-001/cores/collection1/
   [junit4]   2> 1134542 T2416 oasc.CorePropertiesLocator.discover Found 1 core definitions
   [junit4]   2> 1134543 T2446 C:control_collection c:collection1 oasc.ZkController.publish publishing core=collection1 state=down collection=control_collection
   [junit4]   2> 1134543 T2446 C:control_collection c:collection1 oasc.ZkController.publish numShards not found on descriptor - reading it from system property
   [junit4]   2> 1134544 T2446 C:control_collection c:collection1 oasc.ZkController.waitForCoreNodeName look for our core node name
   [junit4]   2> 1134544 T2442 oasc.DistributedQueue$LatchWatcher.process NodeChildrenChanged fired on path /overseer/queue state SyncConnected
   [junit4]   2> 1134544 T2443 oasc.Overseer$ClusterStateUpdater.run processMessage: queueSize: 1, message = {
   [junit4]   2> 	  "base_url":"http://127.0.0.1:50207/zt_/rp",
   [junit4]   2> 	  "core":"collection1",
   [junit4]   2> 	  "node_name":"127.0.0.1:50207_zt_%2Frp",
   [junit4]   2> 	  "numShards":"1",
   [junit4]   2> 	  "state":"down",
   [junit4]   2> 	  "operation":"state",
   [junit4]   2> 	  "collection":"control_collection",
   [junit4]   2> 	  "roles":null,
   [junit4]   2> 	  "shard":null} current state version: 0
   [junit4]   2> 1134545 T2443 oasco.ReplicaMutator.updateState Update state numShards=1 message={
   [junit4]   2> 	  "base_url":"http://127.0.0.1:50207/zt_/rp",
   [junit4]   2> 	  "core":"collection1",
   [junit4]   2> 	  "node_name":"127.0.0.1:50207_zt_%2Frp",
   [junit4]   2> 	  "numShards":"1",
   [junit4]   2> 	  "state":"down",
   [junit4]   2> 	  "operation":"state",
   [junit4]   2> 	  "collection":"control_collection",
   [junit4]   2> 	  "roles":null,
   [junit4]   2> 	  "shard":null}
   [junit4]   2> 1134545 T2443 oasco.ClusterStateMutator.createCollection building a new cName: control_collection
   [junit4]   2> 1134545 T2443 oasco.ReplicaMutator.updateState Assigning new node to shard shard=shard1
   [junit4]   2> 1134546 T2442 oascc.ZkStateReader$2.process A cluster state change: WatchedEvent state:SyncConnected type:NodeDataChanged path:/clusterstate.json, has occurred - updating... (live nodes size: 1)
   [junit4]   2> 1135545 T2446 C:control_collection c:collection1 oasc.ZkController.waitForShardId waiting to find shard id in clusterstate for collection1
   [junit4]   2> 1135545 T2446 C:control_collection c:collection1 oasc.ZkController.createCollectionZkNode Check for collection zkNode:control_collection
   [junit4]   2> 1135546 T2446 C:control_collection c:collection1 oasc.ZkController.createCollectionZkNode Collection zkNode exists
   [junit4]   2> 1135546 T2446 C:control_collection c:collection1 oascc.ZkStateReader.readConfigName Load collection config from:/collections/control_collection
   [junit4]   2> 1135547 T2446 C:control_collection c:collection1 oascc.ZkStateReader.readConfigName path=/collections/control_collection configName=conf1 specified config exists in ZooKeeper
   [junit4]   2> 1135547 T2446 C:control_collection c:collection1 oasc.SolrResourceLoader.<init> new SolrResourceLoader for directory: '/usr/home/jenkins/jenkins-slave/workspace/Lucene-Solr-Tests-5.x-Java7/solr/build/solr-core/test/J0/temp/solr.cloud.ReplicationFactorTest A6DBB2D7042F4A95-001/control-001/cores/collection1/'
   [junit4]   2> 1135567 T2446 C:control_collection c:collection1 oasc.ZkController.watchZKConfDir watch zkdir /configs/conf1
   [junit4]   2> 1135569 T2446 C:control_collection c:collection1 oasc.Config.<init> loaded config solrconfig.xml with version 0 
   [junit4]   2> 1135580 T2446 C:control_collection c:collection1 oasc.SolrConfig.refreshRequestParams current version of requestparams : -1
   [junit4]   2> 1135603 T2446 C:control_collection c:collection1 oasc.SolrConfig.<init> Using Lucene MatchVersion: 5.2.0
   [junit4]   2> 1135666 T2446 C:control_collection c:collection1 oasc.SolrConfig.<init> Loaded SolrConfig: solrconfig.xml
   [junit4]   2> 1135768 T2446 C:control_collection c:collection1 oass.IndexSchema.readSchema Reading Solr Schema from /configs/conf1/schema.xml
   [junit4]   2> 1135778 T2446 C:control_collection c:collection1 oass.IndexSchema.readSchema [collection1] Schema name=test
   [junit4]   2> 1136280 T2446 C:control_collection c:collection1 oass.OpenExchangeRatesOrgProvider.init Initialized with rates=open-exchange-rates.json, refreshInterval=1440.
   [junit4]   2> 1136299 T2446 C:control_collection c:collection1 oass.IndexSchema.readSchema default search field in schema is text
   [junit4]   2> 1136302 T2446 C:control_collection c:collection1 oass.IndexSchema.readSchema unique key field: id
   [junit4]   2> 1136313 T2446 C:control_collection c:collection1 oass.FileExchangeRateProvider.reload Reloading exchange rates from file currency.xml
   [junit4]   2> 1136318 T2446 C:control_collection c:collection1 oass.FileExchangeRateProvider.reload Reloading exchange rates from file currency.xml
   [junit4]   2> 1136323 T2446 C:control_collection c:collection1 oass.OpenExchangeRatesOrgProvider.reload Reloading exchange rates from open-exchange-rates.json
   [junit4]   2> 1136323 T2446 C:control_collection c:collection1 oass.OpenExchangeRatesOrgProvider$OpenExchangeRates.<init> WARN Unknown key IMPORTANT NOTE
   [junit4]   2> 1136324 T2446 C:control_collection c:collection1 oass.OpenExchangeRatesOrgProvider$OpenExchangeRates.<init> WARN Expected key, got STRING
   [junit4]   2> 1136324 T2446 C:control_collection c:collection1 oass.OpenExchangeRatesOrgProvider.reload Reloading exchange rates from open-exchange-rates.json
   [junit4]   2> 1136325 T2446 C:control_collection c:collection1 oass.OpenExchangeRatesOrgProvider$OpenExchangeRates.<init> WARN Unknown key IMPORTANT NOTE
   [junit4]   2> 1136325 T2446 C:control_collection c:collection1 oass.OpenExchangeRatesOrgProvider$OpenExchangeRates.<init> WARN Expected key, got STRING
   [junit4]   2> 1136325 T2446 C:control_collection c:collection1 oasc.CoreContainer.create Creating SolrCore 'collection1' using configuration from collection control_collection
   [junit4]   2> 1136325 T2446 C:control_collection c:collection1 oasc.SolrCore.initDirectoryFactory org.apache.solr.core.MockDirectoryFactory
   [junit4]   2> 1136326 T2446 C:control_collection c:collection1 oasc.SolrCore.<init> [collection1] Opening new SolrCore at /usr/home/jenkins/jenkins-slave/workspace/Lucene-Solr-Tests-5.x-Java7/solr/build/solr-core/test/J0/temp/solr.cloud.ReplicationFactorTest A6DBB2D7042F4A95-001/control-001/cores/collection1/, dataDir=/usr/home/jenkins/jenkins-slave/workspace/Lucene-Solr-Tests-5.x-Java7/solr/build/solr-core/test/J0/temp/solr.cloud.ReplicationFactorTest A6DBB2D7042F4A95-001/control-001/cores/collection1/data/
   [junit4]   2> 1136326 T2446 C:control_collection c:collection1 oasc.JmxMonitoredMap.<init> JMX monitoring is enabled. Adding Solr mbeans to JMX Server: com.sun.jmx.mbeanserver.JmxMBeanServer@143d13d6
   [junit4]   2> 1136327 T2446 C:control_collection c:collection1 oasc.CachingDirectoryFactory.get return new directory for /usr/home/jenkins/jenkins-slave/workspace/Lucene-Solr-Tests-5.x-Java7/solr/build/solr-core/test/J0/temp/solr.cloud.ReplicationFactorTest A6DBB2D7042F4A95-001/control-001/cores/collection1/data
   [junit4]   2> 1136327 T2446 C:control_collection c:collection1 oasc.SolrCore.getNewIndexDir New index directory detected: old=null new=/usr/home/jenkins/jenkins-slave/workspace/Lucene-Solr-Tests-5.x-Java7/solr/build/solr-core/test/J0/temp/solr.cloud.ReplicationFactorTest A6DBB2D7042F4A95-001/control-001/cores/collection1/data/index/
   [junit4]   2> 1136327 T2446 C:control_collection c:collection1 oasc.SolrCore.initIndex WARN [collection1] Solr index directory '/usr/home/jenkins/jenkins-slave/workspace/Lucene-Solr-Tests-5.x-Java7/solr/build/solr-core/test/J0/temp/solr.cloud.ReplicationFactorTest A6DBB2D7042F4A95-001/control-001/cores/collection1/data/index' doesn't exist. Creating new index...
   [junit4]   2> 1136328 T2446 C:control_collection c:collection1 oasc.CachingDirectoryFactory.get return new directory for /usr/home/jenkins/jenkins-slave/workspace/Lucene-Solr-Tests-5.x-Java7/solr/build/solr-core/test/J0/temp/solr.cloud.ReplicationFactorTest A6DBB2D7042F4A95-001/control-001/cores/collection1/data/index
   [junit4]   2> 1136328 T2446 C:control_collection c:collection1 oasu.RandomMergePolicy.<init> RandomMergePolicy wrapping class org.apache.lucene.index.TieredMergePolicy: [TieredMergePolicy: maxMergeAtOnce=34, maxMergeAtOnceExplicit=38, maxMergedSegmentMB=57.4541015625, floorSegmentMB=0.5546875, forceMergeDeletesPctAllowed=5.22780806596198, segmentsPerTier=18.0, maxCFSSegmentSizeMB=8.796093022207999E12, noCFSRatio=0.19405204540464516
   [junit4]   2> 1136329 T2446 C:control_collection c:collection1 oasc.SolrDeletionPolicy.onCommit SolrDeletionPolicy.onCommit: commits: num=1
   [junit4]   2> 		commit{dir=MockDirectoryWrapper(RAMDirectory@34e08c6c lockFactory=org.apache.lucene.store.SingleInstanceLockFactory@2232193),segFN=segments_1,generation=1}
   [junit4]   2> 1136329 T2446 C:control_collection c:collection1 oasc.SolrDeletionPolicy.updateCommits newest commit generation = 1
   [junit4]   2> 1136335 T2446 C:control_collection c:collection1 oasup.UpdateRequestProcessorChain.init creating updateRequestProcessorChain "nodistrib"
   [junit4]   2> 1136335 T2446 C:control_collection c:collection1 oasup.UpdateRequestProcessorChain.init creating updateRequestProcessorChain "dedupe"
   [junit4]   2> 1136336 T2446 C:control_collection c:collection1 oasup.UpdateRequestProcessorChain.init inserting DistributedUpdateProcessorFactory into updateRequestProcessorChain "dedupe"
   [junit4]   2> 1136336 T2446 C:control_collection c:collection1 oasup.UpdateRequestProcessorChain.init creating updateRequestProcessorChain "stored_sig"
   [junit4]   2> 1136336 T2446 C:control_collection c:collection1 oasup.UpdateRequestProcessorChain.init inserting DistributedUpdateProcessorFactory into updateRequestProcessorChain "stored_sig"
   [junit4]   2> 1136336 T2446 C:control_collection c:collection1 oasup.UpdateRequestProcessorChain.init creating updateRequestProcessorChain "distrib-dup-test-chain-explicit"
   [junit4]   2> 1136337 T2446 C:control_collection c:collection1 oasup.UpdateRequestProcessorChain.init creating updateRequestProcessorChain "distrib-dup-test-chain-implicit"
   [junit4]   2> 1136337 T2446 C:control_collection c:collection1 oasup.UpdateRequestProcessorChain.init inserting DistributedUpdateProcessorFactory into updateRequestProcessorChain "distrib-dup-test-chain-implicit"
   [junit4]   2> 1136337 T2446 C:control_collection c:collection1 oasc.SolrCore.loadUpdateProcessorChains no updateRequestProcessorChain defined as default, creating implicit default
   [junit4]   2> 1136365 T2446 C:control_collection c:collection1 oashl.XMLLoader.init xsltCacheLifetimeSeconds=60
   [junit4]   2> 1136368 T2446 C:control_collection c:collection1 oashl.XMLLoader.init xsltCacheLifetimeSeconds=60
   [junit4]   2> 1136370 T2446 C:control_collection c:collection1 oashl.XMLLoader.init xsltCacheLifetimeSeconds=60
   [junit4]   2> 1136373 T2446 C:control_collection c:collection1 oashl.XMLLoader.init xsltCacheLifetimeSeconds=60
   [junit4]   2> 1136378 T2446 C:control_collection c:collection1 oasc.RequestHandlers.initHandlersFromConfig Registered paths: /admin/system,/admin/logging,/update/csv,/update,/admin/plugins,/update/json,/admin/file,/get,standard,/admin/mbeans,/replication,/admin/threads,/config,/admin/segments,/admin/luke,/admin/properties,/schema,/admin/ping,/update/json/docs
   [junit4]   2> 1136381 T2446 C:control_collection c:collection1 oasc.SolrCore.initStatsCache Using default statsCache cache: org.apache.solr.search.stats.LocalStatsCache
   [junit4]   2> 1136383 T2446 C:control_collection c:collection1 oasu.UpdateHandler.<init> Using UpdateLog implementation: org.apache.solr.update.UpdateLog
   [junit4]   2> 1136383 T2446 C:control_collection c:collection1 oasu.UpdateLog.init Initializing UpdateLog: dataDir= defaultSyncLevel=FLUSH numRecordsToKeep=100 maxNumLogsToKeep=10
   [junit4]   2> 1136385 T2446 C:control_collection c:collection1 oasu.CommitTracker.<init> Hard AutoCommit: disabled
   [junit4]   2> 1136385 T2446 C:control_collection c:collection1 oasu.CommitTracker.<init> Soft AutoCommit: disabled
   [junit4]   2> 1136386 T2446 C:control_collection c:collection1 oasu.RandomMergePolicy.<init> RandomMergePolicy wrapping class org.apache.lucene.index.TieredMergePolicy: [TieredMergePolicy: maxMergeAtOnce=21, maxMergeAtOnceExplicit=36, maxMergedSegmentMB=22.39453125, floorSegmentMB=1.7548828125, forceMergeDeletesPctAllowed=9.803215846184616, segmentsPerTier=36.0, maxCFSSegmentSizeMB=8.796093022207999E12, noCFSRatio=0.0
   [junit4]   2> 1136387 T2446 C:control_collection c:collection1 oasc.SolrDeletionPolicy.onInit SolrDeletionPolicy.onInit: commits: num=1
   [junit4]   2> 		commit{dir=MockDirectoryWrapper(RAMDirectory@34e08c6c lockFactory=org.apache.lucene.store.SingleInstanceLockFactory@2232193),segFN=segments_1,generation=1}
   [junit4]   2> 1136387 T2446 C:control_collection c:collection1 oasc.SolrDeletionPolicy.updateCommits newest commit generation = 1
   [junit4]   2> 1136387 T2446 C:control_collection c:collection1 oass.SolrIndexSearcher.<init> Opening Searcher@2929af9d[collection1] main
   [junit4]   2> 1136388 T2446 C:control_collection c:collection1 oascc.ZkStateReader.readConfigName Load collection config from:/collections/control_collection
   [junit4]   2> 1136388 T2446 C:control_collection c:collection1 oascc.ZkStateReader.readConfigName path=/collections/control_collection configName=conf1 specified config exists in ZooKeeper
   [junit4]   2> 1136389 T2446 C:control_collection c:collection1 oasr.ManagedResourceStorage.newStorageIO Setting up ZooKeeper-based storage for the RestManager with znodeBase: /configs/conf1
   [junit4]   2> 1136389 T2446 C:control_collection c:collection1 oasr.ManagedResourceStorage$ZooKeeperStorageIO.configure Configured ZooKeeperStorageIO with znodeBase: /configs/conf1
   [junit4]   2> 1136389 T2446 C:control_collection c:collection1 oasr.RestManager.init Initializing RestManager with initArgs: {}
   [junit4]   2> 1136390 T2446 C:control_collection c:collection1 oasr.ManagedResourceStorage.load Reading _rest_managed.json using ZooKeeperStorageIO:path=/configs/conf1
   [junit4]   2> 1136390 T2446 C:control_collection c:collection1 oasr.ManagedResourceStorage$ZooKeeperStorageIO.openInputStream No data found for znode /configs/conf1/_rest_managed.json
   [junit4]   2> 1136390 T2446 C:control_collection c:collection1 oasr.ManagedResourceStorage.load Loaded null at path _rest_managed.json using ZooKeeperStorageIO:path=/configs/conf1
   [junit4]   2> 1136391 T2446 C:control_collection c:collection1 oasr.RestManager.init Initializing 0 registered ManagedResources
   [junit4]   2> 1136391 T2446 C:control_collection c:collection1 oash.ReplicationHandler.inform Commits will be reserved for  10000
   [junit4]   2> 1136392 T2447 C:control_collection c:collection1 oasc.SolrCore.registerSearcher [collection1] Registered new searcher Searcher@2929af9d[collection1] main{ExitableDirectoryReader(UninvertingDirectoryReader())}
   [junit4]   2> 1136392 T2446 C:control_collection c:collection1 oasc.CoreContainer.registerCore registering core: collection1
   [junit4]   2> 1136393 T2450 C:control_collection S:shard1 oasc.ZkController.register Register replica - core:collection1 address:http://127.0.0.1:50207/zt_/rp collection:control_collection shard:shard1
   [junit4]   2> 1136393 T2416 oass.SolrDispatchFilter.init user.dir=/usr/home/jenkins/jenkins-slave/workspace/Lucene-Solr-Tests-5.x-Java7/solr/build/solr-core/test/J0
   [junit4]   2> 1136394 T2416 oass.SolrDispatchFilter.init SolrDispatchFilter.init() done
   [junit4]   2> 1136394 T2450 C:control_collection S:shard1 oascc.SolrZkClient.makePath makePath: /collections/control_collection/leader_elect/shard1/election
   [junit4]   2> 1136396 T2416 oascc.SolrZkClient.createZkCredentialsToAddAutomatically Using default ZkCredentialsProvider
   [junit4]   2> 1136396 T2416 oascc.ConnectionManager.waitForConnected Waiting for client to connect to ZooKeeper
   [junit4]   2> 1136398 T2454 oascc.ConnectionManager.process Watcher org.apache.solr.common.cloud.ConnectionManager@688cf5a5 name:ZooKeeperConnection Watcher:127.0.0.1:50202/solr got event WatchedEvent state:SyncConnected type:None path:null path:null type:None
   [junit4]   2> 1136398 T2416 oascc.ConnectionManager.waitForConnected Client is connected to ZooKeeper
   [junit4]   2> 1136398 T2450 C:control_collection S:shard1 oasc.ShardLeaderElectionContext.runLeaderProcess Running the leader process for shard shard1
   [junit4]   2> 1136398 T2416 oascc.SolrZkClient.createZkACLProvider Using default ZkACLProvider
   [junit4]   2> 1136399 T2416 oascc.ZkStateReader.createClusterStateWatchersAndUpdate Updating cluster state from ZooKeeper... 
   [junit4]   2> 1136400 T2442 oasc.DistributedQueue$LatchWatcher.process NodeChildrenChanged fired on path /overseer/queue state SyncConnected
   [junit4]   2> 1136401 T2450 C:control_collection S:shard1 oasc.ShardLeaderElectionContext.waitForReplicasToComeUp Enough replicas found to continue.
   [junit4]   2> 1136401 T2450 C:control_collection S:shard1 oasc.ShardLeaderElectionContext.runLeaderProcess I may be the new leader - try and sync
   [junit4]   2> ASYNC  NEW_CORE C428 name=collection1 org.apache.solr.core.SolrCore@115569db url=http://127.0.0.1:50207/zt_/rp/collection1 node=127.0.0.1:50207_zt_%2Frp C428_STATE=coll:control_collection core:collection1 props:{base_url=http://127.0.0.1:50207/zt_/rp, core=collection1, node_name=127.0.0.1:50207_zt_%2Frp, state=down}
   [junit4]   2> 1136401 T2450 C:control_collection S:shard1 C428 P50207 oasc.SyncStrategy.sync Sync replicas to http://127.0.0.1:50207/zt_/rp/collection1/
   [junit4]   2> 1136401 T2443 oasc.Overseer$ClusterStateUpdater.run processMessage: queueSize: 1, message = {
   [junit4]   2> 	  "operation":"leader",
   [junit4]   2> 	  "shard":"shard1",
   [junit4]   2> 	  "collection":"control_collection"} current state version: 1
   [junit4]   2> 1136402 T2416 oasc.ChaosMonkey.monkeyLog monkey: init - expire sessions:false cause connection loss:false
   [junit4]   2> 1136401 T2450 C:control_collection S:shard1 C428 P50207 oasc.SyncStrategy.syncReplicas Sync Success - now sync replicas to me
   [junit4]   2> 1136402 T2416 oasc.AbstractFullDistribZkTestBase.createJettys Creating collection1 with stateFormat=2
   [junit4]   2> 1136402 T2450 C:control_collection S:shard1 C428 P50207 oasc.SyncStrategy.syncToMe http://127.0.0.1:50207/zt_/rp/collection1/ has no replicas
   [junit4]   2> 1136403 T2442 oascc.ZkStateReader$2.process A cluster state change: WatchedEvent state:SyncConnected type:NodeDataChanged path:/clusterstate.json, has occurred - updating... (live nodes size: 1)
   [junit4]   2> 1136403 T2450 C:control_collection S:shard1 oasc.ShardLeaderElectionContext.runLeaderProcess I am the new leader: http://127.0.0.1:50207/zt_/rp/collection1/ shard1
   [junit4]   2> 1136403 T2454 oascc.ZkStateReader$2.process A cluster state change: WatchedEvent state:SyncConnected type:NodeDataChanged path:/clusterstate.json, has occurred - updating... (live nodes size: 1)
   [junit4]   2> 1136402 T2416 oascc.SolrZkClient.createZkCredentialsToAddAutomatically Using default ZkCredentialsProvider
   [junit4]   2> 1136403 T2450 C:control_collection S:shard1 oascc.SolrZkClient.makePath makePath: /collections/control_collection/leaders/shard1
   [junit4]   2> 1136404 T2416 oascc.ConnectionManager.waitForConnected Waiting for client to connect to ZooKeeper
   [junit4]   2> 1136406 T2457 oascc.ConnectionManager.process Watcher org.apache.solr.common.cloud.ConnectionManager@634940ba name:ZooKeeperConnection Watcher:127.0.0.1:50202/solr got event WatchedEvent state:SyncConnected type:None path:null path:null type:None
   [junit4]   2> 1136406 T2416 oascc.ConnectionManager.waitForConnected Client is connected to ZooKeeper
   [junit4]   2> 1136406 T2416 oascc.SolrZkClient.createZkACLProvider Using default ZkACLProvider
   [junit4]   2> 1136408 T2442 oasc.DistributedQueue$LatchWatcher.process NodeChildrenChanged fired on path /overseer/queue state SyncConnected
   [junit4]   2> 1136409 T2443 oasc.Overseer$ClusterStateUpdater.run processMessage: queueSize: 2, message = {
   [junit4]   2> 	  "operation":"create",
   [junit4]   2> 	  "name":"collection1",
   [junit4]   2> 	  "numShards":"3",
   [junit4]   2> 	  "stateFormat":"2"} current state version: 2
   [junit4]   2> 1136410 T2443 oasco.ClusterStateMutator.createCollection building a new cName: collection1
   [junit4]   2> 1136412 T2443 oasc.Overseer$ClusterStateUpdater.run processMessage: queueSize: 1, message = {
   [junit4]   2> 	  "operation":"leader",
   [junit4]   2> 	  "shard":"shard1",
   [junit4]   2> 	  "collection":"control_collection",
   [junit4]   2> 	  "base_url":"http://127.0.0.1:50207/zt_/rp",
   [junit4]   2> 	  "core":"collection1",
   [junit4]   2> 	  "state":"active"} current state version: 2
   [junit4]   2> 1136412 T2443 oasco.ZkStateWriter.writePendingUpdates going to create_collection /collections/collection1/state.json
   [junit4]   2> 1136413 T2454 oascc.ZkStateReader$2.process A cluster state change: WatchedEvent state:SyncConnected type:NodeDataChanged path:/clusterstate.json, has occurred - updating... (live nodes size: 1)
   [junit4]   2> 1136413 T2442 oascc.ZkStateReader$2.process A cluster state change: WatchedEvent state:SyncConnected type:NodeDataChanged path:/clusterstate.json, has occurred - updating... (live nodes size: 1)
   [junit4]   2> 1136416 T2442 oasc.DistributedQueue$LatchWatcher.process NodeChildrenChanged fired on path /overseer/queue state SyncConnected
   [junit4]   2> 1136416 T2442 oascc.ZkStateReader$2.process A cluster state change: WatchedEvent state:SyncConnected type:NodeDataChanged path:/clusterstate.json, has occurred - updating... (live nodes size: 1)
   [junit4]   2> 1136416 T2454 oascc.ZkStateReader$2.process A cluster state change: WatchedEvent state:SyncConnected type:NodeDataChanged path:/clusterstate.json, has occurred - updating... (live nodes size: 1)
   [junit4]   2> 1136460 T2450 C:control_collection S:shard1 oasc.ZkController.register We are http://127.0.0.1:50207/zt_/rp/collection1/ and leader is http://127.0.0.1:50207/zt_/rp/collection1/
   [junit4]   2> 1136461 T2450 C:control_collection S:shard1 oasc.ZkController.register No LogReplay needed for core=collection1 baseURL=http://127.0.0.1:50207/zt_/rp
   [junit4]   2> 1136461 T2450 C:control_collection S:shard1 oasc.ZkController.checkRecovery I am the leader, no recovery necessary
   [junit4]   2> 1136461 T2450 C:control_collection S:shard1 c:collection1 oasc.ZkController.publish publishing core=collection1 state=active collection=control_collection
   [junit4]   2> 1136461 T2450 C:control_collection S:shard1 c:collection1 oasc.ZkController.publish numShards not found on descriptor - reading it from system property
   [junit4]   2> 1136463 T2442 oasc.DistributedQueue$LatchWatcher.process NodeChildrenChanged fired on path /overseer/queue state SyncConnected
   [junit4]   2> 1136464 T2443 oasc.Overseer$ClusterStateUpdater.run processMessage: queueSize: 1, message = {
   [junit4]   2> 	  "core_node_name":"core_node1",
   [junit4]   2> 	  "base_url":"http://127.0.0.1:50207/zt_/rp",
   [junit4]   2> 	  "core":"collection1",
   [junit4]   2> 	  "node_name":"127.0.0.1:50207_zt_%2Frp",
   [junit4]   2> 	  "numShards":"3",
   [junit4]   2> 	  "state":"active",
   [junit4]   2> 	  "operation":"state",
   [junit4]   2> 	  "collection":"control_collection",
   [junit4]   2> 	  "roles":null,
   [junit4]   2> 	  "shard":"shard1"} current state version: 4
   [junit4]   2> 1136464 T2443 oasco.ReplicaMutator.updateState Update state numShards=3 message={
   [junit4]   2> 	  "core_node_name":"core_node1",
   [junit4]   2> 	  "base_url":"http://127.0.0.1:50207/zt_/rp",
   [junit4]   2> 	  "core":"collection1",
   [junit4]   2> 	  "node_name":"127.0.0.1:50207_zt_%2Frp",
   [junit4]   2> 	  "numShards":"3",
   [junit4]   2> 	  "state":"active",
   [junit4]   2> 	  "operation":"state",
   [junit4]   2> 	  "collection":"control_collection",
   [junit4]   2> 	  "roles":null,
   [junit4]   2> 	  "shard":"shard1"}
   [junit4]   2> 1136568 T2442 oascc.ZkStateReader$2.process A cluster state change: WatchedEvent state:SyncConnected type:NodeDataChanged path:/clusterstate.json, has occurred - updating... (live nodes size: 1)
   [junit4]   2> 1136568 T2454 oascc.ZkStateReader$2.process A cluster state change: WatchedEvent state:SyncConnected type:NodeDataChanged path:/clusterstate.json, has occurred - updating... (live nodes size: 1)
   [junit4]   2> 1137646 T2416 oas.SolrTestCaseJ4.writeCoreProperties Writing core.properties file to /usr/home/jenkins/jenkins-slave/workspace/Lucene-Solr-Tests-5.x-Java7/solr/build/solr-core/test/J0/temp/solr.cloud.ReplicationFactorTest A6DBB2D7042F4A95-001/shard-1-001/cores/collection1
   [junit4]   2> 1137648 T2416 oasc.AbstractFullDistribZkTestBase.createJettys create jetty 1 in directory /usr/home/jenkins/jenkins-slave/workspace/Lucene-Solr-Tests-5.x-Java7/solr/build/solr-core/test/J0/temp/solr.cloud.ReplicationFactorTest A6DBB2D7042F4A95-001/shard-1-001
   [junit4]   2> 1137649 T2416 oejs.Server.doStart jetty-8.1.10.v20130312
   [junit4]   2> 1137651 T2416 oejs.AbstractConnector.doStart Started SocketConnector@127.0.0.1:50220
   [junit4]   2> 1137652 T2416 oascse.JettySolrRunner$1.lifeCycleStarted Jetty properties: {hostContext=/zt_/rp, solrconfig=solrconfig.xml, hostPort=50219, solr.data.dir=/usr/home/jenkins/jenkins-slave/workspace/Lucene-Solr-Tests-5.x-Java7/solr/build/solr-core/test/J0/temp/solr.cloud.ReplicationFactorTest A6DBB2D7042F4A95-001/tempDir-001/jetty1, coreRootDirectory=/usr/home/jenkins/jenkins-slave/workspace/Lucene-Solr-Tests-5.x-Java7/solr/build/solr-core/test/J0/temp/solr.cloud.ReplicationFactorTest A6DBB2D7042F4A95-001/shard-1-001/cores}
   [junit4]   2> 1137652 T2416 oass.SolrDispatchFilter.init SolrDispatchFilter.init()sun.misc.Launcher$AppClassLoader@631d75b9
   [junit4]   2> 1137652 T2416 oasc.SolrResourceLoader.<init> new SolrResourceLoader for directory: '/usr/home/jenkins/jenkins-slave/workspace/Lucene-Solr-Tests-5.x-Java7/solr/build/solr-core/test/J0/temp/solr.cloud.ReplicationFactorTest A6DBB2D7042F4A95-001/shard-1-001/'
   [junit4]   2> 1137681 T2416 oasc.SolrXmlConfig.fromFile Loading container configuration from /usr/home/jenkins/jenkins-slave/workspace/Lucene-Solr-Tests-5.x-Java7/solr/build/solr-core/test/J0/temp/solr.cloud.ReplicationFactorTest A6DBB2D7042F4A95-001/shard-1-001/solr.xml
   [junit4]   2> 1137716 T2416 oasc.CorePropertiesLocator.<init> Config-defined core root directory: /usr/home/jenkins/jenkins-slave/workspace/Lucene-Solr-Tests-5.x-Java7/solr/build/solr-core/test/J0/temp/solr.cloud.ReplicationFactorTest A6DBB2D7042F4A95-001/shard-1-001/cores
   [junit4]   2> 1137717 T2416 oasc.CoreContainer.<init> New CoreContainer 294604378
   [junit4]   2> 1137717 T2416 oasc.CoreContainer.load Loading cores into CoreContainer [instanceDir=/usr/home/jenkins/jenkins-slave/workspace/Lucene-Solr-Tests-5.x-Java7/solr/build/solr-core/test/J0/temp/solr.cloud.ReplicationFactorTest A6DBB2D7042F4A95-001/shard-1-001/]
   [junit4]   2> 1137717 T2416 oasc.CoreContainer.load loading shared library: /usr/home/jenkins/jenkins-slave/workspace/Lucene-Solr-Tests-5.x-Java7/solr/build/solr-core/test/J0/temp/solr.cloud.ReplicationFactorTest A6DBB2D7042F4A95-001/shard-1-001/lib
   [junit4]   2> 1137718 T2416 oasc.SolrResourceLoader.addToClassLoader WARN Can't find (or read) directory to add to classloader: lib (resolved as: /usr/home/jenkins/jenkins-slave/workspace/Lucene-Solr-Tests-5.x-Java7/solr/build/solr-core/test/J0/temp/solr.cloud.ReplicationFactorTest A6DBB2D7042F4A95-001/shard-1-001/lib).
   [junit4]   2> 1137727 T2416 oashc.HttpShardHandlerFactory.getParameter Setting socketTimeout to: 90000
   [junit4]   2> 1137727 T2416 oashc.HttpShardHandlerFactory.getParameter Setting urlScheme to: 
   [junit4]   2> 1137727 T2416 oashc.HttpShardHandlerFactory.getParameter Setting connTimeout to: 15000
   [junit4]   2> 1137728 T2416 oashc.HttpShardHandlerFactory.getParameter Setting maxConnectionsPerHost to: 20
   [junit4]   2> 1137728 T2416 oashc.HttpShardHandlerFactory.getParameter Setting maxConnections to: 10000
   [junit4]   2> 1137728 T2416 oashc.HttpShardHandlerFactory.getParameter Setting corePoolSize to: 0
   [junit4]   2> 1137728 T2416 oashc.HttpShardHandlerFactory.getParameter Setting maximumPoolSize to: 2147483647
   [junit4]   2> 1137728 T2416 oashc.HttpShardHandlerFactory.getParameter Setting maxThreadIdleTime to: 5
   [junit4]   2> 1137729 T2416 oashc.HttpShardHandlerFactory.getParameter Setting sizeOfQueue to: -1
   [junit4]   2> 1137729 T2416 oashc.HttpShardHandlerFactory.getParameter Setting fairnessPolicy to: false
   [junit4]   2> 1137729 T2416 oashc.HttpShardHandlerFactory.getParameter Setting useRetries to: false
   [junit4]   2> 1137734 T2416 oasu.UpdateShardHandler.<init> Creating UpdateShardHandler HTTP client with params: socketTimeout=340000&connTimeout=45000&retry=true
   [junit4]   2> 1137734 T2416 oasl.LogWatcher.createWatcher SLF4J impl is org.slf4j.impl.Log4jLoggerFactory
   [junit4]   2> 1137734 T2416 oasl.LogWatcher.newRegisteredLogWatcher Registering Log Listener [Log4j (org.slf4j.impl.Log4jLoggerFactory)]
   [junit4]   2> 1137735 T2416 oasc.CoreContainer.load Node Name: 127.0.0.1
   [junit4]   2> 1137735 T2416 oasc.ZkContainer.initZooKeeper Zookeeper client=127.0.0.1:50202/solr
   [junit4]   2> 1137735 T2416 oasc.ZkController.checkChrootPath zkHost includes chroot
   [junit4]   2> 1137735 T2416 oascc.SolrZkClient.createZkCredentialsToAddAutomatically Using default ZkCredentialsProvider
   [junit4]   2> 1137736 T2416 oascc.ConnectionManager.waitForConnected Waiting for client to connect to ZooKeeper
   [junit4]   2> 1137738 T2469 oascc.ConnectionManager.process Watcher org.apache.solr.common.cloud.ConnectionManager@3d722847 name:ZooKeeperConnection Watcher:127.0.0.1:50202 got event WatchedEvent state:SyncConnected type:None path:null path:null type:None
   [junit4]   2> 1137738 T2416 oascc.ConnectionManager.waitForConnected Client is connected to ZooKeeper
   [junit4]   2> 1137739 T2416 oascc.SolrZkClient.createZkACLProvider Using default ZkACLProvider
   [junit4]   2> 1137740 T2416 oascc.ConnectionManager.waitForConnected Waiting for client to connect to ZooKeeper
   [junit4]   2> 1137741 T2472 oascc.ConnectionManager.process Watcher org.apache.solr.common.cloud.ConnectionManager@116eb63 name:ZooKeeperConnection Watcher:127.0.0.1:50202/solr got event WatchedEvent state:SyncConnected type:None path:null path:null type:None
   [junit4]   2> 1137742 T2416 oascc.ConnectionManager.waitForConnected Client is connected to ZooKeeper
   [junit4]   2> 1137745 T2416 oascc.ZkStateReader.createClusterStateWatchersAndUpdate Updating cluster state from ZooKeeper... 
   [junit4]   2> 1138749 T2416 oasc.ZkController.createEphemeralLiveNode Register node as live in ZooKeeper:/live_nodes/127.0.0.1:50219_zt_%2Frp
   [junit4]   2> 1138750 T2416 oascc.SolrZkClient.makePath makePath: /live_nodes/127.0.0.1:50219_zt_%2Frp
   [junit4]   2> 1138753 T2416 oasc.Overseer.close Overseer (id=null) closing
   [junit4]   2> 1138756 T2416 oasc.CorePropertiesLocator.discover Looking for core definitions underneath /usr/home/jenkins/jenkins-slave/workspace/Lucene-Solr-Tests-5.x-Java7/solr/build/solr-core/test/J0/temp/solr.cloud.ReplicationFactorTest A6DBB2D7042F4A95-001/shard-1-001/cores
   [junit4]   2> 1138758 T2416 oasc.CoreDescriptor.<init> CORE DESCRIPTOR: {absoluteInstDir=/usr/home/jenkins/jenkins-slave/workspace/Lucene-Solr-Tests-5.x-Java7/solr/build/solr-core/test/J0/temp/solr.cloud.ReplicationFactorTest A6DBB2D7042F4A95-001/shard-1-001/cores/collection1/, dataDir=data/, transient=false, loadOnStartup=true, config=solrconfig.xml, coreNodeName=, collection=collection1, shard=, name=collection1, schema=schema.xml, instanceDir=/usr/home/jenkins/jenkins-slave/workspace/Lucene-Solr-Tests-5.x-Java7/solr/build/solr-core/test/J0/temp/solr.cloud.ReplicationFactorTest A6DBB2D7042F4A95-001/shard-1-001/cores/collection1}
   [junit4]   2> 1138759 T2416 oasc.CorePropertiesLocator.discoverUnder Found core collection1 in /usr/home/jenkins/jenkins-slave/workspace/Lucene-Solr-Tests-5.x-Java7/solr/build/solr-core/test/J0/temp/solr.cloud.ReplicationFactorTest A6DBB2D7042F4A95-001/shard-1-001/cores/collection1/
   [junit4]   2> 1138759 T2416 oasc.CorePropertiesLocator.discover Found 1 core definitions
   [junit4]   2> 1138761 T2473 C:collection1 c:collection1 oasc.ZkController.publish publishing core=collection1 state=down collection=collection1
   [junit4]   2> 1138761 T2473 C:collection1 c:collection1 oasc.ZkController.publish numShards not found on descriptor - reading it from system property
   [junit4]   2> 1138762 T2442 oasc.DistributedQueue$LatchWatcher.process NodeChildrenChanged fired on path /overseer/queue state SyncConnected
   [junit4]   2> 1138762 T2473 C:collection1 c:collection1 oasc.ZkController.preRegister Registering watch for external collection collection1
   [junit4]   2> 1138763 T2473 C:collection1 c:collection1 oascc.ZkStateReader.addZkWatch addZkWatch collection1
   [junit4]   2> 1138763 T2443 oasc.Overseer$ClusterStateUpdater.run processMessage: queueSize: 1, message = {
   [junit4]   2> 	  "base_url":"http://127.0.0.1:50219/zt_/rp",
   [junit4]   2> 	  "core":"collection1",
   [junit4]   2> 	  "node_name":"127.0.0.1:50219_zt_%2Frp",
   [junit4]   2> 	  "numShards":"3",
   [junit4]   2> 	  "state":"down",
   [junit4]   2> 	  "operation":"state",
   [junit4]   2> 	  "collection":"collection1",
   [junit4]   2> 	  "roles":null,
   [junit4]   2> 	  "shard":null} current state version: 5
   [junit4]   2> 1138763 T2473 C:collection1 c:collection1 oascc.ZkStateReader.addZkWatch Updating collection state at /collections/collection1/state.json from ZooKeeper... 
   [junit4]   2> 1138763 T2443 oasco.ReplicaMutator.updateState Update state numShards=3 message={
   [junit4]   2> 	  "base_url":"http://127.0.0.1:50219/zt_/rp",
   [junit4]   2> 	  "core":"collection1",
   [junit4]   2> 	  "node_name":"127.0.0.1:50219_zt_%2Frp",
   [junit4]   2> 	  "numShards":"3",
   [junit4]   2> 	  "state":"down",
   [junit4]   2> 	  "operation":"state",
   [junit4]   2> 	  "collection":"collection1",
   [junit4]   2> 	  "roles":null,
   [junit4]   2> 	  "shard":null}
   [junit4]   2> 1138764 T2443 oasco.ReplicaMutator.updateState Collection already exists with numShards=3
   [junit4]   2> 1138764 T2443 oasco.ReplicaMutator.updateState Assigning new node to shard shard=shard1
   [junit4]   2> 1138764 T2473 C:collection1 c:collection1 oascc.ZkStateReader.updateWatchedCollection Updating data for collection1 to ver 0 
   [junit4]   2> 1138764 T2473 C:collection1 c:collection1 oasc.ZkController.waitForCoreNodeName look for our core node name
   [junit4]   2> 1138765 T2443 oasco.ZkStateWriter.writePendingUpdates going to update_collection /collections/collection1/state.json version: 0
   [junit4]   2> 1138765 T2472 oascc.ZkStateReader$7.process A cluster state change: WatchedEvent state:SyncConnected type:NodeDataChanged path:/collections/collection1/state.json for collection collection1 has occurred - updating... (live nodes size: 2)
   [junit4]   2> 1138766 T2472 oascc.ZkStateReader.updateWatchedCollection Updating data for collection1 to ver 1 
   [junit4]   2> 1139765 T2473 C:collection1 c:collection1 oasc.ZkController.waitForShardId waiting to find shard id in clusterstate for collection1
   [junit4]   2> 1139766 T2473 C:collection1 c:collection1 oasc.ZkController.createCollectionZkNode Check for collection zkNode:collection1
   [junit4]   2> 1139766 T2473 C:collection1 c:collection1 oasc.ZkController.createCollectionZkNode Collection zkNode exists
   [junit4]   2> 1139766 T2473 C:collection1 c:collection1 oascc.ZkStateReader.readConfigName Load collection config from:/collections/collection1
   [junit4]   2> 1139767 T2473 C:collection1 c:collection1 oascc.ZkStateReader.readConfigName path=/collections/collection1 configName=conf1 specified config exists in ZooKeeper
   [junit4]   2> 1139767 T2473 C:collection1 c:collection1 oasc.SolrResourceLoader.<init> new SolrResourceLoader for directory: '/usr/home/jenkins/jenkins-slave/workspace/Lucene-Solr-Tests-5.x-Java7/solr/build/solr-core/test/J0/temp/solr.cloud.ReplicationFactorTest A6DBB2D7042F4A95-001/shard-1-001/cores/collection1/'
   [junit4]   2> 1139780 T2473 C:collection1 c:collection1 oasc.ZkController.watchZKConfDir watch zkdir /configs/conf1
   [junit4]   2> 1139782 T2473 C:collection1 c:collection1 oasc.Config.<init> loaded config solrconfig.xml with version 0 
   [junit4]   2> 1139791 T2473 C:collection1 c:collection1 oasc.SolrConfig.refreshRequestParams current version of requestparams : -1
   [junit4]   2> 1139810 T2473 C:collection1 c:collection1 oasc.SolrConfig.<init> Using Lucene MatchVersion: 5.2.0
   [junit4]   2> 1139851 T2473 C:collection1 c:collection1 oasc.SolrConfig.<init> Loaded SolrConfig: solrconfig.xml
   [junit4]   2> 1139952 T2473 C:collection1 c:collection1 oass.IndexSchema.readSchema Reading Solr Schema from /configs/conf1/schema.xml
   [junit4]   2> 1139959 T2473 C:collection1 c:collection1 oass.IndexSchema.readSchema [collection1] Schema name=test
   [junit4]   2> 1140253 T2473 C:collection1 c:collection1 oass.OpenExchangeRatesOrgProvider.init Initialized with rates=open-exchange-rates.json, refreshInterval=1440.
   [junit4]   2> 1140263 T2473 C:collection1 c:collection1 oass.IndexSchema.readSchema default search field in schema is text
   [junit4]   2> 1140266 T2473 C:collection1 c:collection1 oass.IndexSchema.readSchema unique key field: id
   [junit4]   2> 1140272 T2473 C:collection1 c:collection1 oass.FileExchangeRateProvider.reload Reloading exchange rates from file currency.xml
   [junit4]   2> 1140275 T2473 C:collection1 c:collection1 oass.FileExchangeRateProvider.reload Reloading exchange rates from file currency.xml
   [junit4]   2> 1140278 T2473 C:collection1 c:collection1 oass.OpenExchangeRatesOrgProvider.reload Reloading exchange rates from open-exchange-rates.json
   [junit4]   2> 1140279 T2473 C:collection1 c:collection1 oass.OpenExchangeRatesOrgProvider$OpenExchangeRates.<init> WARN Unknown key IMPORTANT NOTE
   [junit4]   2> 1140279 T2473 C:collection1 c:collection1 oass.OpenExchangeRatesOrgProvider$OpenExchangeRates.<init> WARN Expected key, got STRING
   [junit4]   2> 1140279 T2473 C:collection1 c:collection1 oass.OpenExchangeRatesOrgProvider.reload Reloading exchange rates from open-exchange-rates.json
   [junit4]   2> 1140279 T2473 C:collection1 c:collection1 oass.OpenExchangeRatesOrgProvider$OpenExchangeRates.<init> WARN Unknown key IMPORTANT NOTE
   [junit4]   2> 1140280 T2473 C:collection1 c:collection1 oass.OpenExchangeRatesOrgProvider$OpenExchangeRates.<init> WARN Expected key, got STRING
   [junit4]   2> 1140280 T2473 C:collection1 c:collection1 oasc.CoreContainer.create Creating SolrCore 'collection1' using configuration from collection collection1
   [junit4]   2> 1140280 T2473 C:collection1 c:collection1 oasc.SolrCore.initDirectoryFactory org.apache.solr.core.MockDirectoryFactory
   [junit4]   2> 1140280 T2473 C:collection1 c:collection1 oasc.SolrCore.<init> [collection1] Opening new SolrCore at /usr/home/jenkins/jenkins-slave/workspace/Lucene-Solr-Tests-5.x-Java7/solr/build/solr-core/test/J0/temp/solr.cloud.ReplicationFactorTest A6DBB2D7042F4A95-001/shard-1-001/cores/collection1/, dataDir=/usr/home/jenkins/jenkins-slave/workspace/Lucene-Solr-Tests-5.x-Java7/solr/build/solr-core/test/J0/temp/solr.cloud.ReplicationFactorTest A6DBB2D7042F4A95-001/shard-1-001/cores/collection1/data/
   [junit4]   2> 1140280 T2473 C:collection1 c:collection1 oasc.JmxMonitoredMap.<init> JMX monitoring is enabled. Adding Solr mbeans to JMX Server: com.sun.jmx.mbeanserver.JmxMBeanServer@143d13d6
   [junit4]   2> 1140281 T2473 C:collection1 c:collection1 oasc.CachingDirectoryFactory.get return new directory for /usr/home/jenkins/jenkins-slave/workspace/Lucene-Solr-Tests-5.x-Java7/solr/build/solr-core/test/J0/temp/solr.cloud.ReplicationFactorTest A6DBB2D7042F4A95-001/shard-1-001/cores/collection1/data
   [junit4]   2> 1140281 T2473 C:collection1 c:collection1 oasc.SolrCore.getNewIndexDir New index directory detected: old=null new=/usr/home/jenkins/jenkins-slave/workspace/Lucene-Solr-Tests-5.x-Java7/solr/build/solr-core/test/J0/temp/solr.cloud.ReplicationFactorTest A6DBB2D7042F4A95-001/shard-1-001/cores/collection1/data/index/
   [junit4]   2> 1140282 T2473 C:collection1 c:collection1 oasc.SolrCore.initIndex WARN [collection1] Solr index directory '/usr/home/jenkins/jenkins-slave/workspace/Lucene-Solr-Tests-5.x-Java7/solr/build/solr-core/test/J0/temp/solr.cloud.ReplicationFactorTest A6DBB2D7042F4A95-001/shard-1-001/cores/collection1/data/index' doesn't exist. Creating new index...
   [junit4]   2> 1140282 T2473 C:collection1 c:collection1 oasc.CachingDirectoryFactory.get return new directory for /usr/home/jenkins/jenkins-slave/workspace/Lucene-Solr-Tests-5.x-Java7/solr/build/solr-core/test/J0/temp/solr.cloud.ReplicationFactorTest A6DBB2D7042F4A95-001/shard-1-001/cores/collection1/data/index
   [junit4]   2> 1140282 T2473 C:collection1 c:collection1 oasu.RandomMergePolicy.<init> RandomMergePolicy wrapping class org.apache.lucene.index.TieredMergePolicy: [TieredMergePolicy: maxMergeAtOnce=34, maxMergeAtOnceExplicit=38, maxMergedSegmentMB=57.4541015625, floorSegmentMB=0.5546875, forceMergeDeletesPctAllowed=5.22780806596198, segmentsPerTier=18.0, maxCFSSegmentSizeMB=8.796093022207999E12, noCFSRatio=0.19405204540464516
   [junit4]   2> 1140283 T2473 C:collection1 c:collection1 oasc.SolrDeletionPolicy.onCommit SolrDeletionPolicy.onCommit: commits: num=1
   [junit4]   2> 		commit{dir=MockDirectoryWrapper(RAMDirectory@5eff06be lockFactory=org.apache.lucene.store.SingleInstanceLockFactory@3913d4ab),segFN=segments_1,generation=1}
   [junit4]   2> 1140283 T2473 C:collection1 c:collection1 oasc.SolrDeletionPolicy.updateCommits newest commit generation = 1
   [junit4]   2> 1140288 T2473 C:collection1 c:collection1 oasup.UpdateRequestProcessorChain.init creating updateRequestProcessorChain "nodistrib"
   [junit4]   2> 1140288 T2473 C:collection1 c:collection1 oasup.UpdateRequestProcessorChain.init creating updateRequestProcessorChain "dedupe"
   [junit4]   2> 1140288 T2473 C:collection1 c:collection1 oasup.UpdateRequestProcessorChain.init inserting DistributedUpdateProcessorFactory into updateRequestProcessorChain "dedupe"
   [junit4]   2> 1140288 T2473 C:collection1 c:collection1 oasup.UpdateRequestProcessorChain.init creating updateRequestProcessorChain "stored_sig"
   [junit4]   2> 1140288 T2473 C:collection1 c:collection1 oasup.UpdateRequestProcessorChain.init inserting DistributedUpdateProcessorFactory into updateRequestProcessorChain "stored_sig"
   [junit4]   2> 1140288 T2473 C:collection1 c:collection1 oasup.UpdateRequestProcessorChain.init creating updateRequestProcessorChain "distrib-dup-test-chain-explicit"
   [junit4]   2> 1140289 T2473 C:collection1 c:collection1 oasup.UpdateRequestProcessorChain.init creating updateRequestProcessorChain "distrib-dup-test-chain-implicit"
   [junit4]   2> 1140289 T2473 C:collection1 c:collection1 oasup.UpdateRequestProcessorChain.init inserting DistributedUpdateProcessorFactory into updateRequestProcessorChain "distrib-dup-test-chain-implicit"
   [junit4]   2> 1140289 T2473 C:collection1 c:collection1 oasc.SolrCore.loadUpdateProcessorChains no updateRequestProcessorChain defined as default, creating implicit default
   [junit4]   2> 1140301 T2473 C:collection1 c:collection1 oashl.XMLLoader.init xsltCacheLifetimeSeconds=60
   [junit4]   2> 1140303 T2473 C:collection1 c:collection1 oashl.XMLLoader.init xsltCacheLifetimeSeconds=60
   [junit4]   2> 1140304 T2473 C:collection1 c:collection1 oashl.XMLLoader.init xsltCacheLifetimeSeconds=60
   [junit4]   2> 1140306 T2473 C:collection1 c:collection1 oashl.XMLLoader.init xsltCacheLifetimeSeconds=60
   [junit4]   2> 1140311 T2473 C:collection1 c:collection1 oasc.RequestHandlers.initHandlersFromConfig Registered paths: /admin/system,/admin/logging,/update/csv,/update,/admin/plugins,/update/json,/admin/file,/get,standard,/admin/mbeans,/replication,/admin/threads,/config,/admin/segments,/admin/luke,/admin/properties,/schema,/admin/ping,/update/json/docs
   [junit4]   2> 1140312 T2473 C:collection1 c:collection1 oasc.SolrCore.initStatsCache Using default statsCache cache: org.apache.solr.search.stats.LocalStatsCache
   [junit4]   2> 1140313 T2473 C:collection1 c:collection1 oasu.UpdateHandler.<init> Using UpdateLog implementation: org.apache.solr.update.UpdateLog
   [junit4]   2> 1140313 T2473 C:collection1 c:collection1 oasu.UpdateLog.init Initializing UpdateLog: dataDir= defaultSyncLevel=FLUSH numRecordsToKeep=100 maxNumLogsToKeep=10
   [junit4]   2> 1140314 T2473 C:collection1 c:collection1 oasu.CommitTracker.<init> Hard AutoCommit: disabled
   [junit4]   2> 1140314 T2473 C:collection1 c:collection1 oasu.CommitTracker.<init> Soft AutoCommit: disabled
   [junit4]   2> 1140315 T2473 C:collection1 c:collection1 oasu.RandomMergePolicy.<init> RandomMergePolicy wrapping class org.apache.lucene.index.TieredMergePolicy: [TieredMergePolicy: maxMergeAtOnce=21, maxMergeAtOnceExplicit=36, maxMergedSegmentMB=22.39453125, floorSegmentMB=1.7548828125, forceMergeDeletesPctAllowed=9.803215846184616, segmentsPerTier=36.0, maxCFSSegmentSizeMB=8.796093022207999E12, noCFSRatio=0.0
   [junit4]   2> 1140316 T2473 C:collection1 c:collection1 oasc.SolrDeletionPolicy.onInit SolrDeletionPolicy.onInit: commits: num=1
   [junit4]   2> 		commit{dir=MockDirectoryWrapper(RAMDirectory@5eff06be lockFactory=org.apache.lucene.store.SingleInstanceLockFactory@3913d4ab),segFN=segments_1,generation=1}
   [junit4]   2> 1140316 T2473 C:collection1 c:collection1 oasc.SolrDeletionPolicy.updateCommits newest commit generation = 1
   [junit4]   2> 1140316 T2473 C:collection1 c:collection1 oass.SolrIndexSearcher.<init> Opening Searcher@1857ee1b[collection1] main
   [junit4]   2> 1140316 T2473 C:collection1 c:collection1 oascc.ZkStateReader.readConfigName Load collection config from:/collections/collection1
   [junit4]   2> 1140317 T2473 C:collection1 c:collection1 oascc.ZkStateReader.readConfigName path=/collections/collection1 configName=conf1 specified config exists in ZooKeeper
   [junit4]   2> 1140317 T2473 C:collection1 c:collection1 oasr.ManagedResourceStorage.newStorageIO Setting up ZooKeeper-based storage for the RestManager with znodeBase: /configs/conf1
   [junit4]   2> 1140317 T2473 C:collection1 c:collection1 oasr.ManagedResourceStorage$ZooKeeperStorageIO.configure Configured ZooKeeperStorageIO with znodeBase: /configs/conf1
   [junit4]   2> 1140317 T2473 C:collection1 c:collection1 oasr.RestManager.init Initializing RestManager with initArgs: {}
   [junit4]   2> 1140318 T2473 C:collection1 c:collection1 oasr.ManagedResourceStorage.load Reading _rest_managed.json using ZooKeeperStorageIO:path=/configs/conf1
   [junit4]   2> 1140318 T2473 C:collection1 c:collection1 oasr.ManagedResourceStorage$ZooKeeperStorageIO.openInputStream No data found for znode /configs/conf1/_rest_managed.json
   [junit4]   2> 1140318 T2473 C:collection1 c:collection1 oasr.ManagedResourceStorage.load Loaded null at path _rest_managed.json using ZooKeeperStorageIO:path=/configs/conf1
   [junit4]   2> 1140318 T2473 C:collection1 c:collection1 oasr.RestManager.init Initializing 0 registered ManagedResources
   [junit4]   2> 1140319 T2473 C:collection1 c:collection1 oash.ReplicationHandler.inform Commits will be reserved for  10000
   [junit4]   2> 1140319 T2474 C:collection1 c:collection1 oasc.SolrCore.registerSearcher [collection1] Registered new searcher Searcher@1857ee1b[collection1] main{ExitableDirectoryReader(UninvertingDirectoryReader())}
   [junit4]   2> 1140320 T2473 C:collection1 c:collection1 oasc.CoreContainer.registerCore registering core: collection1
   [junit4]   2> 1140321 T2477 C:collection1 S:shard1 oasc.ZkController.register Register replica - core:collection1 address:http://127.0.0.1:50219/zt_/rp collection:collection1 shard:shard1
   [junit4]   2> 1140321 T2416 oass.SolrDispatchFilter.init user.dir=/usr/home/jenkins/jenkins-slave/workspace/Lucene-Solr-Tests-5.x-Java7/solr/build/solr-core/test/J0
   [junit4]   2> 1140321 T2416 oass.SolrDispatchFilter.init SolrDispatchFilter.init() done
   [junit4]   2> 1140321 T2477 C:collection1 S:shard1 oascc.SolrZkClient.makePath makePath: /collections/collection1/leader_elect/shard1/election
   [junit4]   2> 1140324 T2477 C:collection1 S:shard1 oasc.ShardLeaderElectionContext.runLeaderProcess Running the leader process for shard shard1
   [junit4]   2> 1140325 T2442 oasc.DistributedQueue$LatchWatcher.process NodeChildrenChanged fired on path /overseer/queue state SyncConnected
   [junit4]   2> 1140326 T2477 C:collection1 S:shard1 oasc.ShardLeaderElectionContext.waitForReplicasToComeUp Enough replicas found to continue.
   [junit4]   2> 1140326 T2477 C:collection1 S:shard1 oasc.ShardLeaderElectionContext.runLeaderProcess I may be the new leader - try and sync
   [junit4]   2> ASYNC  NEW_CORE C429 name=collection1 org.apache.solr.core.SolrCore@796050a8 url=http://127.0.0.1:50219/zt_/rp/collection1 node=127.0.0.1:50219_zt_%2Frp C429_STATE=coll:collection1 core:collection1 props:{base_url=http://127.0.0.1:50219/zt_/rp, core=collection1, node_name=127.0.0.1:50219_zt_%2Frp, state=down}
   [junit4]   2> 1140326 T2477 C:collection1 S:shard1 C429 P50219 oasc.SyncStrategy.sync Sync replicas to http://127.0.0.1:50219/zt_/rp/collection1/
   [junit4]   2> 1140326 T2443 oasc.Overseer$ClusterStateUpdater.run processMessage: queueSize: 1, message = {
   [junit4]   2> 	  "operation":"leader",
   [junit4]   2> 	  "shard":"shard1",
   [junit4]   2> 	  "collection":"collection1"} current state version: 5
   [junit4]   2> 1140326 T2477 C:collection1 S:shard1 C429 P50219 oasc.SyncStrategy.syncReplicas Sync Success - now sync replicas to me
   [junit4]   2> 1140327 T2477 C:collection1 S:shard1 C429 P50219 oasc.SyncStrategy.syncToMe http://127.0.0.1:50219/zt_/rp/collection1/ has no replicas
   [junit4]   2> 1140327 T2477 C:collection1 S:shard1 oasc.ShardLeaderElectionContext.runLeaderProcess I am the new leader: http://127.0.0.1:50219/zt_/rp/collection1/ shard1
   [junit4]   2> 1140327 T2477 C:collection1 S:shard1 oascc.SolrZkClient.makePath makePath: /collections/collection1/leaders/shard1
   [junit4]   2> 1140327 T2443 oasco.ZkStateWriter.writePendingUpdates going to update_collection /collections/collection1/state.json version: 1
   [junit4]   2> 1140328 T2472 oascc.ZkStateReader$7.process A cluster state change: WatchedEvent state:SyncConnected type:NodeDataChanged path:/collections/collection1/state.json for collection collection1 has occurred - updating... (live nodes size: 2)
   [junit4]   2> 1140328 T2472 oascc.ZkStateReader.updateWatchedCollection Updating data for collection1 to ver 2 
   [junit4]   2> 1140330 T2443 oasc.Overseer$ClusterStateUpdater.run processMessage: queueSize: 1, message = {
   [junit4]   2> 	  "operation":"leader",
   [junit4]   2> 	  "shard":"shard1",
   [junit4]   2> 	  "collection":"collection1",
   [junit4]   2> 	  "base_url":"http://127.0.0.1:50219/zt_/rp",
   [junit4]   2> 	  "core":"collection1",
   [junit4]   2> 	  "state":"active"} current state version: 5
   [junit4]   2> 1140330 T2443 oasco.ZkStateWriter.writePendingUpdates going to update_collection /collections/collection1/state.json version: 2
   [junit4]   2> 1140331 T2472 oascc.ZkStateReader$7.process A cluster state change: WatchedEvent state:SyncConnected type:NodeDataChanged path:/collections/collection1/state.json for collection collection1 has occurred - updating... (live nodes size: 2)
   [junit4]   2> 1140331 T2472 oascc.ZkStateRea

[...truncated too long message...]

 		4	/solr/aliases.json
   [junit4]   2> 		4	/solr/clusterstate.json
   [junit4]   2> 		3	/solr/configs/conf1
   [junit4]   2> 		2	/solr/collections/collection1/state.json
   [junit4]   2> 	
   [junit4]   2> 	Maximum concurrent children watches above limit:
   [junit4]   2> 	
   [junit4]   2> 		4	/solr/live_nodes
   [junit4]   2> 		3	/solr/overseer/queue
   [junit4]   2> 		3	/solr/overseer/collection-queue-work
   [junit4]   2> 	
   [junit4]   2> 1598486 T4791 C:control_collection S:shard1 c:collection1 oasc.SocketProxy.close WARN Closing 0 connections to: http://127.0.0.1:48552/
   [junit4]   2> 1598486 T4791 C:control_collection S:shard1 c:collection1 oasc.SocketProxy.close WARN Closing 0 connections to: http://127.0.0.1:48526/
   [junit4]   2> 1598486 T4791 C:control_collection S:shard1 c:collection1 oasc.SocketProxy.close WARN Closing 5 connections to: http://127.0.0.1:48539/
   [junit4]   2> NOTE: reproduce with: ant test  -Dtestcase=RecoveryAfterSoftCommitTest -Dtests.method=test -Dtests.seed=A6DBB2D7042F4A95 -Dtests.multiplier=2 -Dtests.slow=true -Dtests.locale=nl_NL -Dtests.timezone=Asia/Pyongyang -Dtests.asserts=true -Dtests.file.encoding=ISO-8859-1
   [junit4] ERROR   66.5s J0 | RecoveryAfterSoftCommitTest.test <<<
   [junit4]    > Throwable #1: org.apache.solr.client.solrj.SolrServerException: org.apache.solr.client.solrj.SolrServerException: IOException occured when talking to server at: http://127.0.0.1:48539/collection1
   [junit4]    > 	at __randomizedtesting.SeedInfo.seed([A6DBB2D7042F4A95:2E8F8D0DAAD3276D]:0)
   [junit4]    > 	at org.apache.solr.client.solrj.impl.CloudSolrClient.directUpdate(CloudSolrClient.java:625)
   [junit4]    > 	at org.apache.solr.client.solrj.impl.CloudSolrClient.sendRequest(CloudSolrClient.java:948)
   [junit4]    > 	at org.apache.solr.client.solrj.impl.CloudSolrClient.requestWithRetryOnStaleState(CloudSolrClient.java:839)
   [junit4]    > 	at org.apache.solr.client.solrj.impl.CloudSolrClient.request(CloudSolrClient.java:782)
   [junit4]    > 	at org.apache.solr.client.solrj.SolrRequest.process(SolrRequest.java:135)
   [junit4]    > 	at org.apache.solr.client.solrj.SolrClient.add(SolrClient.java:174)
   [junit4]    > 	at org.apache.solr.client.solrj.SolrClient.add(SolrClient.java:139)
   [junit4]    > 	at org.apache.solr.client.solrj.SolrClient.add(SolrClient.java:153)
   [junit4]    > 	at org.apache.solr.cloud.RecoveryAfterSoftCommitTest.test(RecoveryAfterSoftCommitTest.java:88)
   [junit4]    > 	at org.apache.solr.BaseDistributedSearchTestCase$ShardsRepeatRule$ShardsFixedStatement.callStatement(BaseDistributedSearchTestCase.java:960)
   [junit4]    > 	at org.apache.solr.BaseDistributedSearchTestCase$ShardsRepeatRule$ShardsStatement.evaluate(BaseDistributedSearchTestCase.java:935)
   [junit4]    > 	at java.lang.Thread.run(Thread.java:745)
   [junit4]    > Caused by: org.apache.solr.client.solrj.SolrServerException: IOException occured when talking to server at: http://127.0.0.1:48539/collection1
   [junit4]    > 	at org.apache.solr.client.solrj.impl.HttpSolrClient.executeMethod(HttpSolrClient.java:570)
   [junit4]    > 	at org.apache.solr.client.solrj.impl.HttpSolrClient.request(HttpSolrClient.java:233)
   [junit4]    > 	at org.apache.solr.client.solrj.impl.HttpSolrClient.request(HttpSolrClient.java:225)
   [junit4]    > 	at org.apache.solr.client.solrj.impl.LBHttpSolrClient.doRequest(LBHttpSolrClient.java:370)
   [junit4]    > 	at org.apache.solr.client.solrj.impl.LBHttpSolrClient.request(LBHttpSolrClient.java:325)
   [junit4]    > 	at org.apache.solr.client.solrj.impl.CloudSolrClient.directUpdate(CloudSolrClient.java:622)
   [junit4]    > 	... 49 more
   [junit4]    > Caused by: org.apache.http.NoHttpResponseException: 127.0.0.1:48539 failed to respond
   [junit4]    > 	at org.apache.http.impl.conn.DefaultHttpResponseParser.parseHead(DefaultHttpResponseParser.java:143)
   [junit4]    > 	at org.apache.http.impl.conn.DefaultHttpResponseParser.parseHead(DefaultHttpResponseParser.java:57)
   [junit4]    > 	at org.apache.http.impl.io.AbstractMessageParser.parse(AbstractMessageParser.java:261)
   [junit4]    > 	at org.apache.http.impl.AbstractHttpClientConnection.receiveResponseHeader(AbstractHttpClientConnection.java:283)
   [junit4]    > 	at org.apache.http.impl.conn.DefaultClientConnection.receiveResponseHeader(DefaultClientConnection.java:251)
   [junit4]    > 	at org.apache.http.impl.conn.ManagedClientConnectionImpl.receiveResponseHeader(ManagedClientConnectionImpl.java:197)
   [junit4]    > 	at org.apache.http.protocol.HttpRequestExecutor.doReceiveResponse(HttpRequestExecutor.java:272)
   [junit4]    > 	at org.apache.http.protocol.HttpRequestExecutor.execute(HttpRequestExecutor.java:124)
   [junit4]    > 	at org.apache.http.impl.client.DefaultRequestDirector.tryExecute(DefaultRequestDirector.java:685)
   [junit4]    > 	at org.apache.http.impl.client.DefaultRequestDirector.execute(DefaultRequestDirector.java:487)
   [junit4]    > 	at org.apache.http.impl.client.AbstractHttpClient.doExecute(AbstractHttpClient.java:882)
   [junit4]    > 	at org.apache.http.impl.client.CloseableHttpClient.execute(CloseableHttpClient.java:82)
   [junit4]    > 	at org.apache.http.impl.client.CloseableHttpClient.execute(CloseableHttpClient.java:107)
   [junit4]    > 	at org.apache.http.impl.client.CloseableHttpClient.execute(CloseableHttpClient.java:55)
   [junit4]    > 	at org.apache.solr.client.solrj.impl.HttpSolrClient.executeMethod(HttpSolrClient.java:462)
   [junit4]    > 	... 54 more
   [junit4]   2> 1598502 T4791 C:control_collection S:shard1 c:collection1 oas.SolrTestCaseJ4.deleteCore ###deleteCore
   [junit4]   2> NOTE: leaving temporary files on disk at: /usr/home/jenkins/jenkins-slave/workspace/Lucene-Solr-Tests-5.x-Java7/solr/build/solr-core/test/J0/temp/solr.cloud.RecoveryAfterSoftCommitTest A6DBB2D7042F4A95-001
   [junit4]   2> 66505 T4790 ccr.ThreadLeakControl.checkThreadLeaks WARNING Will linger awaiting termination of 1 leaked thread(s).
   [junit4]   2> NOTE: test params are: codec=Asserting(Lucene50): {a_t=TestBloomFilteredLucenePostings(BloomFilteringPostingsFormat(Lucene50(blocksize=128))), text=PostingsFormat(name=Memory doPackFST= true), intDefault=PostingsFormat(name=LuceneFixedGap), id=Lucene50(blocksize=128), range_facet_l=TestBloomFilteredLucenePostings(BloomFilteringPostingsFormat(Lucene50(blocksize=128))), _version_=PostingsFormat(name=LuceneFixedGap), timestamp=TestBloomFilteredLucenePostings(BloomFilteringPostingsFormat(Lucene50(blocksize=128))), multiDefault=TestBloomFilteredLucenePostings(BloomFilteringPostingsFormat(Lucene50(blocksize=128)))}, docValues:{timestamp=DocValuesFormat(name=Asserting)}, sim=RandomSimilarityProvider(queryNorm=true,coord=yes): {}, locale=nl_NL, timezone=Asia/Pyongyang
   [junit4]   2> NOTE: FreeBSD 9.1-RELEASE-p3 amd64/Oracle Corporation 1.7.0_65 (64-bit)/cpus=16,threads=1,free=96816168,total=301465600
   [junit4]   2> NOTE: All tests run in this JVM: [PluginInfoTest, SearchHandlerTest, TestNoOpRegenerator, HdfsSyncSliceTest, TestZkChroot, TestElisionMultitermQuery, CoreAdminHandlerTest, HttpPartitionTest, VMParamsZkACLAndCredentialsProvidersTest, SpellCheckCollatorTest, DistanceFunctionTest, TestRTGBase, TestCSVResponseWriter, TestShardHandlerFactory, MigrateRouteKeyTest, TestDefaultStatsCache, TestSolrXml, RequestLoggingTest, TestConfigReload, DirectSolrSpellCheckerTest, TestSortingResponseWriter, DistributedQueueTest, EchoParamsTest, DOMUtilTest, CircularListTest, TestClassNameShortening, ChangedSchemaMergeTest, TestSweetSpotSimilarityFactory, ActionThrottleTest, TestFastOutputStream, CustomCollectionTest, TermVectorComponentDistributedTest, SpellCheckComponentTest, TestDistributedMissingSort, CacheHeaderTest, MultiTermTest, TestBulkSchemaAPI, TermVectorComponentTest, TestSolrIndexConfig, TestSystemIdResolver, CurrencyFieldOpenExchangeTest, BlockDirectoryTest, DeleteReplicaTest, LoggingHandlerTest, ReplicationFactorTest, TestExactSharedStatsCache, TestSimpleQParserPlugin, TestMissingGroups, TestStressLucene, SolrXmlInZkTest, SpatialHeatmapFacetsTest, UpdateRequestProcessorFactoryTest, SolrCoreTest, SharedFSAutoReplicaFailoverTest, SolrTestCaseJ4Test, TestLeaderElectionZkExpiry, TestNamedUpdateProcessors, MultiThreadedOCPTest, RecoveryAfterSoftCommitTest]
   [junit4] Completed on J0 in 67.04s, 1 test, 1 error <<< FAILURES!

[...truncated 691 lines...]
BUILD FAILED
/usr/home/jenkins/jenkins-slave/workspace/Lucene-Solr-Tests-5.x-Java7/build.xml:529: The following error occurred while executing this line:
/usr/home/jenkins/jenkins-slave/workspace/Lucene-Solr-Tests-5.x-Java7/build.xml:477: The following error occurred while executing this line:
/usr/home/jenkins/jenkins-slave/workspace/Lucene-Solr-Tests-5.x-Java7/build.xml:61: The following error occurred while executing this line:
/usr/home/jenkins/jenkins-slave/workspace/Lucene-Solr-Tests-5.x-Java7/extra-targets.xml:39: The following error occurred while executing this line:
/usr/home/jenkins/jenkins-slave/workspace/Lucene-Solr-Tests-5.x-Java7/solr/build.xml:191: The following error occurred while executing this line:
/usr/home/jenkins/jenkins-slave/workspace/Lucene-Solr-Tests-5.x-Java7/solr/common-build.xml:509: The following error occurred while executing this line:
/usr/home/jenkins/jenkins-slave/workspace/Lucene-Solr-Tests-5.x-Java7/lucene/common-build.xml:1370: The following error occurred while executing this line:
/usr/home/jenkins/jenkins-slave/workspace/Lucene-Solr-Tests-5.x-Java7/lucene/common-build.xml:976: There were test failures: 478 suites, 1902 tests, 3 errors, 61 ignored (21 assumptions)

Total time: 54 minutes 6 seconds
Build step 'Invoke Ant' marked build as failure
Archiving artifacts
Sending artifact delta relative to Lucene-Solr-Tests-5.x-Java7 #2431
Archived 5 artifacts
Archive block size is 32768
Received 0 blocks and 212405397 bytes
Compression is 0.0%
Took 42 sec
Recording test results
Email was triggered for: Failure
Sending email for trigger: Failure



Mime
View raw message