lucene-dev mailing list archives

Site index · List index
Message view « Date » · « Thread »
Top « Date » · « Thread »
From Apache Jenkins Server <jenk...@builds.apache.org>
Subject [JENKINS] Lucene-Solr-Tests-5.x-Java7 - Build # 2899 - Still Failing
Date Mon, 06 Apr 2015 13:17:49 GMT
Build: https://builds.apache.org/job/Lucene-Solr-Tests-5.x-Java7/2899/

3 tests failed.
FAILED:  org.apache.solr.cloud.LeaderInitiatedRecoveryOnCommitTest.test

Error Message:
IOException occured when talking to server at: http://127.0.0.1:37382/c8n_1x3_commits_shard1_replica2

Stack Trace:
org.apache.solr.client.solrj.SolrServerException: IOException occured when talking to server at: http://127.0.0.1:37382/c8n_1x3_commits_shard1_replica2
	at __randomizedtesting.SeedInfo.seed([47F5277B5BCEDC6F:CFA118A1F532B197]:0)
	at org.apache.solr.client.solrj.impl.HttpSolrClient.executeMethod(HttpSolrClient.java:570)
	at org.apache.solr.client.solrj.impl.HttpSolrClient.request(HttpSolrClient.java:233)
	at org.apache.solr.client.solrj.impl.HttpSolrClient.request(HttpSolrClient.java:225)
	at org.apache.solr.client.solrj.SolrRequest.process(SolrRequest.java:135)
	at org.apache.solr.client.solrj.SolrClient.commit(SolrClient.java:483)
	at org.apache.solr.client.solrj.SolrClient.commit(SolrClient.java:464)
	at org.apache.solr.cloud.LeaderInitiatedRecoveryOnCommitTest.oneShardTest(LeaderInitiatedRecoveryOnCommitTest.java:132)
	at org.apache.solr.cloud.LeaderInitiatedRecoveryOnCommitTest.test(LeaderInitiatedRecoveryOnCommitTest.java:64)
	at sun.reflect.NativeMethodAccessorImpl.invoke0(Native Method)
	at sun.reflect.NativeMethodAccessorImpl.invoke(NativeMethodAccessorImpl.java:57)
	at sun.reflect.DelegatingMethodAccessorImpl.invoke(DelegatingMethodAccessorImpl.java:43)
	at java.lang.reflect.Method.invoke(Method.java:606)
	at com.carrotsearch.randomizedtesting.RandomizedRunner.invoke(RandomizedRunner.java:1627)
	at com.carrotsearch.randomizedtesting.RandomizedRunner$6.evaluate(RandomizedRunner.java:836)
	at com.carrotsearch.randomizedtesting.RandomizedRunner$7.evaluate(RandomizedRunner.java:872)
	at com.carrotsearch.randomizedtesting.RandomizedRunner$8.evaluate(RandomizedRunner.java:886)
	at org.apache.solr.BaseDistributedSearchTestCase$ShardsRepeatRule$ShardsFixedStatement.callStatement(BaseDistributedSearchTestCase.java:960)
	at org.apache.solr.BaseDistributedSearchTestCase$ShardsRepeatRule$ShardsStatement.evaluate(BaseDistributedSearchTestCase.java:935)
	at com.carrotsearch.randomizedtesting.rules.SystemPropertiesRestoreRule$1.evaluate(SystemPropertiesRestoreRule.java:53)
	at org.apache.lucene.util.TestRuleSetupTeardownChained$1.evaluate(TestRuleSetupTeardownChained.java:50)
	at org.apache.lucene.util.AbstractBeforeAfterRule$1.evaluate(AbstractBeforeAfterRule.java:46)
	at org.apache.lucene.util.TestRuleThreadAndTestName$1.evaluate(TestRuleThreadAndTestName.java:49)
	at org.apache.lucene.util.TestRuleIgnoreAfterMaxFailures$1.evaluate(TestRuleIgnoreAfterMaxFailures.java:65)
	at org.apache.lucene.util.TestRuleMarkFailure$1.evaluate(TestRuleMarkFailure.java:48)
	at com.carrotsearch.randomizedtesting.rules.StatementAdapter.evaluate(StatementAdapter.java:36)
	at com.carrotsearch.randomizedtesting.ThreadLeakControl$StatementRunner.run(ThreadLeakControl.java:365)
	at com.carrotsearch.randomizedtesting.ThreadLeakControl.forkTimeoutingTask(ThreadLeakControl.java:798)
	at com.carrotsearch.randomizedtesting.ThreadLeakControl$3.evaluate(ThreadLeakControl.java:458)
	at com.carrotsearch.randomizedtesting.RandomizedRunner.runSingleTest(RandomizedRunner.java:845)
	at com.carrotsearch.randomizedtesting.RandomizedRunner$3.evaluate(RandomizedRunner.java:747)
	at com.carrotsearch.randomizedtesting.RandomizedRunner$4.evaluate(RandomizedRunner.java:781)
	at com.carrotsearch.randomizedtesting.RandomizedRunner$5.evaluate(RandomizedRunner.java:792)
	at com.carrotsearch.randomizedtesting.rules.StatementAdapter.evaluate(StatementAdapter.java:36)
	at com.carrotsearch.randomizedtesting.rules.SystemPropertiesRestoreRule$1.evaluate(SystemPropertiesRestoreRule.java:53)
	at org.apache.lucene.util.AbstractBeforeAfterRule$1.evaluate(AbstractBeforeAfterRule.java:46)
	at com.carrotsearch.randomizedtesting.rules.StatementAdapter.evaluate(StatementAdapter.java:36)
	at org.apache.lucene.util.TestRuleStoreClassName$1.evaluate(TestRuleStoreClassName.java:42)
	at com.carrotsearch.randomizedtesting.rules.NoShadowingOrOverridesOnMethodsRule$1.evaluate(NoShadowingOrOverridesOnMethodsRule.java:39)
	at com.carrotsearch.randomizedtesting.rules.NoShadowingOrOverridesOnMethodsRule$1.evaluate(NoShadowingOrOverridesOnMethodsRule.java:39)
	at com.carrotsearch.randomizedtesting.rules.StatementAdapter.evaluate(StatementAdapter.java:36)
	at com.carrotsearch.randomizedtesting.rules.StatementAdapter.evaluate(StatementAdapter.java:36)
	at com.carrotsearch.randomizedtesting.rules.StatementAdapter.evaluate(StatementAdapter.java:36)
	at org.apache.lucene.util.TestRuleAssertionsRequired$1.evaluate(TestRuleAssertionsRequired.java:54)
	at org.apache.lucene.util.TestRuleMarkFailure$1.evaluate(TestRuleMarkFailure.java:48)
	at org.apache.lucene.util.TestRuleIgnoreAfterMaxFailures$1.evaluate(TestRuleIgnoreAfterMaxFailures.java:65)
	at org.apache.lucene.util.TestRuleIgnoreTestSuites$1.evaluate(TestRuleIgnoreTestSuites.java:55)
	at com.carrotsearch.randomizedtesting.rules.StatementAdapter.evaluate(StatementAdapter.java:36)
	at com.carrotsearch.randomizedtesting.ThreadLeakControl$StatementRunner.run(ThreadLeakControl.java:365)
	at java.lang.Thread.run(Thread.java:745)
Caused by: org.apache.http.NoHttpResponseException: 127.0.0.1:37382 failed to respond
	at org.apache.http.impl.conn.DefaultHttpResponseParser.parseHead(DefaultHttpResponseParser.java:143)
	at org.apache.http.impl.conn.DefaultHttpResponseParser.parseHead(DefaultHttpResponseParser.java:57)
	at org.apache.http.impl.io.AbstractMessageParser.parse(AbstractMessageParser.java:261)
	at org.apache.http.impl.AbstractHttpClientConnection.receiveResponseHeader(AbstractHttpClientConnection.java:283)
	at org.apache.http.impl.conn.DefaultClientConnection.receiveResponseHeader(DefaultClientConnection.java:251)
	at org.apache.http.impl.conn.ManagedClientConnectionImpl.receiveResponseHeader(ManagedClientConnectionImpl.java:197)
	at org.apache.http.protocol.HttpRequestExecutor.doReceiveResponse(HttpRequestExecutor.java:272)
	at org.apache.http.protocol.HttpRequestExecutor.execute(HttpRequestExecutor.java:124)
	at org.apache.http.impl.client.DefaultRequestDirector.tryExecute(DefaultRequestDirector.java:685)
	at org.apache.http.impl.client.DefaultRequestDirector.execute(DefaultRequestDirector.java:487)
	at org.apache.http.impl.client.AbstractHttpClient.doExecute(AbstractHttpClient.java:882)
	at org.apache.http.impl.client.CloseableHttpClient.execute(CloseableHttpClient.java:82)
	at org.apache.http.impl.client.CloseableHttpClient.execute(CloseableHttpClient.java:107)
	at org.apache.http.impl.client.CloseableHttpClient.execute(CloseableHttpClient.java:55)
	at org.apache.solr.client.solrj.impl.HttpSolrClient.executeMethod(HttpSolrClient.java:462)
	... 48 more


FAILED:  org.apache.solr.cloud.RecoveryAfterSoftCommitTest.test

Error Message:
org.apache.solr.client.solrj.SolrServerException: IOException occured when talking to server at: http://127.0.0.1:22460/collection1

Stack Trace:
org.apache.solr.client.solrj.SolrServerException: org.apache.solr.client.solrj.SolrServerException: IOException occured when talking to server at: http://127.0.0.1:22460/collection1
	at __randomizedtesting.SeedInfo.seed([47F5277B5BCEDC6F:CFA118A1F532B197]:0)
	at org.apache.solr.client.solrj.impl.CloudSolrClient.directUpdate(CloudSolrClient.java:625)
	at org.apache.solr.client.solrj.impl.CloudSolrClient.sendRequest(CloudSolrClient.java:948)
	at org.apache.solr.client.solrj.impl.CloudSolrClient.requestWithRetryOnStaleState(CloudSolrClient.java:839)
	at org.apache.solr.client.solrj.impl.CloudSolrClient.request(CloudSolrClient.java:782)
	at org.apache.solr.client.solrj.SolrRequest.process(SolrRequest.java:135)
	at org.apache.solr.client.solrj.SolrClient.add(SolrClient.java:174)
	at org.apache.solr.client.solrj.SolrClient.add(SolrClient.java:139)
	at org.apache.solr.client.solrj.SolrClient.add(SolrClient.java:153)
	at org.apache.solr.cloud.RecoveryAfterSoftCommitTest.test(RecoveryAfterSoftCommitTest.java:88)
	at sun.reflect.NativeMethodAccessorImpl.invoke0(Native Method)
	at sun.reflect.NativeMethodAccessorImpl.invoke(NativeMethodAccessorImpl.java:57)
	at sun.reflect.DelegatingMethodAccessorImpl.invoke(DelegatingMethodAccessorImpl.java:43)
	at java.lang.reflect.Method.invoke(Method.java:606)
	at com.carrotsearch.randomizedtesting.RandomizedRunner.invoke(RandomizedRunner.java:1627)
	at com.carrotsearch.randomizedtesting.RandomizedRunner$6.evaluate(RandomizedRunner.java:836)
	at com.carrotsearch.randomizedtesting.RandomizedRunner$7.evaluate(RandomizedRunner.java:872)
	at com.carrotsearch.randomizedtesting.RandomizedRunner$8.evaluate(RandomizedRunner.java:886)
	at org.apache.solr.BaseDistributedSearchTestCase$ShardsRepeatRule$ShardsFixedStatement.callStatement(BaseDistributedSearchTestCase.java:960)
	at org.apache.solr.BaseDistributedSearchTestCase$ShardsRepeatRule$ShardsStatement.evaluate(BaseDistributedSearchTestCase.java:935)
	at com.carrotsearch.randomizedtesting.rules.SystemPropertiesRestoreRule$1.evaluate(SystemPropertiesRestoreRule.java:53)
	at org.apache.lucene.util.TestRuleSetupTeardownChained$1.evaluate(TestRuleSetupTeardownChained.java:50)
	at org.apache.lucene.util.AbstractBeforeAfterRule$1.evaluate(AbstractBeforeAfterRule.java:46)
	at org.apache.lucene.util.TestRuleThreadAndTestName$1.evaluate(TestRuleThreadAndTestName.java:49)
	at org.apache.lucene.util.TestRuleIgnoreAfterMaxFailures$1.evaluate(TestRuleIgnoreAfterMaxFailures.java:65)
	at org.apache.lucene.util.TestRuleMarkFailure$1.evaluate(TestRuleMarkFailure.java:48)
	at com.carrotsearch.randomizedtesting.rules.StatementAdapter.evaluate(StatementAdapter.java:36)
	at com.carrotsearch.randomizedtesting.ThreadLeakControl$StatementRunner.run(ThreadLeakControl.java:365)
	at com.carrotsearch.randomizedtesting.ThreadLeakControl.forkTimeoutingTask(ThreadLeakControl.java:798)
	at com.carrotsearch.randomizedtesting.ThreadLeakControl$3.evaluate(ThreadLeakControl.java:458)
	at com.carrotsearch.randomizedtesting.RandomizedRunner.runSingleTest(RandomizedRunner.java:845)
	at com.carrotsearch.randomizedtesting.RandomizedRunner$3.evaluate(RandomizedRunner.java:747)
	at com.carrotsearch.randomizedtesting.RandomizedRunner$4.evaluate(RandomizedRunner.java:781)
	at com.carrotsearch.randomizedtesting.RandomizedRunner$5.evaluate(RandomizedRunner.java:792)
	at com.carrotsearch.randomizedtesting.rules.StatementAdapter.evaluate(StatementAdapter.java:36)
	at com.carrotsearch.randomizedtesting.rules.SystemPropertiesRestoreRule$1.evaluate(SystemPropertiesRestoreRule.java:53)
	at org.apache.lucene.util.AbstractBeforeAfterRule$1.evaluate(AbstractBeforeAfterRule.java:46)
	at com.carrotsearch.randomizedtesting.rules.StatementAdapter.evaluate(StatementAdapter.java:36)
	at org.apache.lucene.util.TestRuleStoreClassName$1.evaluate(TestRuleStoreClassName.java:42)
	at com.carrotsearch.randomizedtesting.rules.NoShadowingOrOverridesOnMethodsRule$1.evaluate(NoShadowingOrOverridesOnMethodsRule.java:39)
	at com.carrotsearch.randomizedtesting.rules.NoShadowingOrOverridesOnMethodsRule$1.evaluate(NoShadowingOrOverridesOnMethodsRule.java:39)
	at com.carrotsearch.randomizedtesting.rules.StatementAdapter.evaluate(StatementAdapter.java:36)
	at com.carrotsearch.randomizedtesting.rules.StatementAdapter.evaluate(StatementAdapter.java:36)
	at com.carrotsearch.randomizedtesting.rules.StatementAdapter.evaluate(StatementAdapter.java:36)
	at org.apache.lucene.util.TestRuleAssertionsRequired$1.evaluate(TestRuleAssertionsRequired.java:54)
	at org.apache.lucene.util.TestRuleMarkFailure$1.evaluate(TestRuleMarkFailure.java:48)
	at org.apache.lucene.util.TestRuleIgnoreAfterMaxFailures$1.evaluate(TestRuleIgnoreAfterMaxFailures.java:65)
	at org.apache.lucene.util.TestRuleIgnoreTestSuites$1.evaluate(TestRuleIgnoreTestSuites.java:55)
	at com.carrotsearch.randomizedtesting.rules.StatementAdapter.evaluate(StatementAdapter.java:36)
	at com.carrotsearch.randomizedtesting.ThreadLeakControl$StatementRunner.run(ThreadLeakControl.java:365)
	at java.lang.Thread.run(Thread.java:745)
Caused by: org.apache.solr.client.solrj.SolrServerException: IOException occured when talking to server at: http://127.0.0.1:22460/collection1
	at org.apache.solr.client.solrj.impl.HttpSolrClient.executeMethod(HttpSolrClient.java:570)
	at org.apache.solr.client.solrj.impl.HttpSolrClient.request(HttpSolrClient.java:233)
	at org.apache.solr.client.solrj.impl.HttpSolrClient.request(HttpSolrClient.java:225)
	at org.apache.solr.client.solrj.impl.LBHttpSolrClient.doRequest(LBHttpSolrClient.java:370)
	at org.apache.solr.client.solrj.impl.LBHttpSolrClient.request(LBHttpSolrClient.java:325)
	at org.apache.solr.client.solrj.impl.CloudSolrClient.directUpdate(CloudSolrClient.java:622)
	... 49 more
Caused by: org.apache.http.NoHttpResponseException: 127.0.0.1:22460 failed to respond
	at org.apache.http.impl.conn.DefaultHttpResponseParser.parseHead(DefaultHttpResponseParser.java:143)
	at org.apache.http.impl.conn.DefaultHttpResponseParser.parseHead(DefaultHttpResponseParser.java:57)
	at org.apache.http.impl.io.AbstractMessageParser.parse(AbstractMessageParser.java:261)
	at org.apache.http.impl.AbstractHttpClientConnection.receiveResponseHeader(AbstractHttpClientConnection.java:283)
	at org.apache.http.impl.conn.DefaultClientConnection.receiveResponseHeader(DefaultClientConnection.java:251)
	at org.apache.http.impl.conn.ManagedClientConnectionImpl.receiveResponseHeader(ManagedClientConnectionImpl.java:197)
	at org.apache.http.protocol.HttpRequestExecutor.doReceiveResponse(HttpRequestExecutor.java:272)
	at org.apache.http.protocol.HttpRequestExecutor.execute(HttpRequestExecutor.java:124)
	at org.apache.http.impl.client.DefaultRequestDirector.tryExecute(DefaultRequestDirector.java:685)
	at org.apache.http.impl.client.DefaultRequestDirector.execute(DefaultRequestDirector.java:487)
	at org.apache.http.impl.client.AbstractHttpClient.doExecute(AbstractHttpClient.java:882)
	at org.apache.http.impl.client.CloseableHttpClient.execute(CloseableHttpClient.java:82)
	at org.apache.http.impl.client.CloseableHttpClient.execute(CloseableHttpClient.java:107)
	at org.apache.http.impl.client.CloseableHttpClient.execute(CloseableHttpClient.java:55)
	at org.apache.solr.client.solrj.impl.HttpSolrClient.executeMethod(HttpSolrClient.java:462)
	... 54 more


FAILED:  org.apache.solr.cloud.ReplicationFactorTest.test

Error Message:
org.apache.solr.client.solrj.SolrServerException: IOException occured when talking to server at: http://127.0.0.1:16215/repfacttest_c8n_1x3_shard1_replica3

Stack Trace:
org.apache.solr.client.solrj.SolrServerException: org.apache.solr.client.solrj.SolrServerException: IOException occured when talking to server at: http://127.0.0.1:16215/repfacttest_c8n_1x3_shard1_replica3
	at __randomizedtesting.SeedInfo.seed([47F5277B5BCEDC6F:CFA118A1F532B197]:0)
	at org.apache.solr.client.solrj.impl.CloudSolrClient.directUpdate(CloudSolrClient.java:625)
	at org.apache.solr.client.solrj.impl.CloudSolrClient.sendRequest(CloudSolrClient.java:948)
	at org.apache.solr.client.solrj.impl.CloudSolrClient.requestWithRetryOnStaleState(CloudSolrClient.java:839)
	at org.apache.solr.client.solrj.impl.CloudSolrClient.request(CloudSolrClient.java:782)
	at org.apache.solr.client.solrj.SolrClient.request(SolrClient.java:1220)
	at org.apache.solr.cloud.ReplicationFactorTest.sendDoc(ReplicationFactorTest.java:308)
	at org.apache.solr.cloud.ReplicationFactorTest.testRf3(ReplicationFactorTest.java:234)
	at org.apache.solr.cloud.ReplicationFactorTest.test(ReplicationFactorTest.java:113)
	at sun.reflect.NativeMethodAccessorImpl.invoke0(Native Method)
	at sun.reflect.NativeMethodAccessorImpl.invoke(NativeMethodAccessorImpl.java:57)
	at sun.reflect.DelegatingMethodAccessorImpl.invoke(DelegatingMethodAccessorImpl.java:43)
	at java.lang.reflect.Method.invoke(Method.java:606)
	at com.carrotsearch.randomizedtesting.RandomizedRunner.invoke(RandomizedRunner.java:1627)
	at com.carrotsearch.randomizedtesting.RandomizedRunner$6.evaluate(RandomizedRunner.java:836)
	at com.carrotsearch.randomizedtesting.RandomizedRunner$7.evaluate(RandomizedRunner.java:872)
	at com.carrotsearch.randomizedtesting.RandomizedRunner$8.evaluate(RandomizedRunner.java:886)
	at org.apache.solr.BaseDistributedSearchTestCase$ShardsRepeatRule$ShardsFixedStatement.callStatement(BaseDistributedSearchTestCase.java:960)
	at org.apache.solr.BaseDistributedSearchTestCase$ShardsRepeatRule$ShardsStatement.evaluate(BaseDistributedSearchTestCase.java:935)
	at com.carrotsearch.randomizedtesting.rules.SystemPropertiesRestoreRule$1.evaluate(SystemPropertiesRestoreRule.java:53)
	at org.apache.lucene.util.TestRuleSetupTeardownChained$1.evaluate(TestRuleSetupTeardownChained.java:50)
	at org.apache.lucene.util.AbstractBeforeAfterRule$1.evaluate(AbstractBeforeAfterRule.java:46)
	at org.apache.lucene.util.TestRuleThreadAndTestName$1.evaluate(TestRuleThreadAndTestName.java:49)
	at org.apache.lucene.util.TestRuleIgnoreAfterMaxFailures$1.evaluate(TestRuleIgnoreAfterMaxFailures.java:65)
	at org.apache.lucene.util.TestRuleMarkFailure$1.evaluate(TestRuleMarkFailure.java:48)
	at com.carrotsearch.randomizedtesting.rules.StatementAdapter.evaluate(StatementAdapter.java:36)
	at com.carrotsearch.randomizedtesting.ThreadLeakControl$StatementRunner.run(ThreadLeakControl.java:365)
	at com.carrotsearch.randomizedtesting.ThreadLeakControl.forkTimeoutingTask(ThreadLeakControl.java:798)
	at com.carrotsearch.randomizedtesting.ThreadLeakControl$3.evaluate(ThreadLeakControl.java:458)
	at com.carrotsearch.randomizedtesting.RandomizedRunner.runSingleTest(RandomizedRunner.java:845)
	at com.carrotsearch.randomizedtesting.RandomizedRunner$3.evaluate(RandomizedRunner.java:747)
	at com.carrotsearch.randomizedtesting.RandomizedRunner$4.evaluate(RandomizedRunner.java:781)
	at com.carrotsearch.randomizedtesting.RandomizedRunner$5.evaluate(RandomizedRunner.java:792)
	at com.carrotsearch.randomizedtesting.rules.StatementAdapter.evaluate(StatementAdapter.java:36)
	at com.carrotsearch.randomizedtesting.rules.SystemPropertiesRestoreRule$1.evaluate(SystemPropertiesRestoreRule.java:53)
	at org.apache.lucene.util.AbstractBeforeAfterRule$1.evaluate(AbstractBeforeAfterRule.java:46)
	at com.carrotsearch.randomizedtesting.rules.StatementAdapter.evaluate(StatementAdapter.java:36)
	at org.apache.lucene.util.TestRuleStoreClassName$1.evaluate(TestRuleStoreClassName.java:42)
	at com.carrotsearch.randomizedtesting.rules.NoShadowingOrOverridesOnMethodsRule$1.evaluate(NoShadowingOrOverridesOnMethodsRule.java:39)
	at com.carrotsearch.randomizedtesting.rules.NoShadowingOrOverridesOnMethodsRule$1.evaluate(NoShadowingOrOverridesOnMethodsRule.java:39)
	at com.carrotsearch.randomizedtesting.rules.StatementAdapter.evaluate(StatementAdapter.java:36)
	at com.carrotsearch.randomizedtesting.rules.StatementAdapter.evaluate(StatementAdapter.java:36)
	at com.carrotsearch.randomizedtesting.rules.StatementAdapter.evaluate(StatementAdapter.java:36)
	at org.apache.lucene.util.TestRuleAssertionsRequired$1.evaluate(TestRuleAssertionsRequired.java:54)
	at org.apache.lucene.util.TestRuleMarkFailure$1.evaluate(TestRuleMarkFailure.java:48)
	at org.apache.lucene.util.TestRuleIgnoreAfterMaxFailures$1.evaluate(TestRuleIgnoreAfterMaxFailures.java:65)
	at org.apache.lucene.util.TestRuleIgnoreTestSuites$1.evaluate(TestRuleIgnoreTestSuites.java:55)
	at com.carrotsearch.randomizedtesting.rules.StatementAdapter.evaluate(StatementAdapter.java:36)
	at com.carrotsearch.randomizedtesting.ThreadLeakControl$StatementRunner.run(ThreadLeakControl.java:365)
	at java.lang.Thread.run(Thread.java:745)
Caused by: org.apache.solr.client.solrj.SolrServerException: IOException occured when talking to server at: http://127.0.0.1:16215/repfacttest_c8n_1x3_shard1_replica3
	at org.apache.solr.client.solrj.impl.HttpSolrClient.executeMethod(HttpSolrClient.java:570)
	at org.apache.solr.client.solrj.impl.HttpSolrClient.request(HttpSolrClient.java:233)
	at org.apache.solr.client.solrj.impl.HttpSolrClient.request(HttpSolrClient.java:225)
	at org.apache.solr.client.solrj.impl.LBHttpSolrClient.doRequest(LBHttpSolrClient.java:370)
	at org.apache.solr.client.solrj.impl.LBHttpSolrClient.request(LBHttpSolrClient.java:325)
	at org.apache.solr.client.solrj.impl.CloudSolrClient.directUpdate(CloudSolrClient.java:622)
	... 48 more
Caused by: org.apache.http.NoHttpResponseException: 127.0.0.1:16215 failed to respond
	at org.apache.http.impl.conn.DefaultHttpResponseParser.parseHead(DefaultHttpResponseParser.java:143)
	at org.apache.http.impl.conn.DefaultHttpResponseParser.parseHead(DefaultHttpResponseParser.java:57)
	at org.apache.http.impl.io.AbstractMessageParser.parse(AbstractMessageParser.java:261)
	at org.apache.http.impl.AbstractHttpClientConnection.receiveResponseHeader(AbstractHttpClientConnection.java:283)
	at org.apache.http.impl.conn.DefaultClientConnection.receiveResponseHeader(DefaultClientConnection.java:251)
	at org.apache.http.impl.conn.ManagedClientConnectionImpl.receiveResponseHeader(ManagedClientConnectionImpl.java:197)
	at org.apache.http.protocol.HttpRequestExecutor.doReceiveResponse(HttpRequestExecutor.java:272)
	at org.apache.http.protocol.HttpRequestExecutor.execute(HttpRequestExecutor.java:124)
	at org.apache.http.impl.client.DefaultRequestDirector.tryExecute(DefaultRequestDirector.java:685)
	at org.apache.http.impl.client.DefaultRequestDirector.execute(DefaultRequestDirector.java:487)
	at org.apache.http.impl.client.AbstractHttpClient.doExecute(AbstractHttpClient.java:882)
	at org.apache.http.impl.client.CloseableHttpClient.execute(CloseableHttpClient.java:82)
	at org.apache.http.impl.client.CloseableHttpClient.execute(CloseableHttpClient.java:107)
	at org.apache.http.impl.client.CloseableHttpClient.execute(CloseableHttpClient.java:55)
	at org.apache.solr.client.solrj.impl.HttpSolrClient.executeMethod(HttpSolrClient.java:462)
	... 53 more




Build Log:
[...truncated 9841 lines...]
   [junit4] Suite: org.apache.solr.cloud.RecoveryAfterSoftCommitTest
   [junit4]   2> Creating dataDir: /usr/home/jenkins/jenkins-slave/workspace/Lucene-Solr-Tests-5.x-Java7/solr/build/solr-core/test/J3/temp/solr.cloud.RecoveryAfterSoftCommitTest 47F5277B5BCEDC6F-001/init-core-data-001
   [junit4]   2> 653060 T1976 oas.BaseDistributedSearchTestCase.initHostContext Setting hostContext system property: /
   [junit4]   2> 653067 T1976 oasc.ZkTestServer.run STARTING ZK TEST SERVER
   [junit4]   1> client port:0.0.0.0/0.0.0.0:0
   [junit4]   2> 653068 T1977 oasc.ZkTestServer$ZKServerMain.runFromConfig Starting server
   [junit4]   2> 653168 T1976 oasc.ZkTestServer.run start zk server on port:22447
   [junit4]   2> 653169 T1976 oascc.SolrZkClient.createZkCredentialsToAddAutomatically Using default ZkCredentialsProvider
   [junit4]   2> 653170 T1976 oascc.ConnectionManager.waitForConnected Waiting for client to connect to ZooKeeper
   [junit4]   2> 653174 T1984 oascc.ConnectionManager.process Watcher org.apache.solr.common.cloud.ConnectionManager@110ad99a name:ZooKeeperConnection Watcher:127.0.0.1:22447 got event WatchedEvent state:SyncConnected type:None path:null path:null type:None
   [junit4]   2> 653174 T1976 oascc.ConnectionManager.waitForConnected Client is connected to ZooKeeper
   [junit4]   2> 653174 T1976 oascc.SolrZkClient.createZkACLProvider Using default ZkACLProvider
   [junit4]   2> 653175 T1976 oascc.SolrZkClient.makePath makePath: /solr
   [junit4]   2> 653177 T1976 oascc.SolrZkClient.createZkCredentialsToAddAutomatically Using default ZkCredentialsProvider
   [junit4]   2> 653178 T1976 oascc.ConnectionManager.waitForConnected Waiting for client to connect to ZooKeeper
   [junit4]   2> 653179 T1987 oascc.ConnectionManager.process Watcher org.apache.solr.common.cloud.ConnectionManager@30950d04 name:ZooKeeperConnection Watcher:127.0.0.1:22447/solr got event WatchedEvent state:SyncConnected type:None path:null path:null type:None
   [junit4]   2> 653179 T1976 oascc.ConnectionManager.waitForConnected Client is connected to ZooKeeper
   [junit4]   2> 653180 T1976 oascc.SolrZkClient.createZkACLProvider Using default ZkACLProvider
   [junit4]   2> 653180 T1976 oascc.SolrZkClient.makePath makePath: /collections/collection1
   [junit4]   2> 653182 T1976 oascc.SolrZkClient.makePath makePath: /collections/collection1/shards
   [junit4]   2> 653183 T1976 oascc.SolrZkClient.makePath makePath: /collections/control_collection
   [junit4]   2> 653184 T1976 oascc.SolrZkClient.makePath makePath: /collections/control_collection/shards
   [junit4]   2> 653186 T1976 oasc.AbstractZkTestCase.putConfig put /usr/home/jenkins/jenkins-slave/workspace/Lucene-Solr-Tests-5.x-Java7/solr/core/src/test-files/solr/collection1/conf/solrconfig-tlog.xml to /configs/conf1/solrconfig.xml
   [junit4]   2> 653186 T1976 oascc.SolrZkClient.makePath makePath: /configs/conf1/solrconfig.xml
   [junit4]   2> 653189 T1976 oasc.AbstractZkTestCase.putConfig put /usr/home/jenkins/jenkins-slave/workspace/Lucene-Solr-Tests-5.x-Java7/solr/core/src/test-files/solr/collection1/conf/schema.xml to /configs/conf1/schema.xml
   [junit4]   2> 653189 T1976 oascc.SolrZkClient.makePath makePath: /configs/conf1/schema.xml
   [junit4]   2> 653291 T1976 oasc.AbstractZkTestCase.putConfig put /usr/home/jenkins/jenkins-slave/workspace/Lucene-Solr-Tests-5.x-Java7/solr/core/src/test-files/solr/collection1/conf/solrconfig.snippet.randomindexconfig.xml to /configs/conf1/solrconfig.snippet.randomindexconfig.xml
   [junit4]   2> 653291 T1976 oascc.SolrZkClient.makePath makePath: /configs/conf1/solrconfig.snippet.randomindexconfig.xml
   [junit4]   2> 653293 T1976 oasc.AbstractZkTestCase.putConfig put /usr/home/jenkins/jenkins-slave/workspace/Lucene-Solr-Tests-5.x-Java7/solr/core/src/test-files/solr/collection1/conf/stopwords.txt to /configs/conf1/stopwords.txt
   [junit4]   2> 653294 T1976 oascc.SolrZkClient.makePath makePath: /configs/conf1/stopwords.txt
   [junit4]   2> 653295 T1976 oasc.AbstractZkTestCase.putConfig put /usr/home/jenkins/jenkins-slave/workspace/Lucene-Solr-Tests-5.x-Java7/solr/core/src/test-files/solr/collection1/conf/protwords.txt to /configs/conf1/protwords.txt
   [junit4]   2> 653296 T1976 oascc.SolrZkClient.makePath makePath: /configs/conf1/protwords.txt
   [junit4]   2> 653298 T1976 oasc.AbstractZkTestCase.putConfig put /usr/home/jenkins/jenkins-slave/workspace/Lucene-Solr-Tests-5.x-Java7/solr/core/src/test-files/solr/collection1/conf/currency.xml to /configs/conf1/currency.xml
   [junit4]   2> 653298 T1976 oascc.SolrZkClient.makePath makePath: /configs/conf1/currency.xml
   [junit4]   2> 653300 T1976 oasc.AbstractZkTestCase.putConfig put /usr/home/jenkins/jenkins-slave/workspace/Lucene-Solr-Tests-5.x-Java7/solr/core/src/test-files/solr/collection1/conf/enumsConfig.xml to /configs/conf1/enumsConfig.xml
   [junit4]   2> 653300 T1976 oascc.SolrZkClient.makePath makePath: /configs/conf1/enumsConfig.xml
   [junit4]   2> 653302 T1976 oasc.AbstractZkTestCase.putConfig put /usr/home/jenkins/jenkins-slave/workspace/Lucene-Solr-Tests-5.x-Java7/solr/core/src/test-files/solr/collection1/conf/open-exchange-rates.json to /configs/conf1/open-exchange-rates.json
   [junit4]   2> 653302 T1976 oascc.SolrZkClient.makePath makePath: /configs/conf1/open-exchange-rates.json
   [junit4]   2> 653304 T1976 oasc.AbstractZkTestCase.putConfig put /usr/home/jenkins/jenkins-slave/workspace/Lucene-Solr-Tests-5.x-Java7/solr/core/src/test-files/solr/collection1/conf/mapping-ISOLatin1Accent.txt to /configs/conf1/mapping-ISOLatin1Accent.txt
   [junit4]   2> 653304 T1976 oascc.SolrZkClient.makePath makePath: /configs/conf1/mapping-ISOLatin1Accent.txt
   [junit4]   2> 653306 T1976 oasc.AbstractZkTestCase.putConfig put /usr/home/jenkins/jenkins-slave/workspace/Lucene-Solr-Tests-5.x-Java7/solr/core/src/test-files/solr/collection1/conf/old_synonyms.txt to /configs/conf1/old_synonyms.txt
   [junit4]   2> 653307 T1976 oascc.SolrZkClient.makePath makePath: /configs/conf1/old_synonyms.txt
   [junit4]   2> 653308 T1976 oasc.AbstractZkTestCase.putConfig put /usr/home/jenkins/jenkins-slave/workspace/Lucene-Solr-Tests-5.x-Java7/solr/core/src/test-files/solr/collection1/conf/synonyms.txt to /configs/conf1/synonyms.txt
   [junit4]   2> 653309 T1976 oascc.SolrZkClient.makePath makePath: /configs/conf1/synonyms.txt
   [junit4]   2> 654775 T1976 oas.SolrTestCaseJ4.writeCoreProperties Writing core.properties file to /usr/home/jenkins/jenkins-slave/workspace/Lucene-Solr-Tests-5.x-Java7/solr/build/solr-core/test/J3/temp/solr.cloud.RecoveryAfterSoftCommitTest 47F5277B5BCEDC6F-001/control-001/cores/collection1
   [junit4]   2> 654779 T1976 oejs.Server.doStart jetty-8.1.10.v20130312
   [junit4]   2> 654781 T1976 oejs.AbstractConnector.doStart Started SocketConnector@127.0.0.1:22455
   [junit4]   2> 654782 T1976 oascse.JettySolrRunner$1.lifeCycleStarted Jetty properties: {hostPort=22454, hostContext=/, coreRootDirectory=/usr/home/jenkins/jenkins-slave/workspace/Lucene-Solr-Tests-5.x-Java7/solr/build/solr-core/test/J3/temp/solr.cloud.RecoveryAfterSoftCommitTest 47F5277B5BCEDC6F-001/control-001/cores, solr.data.dir=/usr/home/jenkins/jenkins-slave/workspace/Lucene-Solr-Tests-5.x-Java7/solr/build/solr-core/test/J3/temp/solr.cloud.RecoveryAfterSoftCommitTest 47F5277B5BCEDC6F-001/tempDir-001/control/data}
   [junit4]   2> 654783 T1976 oass.SolrDispatchFilter.init SolrDispatchFilter.init()sun.misc.Launcher$AppClassLoader@17072b90
   [junit4]   2> 654783 T1976 oasc.SolrResourceLoader.<init> new SolrResourceLoader for directory: '/usr/home/jenkins/jenkins-slave/workspace/Lucene-Solr-Tests-5.x-Java7/solr/build/solr-core/test/J3/temp/solr.cloud.RecoveryAfterSoftCommitTest 47F5277B5BCEDC6F-001/control-001/'
   [junit4]   2> 654821 T1976 oasc.SolrXmlConfig.fromFile Loading container configuration from /usr/home/jenkins/jenkins-slave/workspace/Lucene-Solr-Tests-5.x-Java7/solr/build/solr-core/test/J3/temp/solr.cloud.RecoveryAfterSoftCommitTest 47F5277B5BCEDC6F-001/control-001/solr.xml
   [junit4]   2> 654863 T1976 oasc.CorePropertiesLocator.<init> Config-defined core root directory: /usr/home/jenkins/jenkins-slave/workspace/Lucene-Solr-Tests-5.x-Java7/solr/build/solr-core/test/J3/temp/solr.cloud.RecoveryAfterSoftCommitTest 47F5277B5BCEDC6F-001/control-001/cores
   [junit4]   2> 654863 T1976 oasc.CoreContainer.<init> New CoreContainer 594929581
   [junit4]   2> 654863 T1976 oasc.CoreContainer.load Loading cores into CoreContainer [instanceDir=/usr/home/jenkins/jenkins-slave/workspace/Lucene-Solr-Tests-5.x-Java7/solr/build/solr-core/test/J3/temp/solr.cloud.RecoveryAfterSoftCommitTest 47F5277B5BCEDC6F-001/control-001/]
   [junit4]   2> 654864 T1976 oasc.CoreContainer.load loading shared library: /usr/home/jenkins/jenkins-slave/workspace/Lucene-Solr-Tests-5.x-Java7/solr/build/solr-core/test/J3/temp/solr.cloud.RecoveryAfterSoftCommitTest 47F5277B5BCEDC6F-001/control-001/lib
   [junit4]   2> 654864 T1976 oasc.SolrResourceLoader.addToClassLoader WARN Can't find (or read) directory to add to classloader: lib (resolved as: /usr/home/jenkins/jenkins-slave/workspace/Lucene-Solr-Tests-5.x-Java7/solr/build/solr-core/test/J3/temp/solr.cloud.RecoveryAfterSoftCommitTest 47F5277B5BCEDC6F-001/control-001/lib).
   [junit4]   2> 654874 T1976 oashc.HttpShardHandlerFactory.getParameter Setting socketTimeout to: 90000
   [junit4]   2> 654874 T1976 oashc.HttpShardHandlerFactory.getParameter Setting urlScheme to: 
   [junit4]   2> 654875 T1976 oashc.HttpShardHandlerFactory.getParameter Setting connTimeout to: 15000
   [junit4]   2> 654875 T1976 oashc.HttpShardHandlerFactory.getParameter Setting maxConnectionsPerHost to: 20
   [junit4]   2> 654875 T1976 oashc.HttpShardHandlerFactory.getParameter Setting maxConnections to: 10000
   [junit4]   2> 654875 T1976 oashc.HttpShardHandlerFactory.getParameter Setting corePoolSize to: 0
   [junit4]   2> 654876 T1976 oashc.HttpShardHandlerFactory.getParameter Setting maximumPoolSize to: 2147483647
   [junit4]   2> 654876 T1976 oashc.HttpShardHandlerFactory.getParameter Setting maxThreadIdleTime to: 5
   [junit4]   2> 654876 T1976 oashc.HttpShardHandlerFactory.getParameter Setting sizeOfQueue to: -1
   [junit4]   2> 654876 T1976 oashc.HttpShardHandlerFactory.getParameter Setting fairnessPolicy to: false
   [junit4]   2> 654876 T1976 oashc.HttpShardHandlerFactory.getParameter Setting useRetries to: false
   [junit4]   2> 654882 T1976 oasu.UpdateShardHandler.<init> Creating UpdateShardHandler HTTP client with params: socketTimeout=340000&connTimeout=45000&retry=true
   [junit4]   2> 654883 T1976 oasl.LogWatcher.createWatcher SLF4J impl is org.slf4j.impl.Log4jLoggerFactory
   [junit4]   2> 654883 T1976 oasl.LogWatcher.newRegisteredLogWatcher Registering Log Listener [Log4j (org.slf4j.impl.Log4jLoggerFactory)]
   [junit4]   2> 654883 T1976 oasc.CoreContainer.load Node Name: 127.0.0.1
   [junit4]   2> 654884 T1976 oasc.ZkContainer.initZooKeeper Zookeeper client=127.0.0.1:22447/solr
   [junit4]   2> 654884 T1976 oasc.ZkController.checkChrootPath zkHost includes chroot
   [junit4]   2> 654884 T1976 oascc.SolrZkClient.createZkCredentialsToAddAutomatically Using default ZkCredentialsProvider
   [junit4]   2> 654885 T1976 oascc.ConnectionManager.waitForConnected Waiting for client to connect to ZooKeeper
   [junit4]   2> 654886 T1999 oascc.ConnectionManager.process Watcher org.apache.solr.common.cloud.ConnectionManager@646e9be3 name:ZooKeeperConnection Watcher:127.0.0.1:22447 got event WatchedEvent state:SyncConnected type:None path:null path:null type:None
   [junit4]   2> 654887 T1976 oascc.ConnectionManager.waitForConnected Client is connected to ZooKeeper
   [junit4]   2> 654888 T1976 oascc.SolrZkClient.createZkACLProvider Using default ZkACLProvider
   [junit4]   2> 654889 T1976 oascc.ConnectionManager.waitForConnected Waiting for client to connect to ZooKeeper
   [junit4]   2> 654890 T2002 oascc.ConnectionManager.process Watcher org.apache.solr.common.cloud.ConnectionManager@1c3dae1f name:ZooKeeperConnection Watcher:127.0.0.1:22447/solr got event WatchedEvent state:SyncConnected type:None path:null path:null type:None
   [junit4]   2> 654890 T1976 oascc.ConnectionManager.waitForConnected Client is connected to ZooKeeper
   [junit4]   2> 654891 T1976 oascc.SolrZkClient.makePath makePath: /overseer/queue
   [junit4]   2> 654893 T1976 oascc.SolrZkClient.makePath makePath: /overseer/collection-queue-work
   [junit4]   2> 654894 T1976 oascc.SolrZkClient.makePath makePath: /overseer/collection-map-running
   [junit4]   2> 654895 T1976 oascc.SolrZkClient.makePath makePath: /overseer/collection-map-completed
   [junit4]   2> 654897 T1976 oascc.SolrZkClient.makePath makePath: /overseer/collection-map-failure
   [junit4]   2> 654898 T1976 oascc.SolrZkClient.makePath makePath: /live_nodes
   [junit4]   2> 654900 T1976 oascc.SolrZkClient.makePath makePath: /aliases.json
   [junit4]   2> 654901 T1976 oascc.SolrZkClient.makePath makePath: /clusterstate.json
   [junit4]   2> 654901 T1976 oasc.ZkController.createEphemeralLiveNode Register node as live in ZooKeeper:/live_nodes/127.0.0.1:22454_
   [junit4]   2> 654902 T1976 oascc.SolrZkClient.makePath makePath: /live_nodes/127.0.0.1:22454_
   [junit4]   2> 654903 T1976 oascc.SolrZkClient.makePath makePath: /overseer_elect
   [junit4]   2> 654904 T1976 oascc.SolrZkClient.makePath makePath: /overseer_elect/election
   [junit4]   2> 654905 T1976 oasc.Overseer.close Overseer (id=null) closing
   [junit4]   2> 654906 T1976 oasc.OverseerElectionContext.runLeaderProcess I am going to be the leader 127.0.0.1:22454_
   [junit4]   2> 654906 T1976 oascc.SolrZkClient.makePath makePath: /overseer_elect/leader
   [junit4]   2> 654908 T1976 oasc.Overseer.start Overseer (id=93606581219819523-127.0.0.1:22454_-n_0000000000) starting
   [junit4]   2> 654909 T1976 oascc.SolrZkClient.makePath makePath: /overseer/queue-work
   [junit4]   2> 654914 T1976 oasc.OverseerAutoReplicaFailoverThread.<init> Starting OverseerAutoReplicaFailoverThread autoReplicaFailoverWorkLoopDelay=10000 autoReplicaFailoverWaitAfterExpiration=30000 autoReplicaFailoverBadNodeExpiration=60000
   [junit4]   2> 654914 T2004 oasc.OverseerCollectionProcessor.run Process current queue of collection creations
   [junit4]   2> 654914 T1976 oascc.ZkStateReader.createClusterStateWatchersAndUpdate Updating cluster state from ZooKeeper... 
   [junit4]   2> 654914 T2003 oasc.Overseer$ClusterStateUpdater.run Starting to work on the main queue
   [junit4]   2> 654917 T1976 oasc.CorePropertiesLocator.discover Looking for core definitions underneath /usr/home/jenkins/jenkins-slave/workspace/Lucene-Solr-Tests-5.x-Java7/solr/build/solr-core/test/J3/temp/solr.cloud.RecoveryAfterSoftCommitTest 47F5277B5BCEDC6F-001/control-001/cores
   [junit4]   2> 654919 T1976 oasc.CoreDescriptor.<init> CORE DESCRIPTOR: {name=collection1, coreNodeName=, absoluteInstDir=/usr/home/jenkins/jenkins-slave/workspace/Lucene-Solr-Tests-5.x-Java7/solr/build/solr-core/test/J3/temp/solr.cloud.RecoveryAfterSoftCommitTest 47F5277B5BCEDC6F-001/control-001/cores/collection1/, dataDir=data/, transient=false, collection=control_collection, loadOnStartup=true, config=solrconfig.xml, shard=, schema=schema.xml, instanceDir=/usr/home/jenkins/jenkins-slave/workspace/Lucene-Solr-Tests-5.x-Java7/solr/build/solr-core/test/J3/temp/solr.cloud.RecoveryAfterSoftCommitTest 47F5277B5BCEDC6F-001/control-001/cores/collection1}
   [junit4]   2> 654919 T1976 oasc.CorePropertiesLocator.discoverUnder Found core collection1 in /usr/home/jenkins/jenkins-slave/workspace/Lucene-Solr-Tests-5.x-Java7/solr/build/solr-core/test/J3/temp/solr.cloud.RecoveryAfterSoftCommitTest 47F5277B5BCEDC6F-001/control-001/cores/collection1/
   [junit4]   2> 654919 T1976 oasc.CorePropertiesLocator.discover Found 1 core definitions
   [junit4]   2> 654920 T2006 C:control_collection c:collection1 oasc.ZkController.publish publishing core=collection1 state=down collection=control_collection
   [junit4]   2> 654920 T2006 C:control_collection c:collection1 oasc.ZkController.publish numShards not found on descriptor - reading it from system property
   [junit4]   2> 654921 T2006 C:control_collection c:collection1 oasc.ZkController.waitForCoreNodeName look for our core node name
   [junit4]   2> 654921 T2002 oasc.DistributedQueue$LatchWatcher.process NodeChildrenChanged fired on path /overseer/queue state SyncConnected
   [junit4]   2> 654922 T2003 oasc.Overseer$ClusterStateUpdater.run processMessage: queueSize: 1, message = {
   [junit4]   2> 	  "collection":"control_collection",
   [junit4]   2> 	  "node_name":"127.0.0.1:22454_",
   [junit4]   2> 	  "shard":null,
   [junit4]   2> 	  "base_url":"http://127.0.0.1:22454",
   [junit4]   2> 	  "roles":null,
   [junit4]   2> 	  "core":"collection1",
   [junit4]   2> 	  "numShards":"1",
   [junit4]   2> 	  "operation":"state",
   [junit4]   2> 	  "state":"down"} current state version: 0
   [junit4]   2> 654922 T2003 oasco.ReplicaMutator.updateState Update state numShards=1 message={
   [junit4]   2> 	  "collection":"control_collection",
   [junit4]   2> 	  "node_name":"127.0.0.1:22454_",
   [junit4]   2> 	  "shard":null,
   [junit4]   2> 	  "base_url":"http://127.0.0.1:22454",
   [junit4]   2> 	  "roles":null,
   [junit4]   2> 	  "core":"collection1",
   [junit4]   2> 	  "numShards":"1",
   [junit4]   2> 	  "operation":"state",
   [junit4]   2> 	  "state":"down"}
   [junit4]   2> 654922 T2003 oasco.ClusterStateMutator.createCollection building a new cName: control_collection
   [junit4]   2> 654923 T2003 oasco.ReplicaMutator.updateState Assigning new node to shard shard=shard1
   [junit4]   2> 654924 T2002 oascc.ZkStateReader$2.process A cluster state change: WatchedEvent state:SyncConnected type:NodeDataChanged path:/clusterstate.json, has occurred - updating... (live nodes size: 1)
   [junit4]   2> 655921 T2006 C:control_collection c:collection1 oasc.ZkController.waitForShardId waiting to find shard id in clusterstate for collection1
   [junit4]   2> 655922 T2006 C:control_collection c:collection1 oasc.ZkController.createCollectionZkNode Check for collection zkNode:control_collection
   [junit4]   2> 655922 T2006 C:control_collection c:collection1 oasc.ZkController.createCollectionZkNode Collection zkNode exists
   [junit4]   2> 655923 T2006 C:control_collection c:collection1 oascc.ZkStateReader.readConfigName Load collection config from:/collections/control_collection
   [junit4]   2> 655923 T2006 C:control_collection c:collection1 oascc.ZkStateReader.readConfigName path=/collections/control_collection configName=conf1 specified config exists in ZooKeeper
   [junit4]   2> 655923 T2006 C:control_collection c:collection1 oasc.SolrResourceLoader.<init> new SolrResourceLoader for directory: '/usr/home/jenkins/jenkins-slave/workspace/Lucene-Solr-Tests-5.x-Java7/solr/build/solr-core/test/J3/temp/solr.cloud.RecoveryAfterSoftCommitTest 47F5277B5BCEDC6F-001/control-001/cores/collection1/'
   [junit4]   2> 655937 T2006 C:control_collection c:collection1 oasc.ZkController.watchZKConfDir watch zkdir /configs/conf1
   [junit4]   2> 655939 T2006 C:control_collection c:collection1 oasc.Config.<init> loaded config solrconfig.xml with version 0 
   [junit4]   2> 655948 T2006 C:control_collection c:collection1 oasc.SolrConfig.refreshRequestParams current version of requestparams : -1
   [junit4]   2> 655966 T2006 C:control_collection c:collection1 oasc.SolrConfig.<init> Using Lucene MatchVersion: 5.2.0
   [junit4]   2> 656004 T2006 C:control_collection c:collection1 oasc.SolrConfig.<init> Loaded SolrConfig: solrconfig.xml
   [junit4]   2> 656105 T2006 C:control_collection c:collection1 oass.IndexSchema.readSchema Reading Solr Schema from /configs/conf1/schema.xml
   [junit4]   2> 656113 T2006 C:control_collection c:collection1 oass.IndexSchema.readSchema [collection1] Schema name=test
   [junit4]   2> 656566 T2006 C:control_collection c:collection1 oass.OpenExchangeRatesOrgProvider.init Initialized with rates=open-exchange-rates.json, refreshInterval=1440.
   [junit4]   2> 656582 T2006 C:control_collection c:collection1 oass.IndexSchema.readSchema default search field in schema is text
   [junit4]   2> 656585 T2006 C:control_collection c:collection1 oass.IndexSchema.readSchema unique key field: id
   [junit4]   2> 656596 T2006 C:control_collection c:collection1 oass.FileExchangeRateProvider.reload Reloading exchange rates from file currency.xml
   [junit4]   2> 656600 T2006 C:control_collection c:collection1 oass.FileExchangeRateProvider.reload Reloading exchange rates from file currency.xml
   [junit4]   2> 656604 T2006 C:control_collection c:collection1 oass.OpenExchangeRatesOrgProvider.reload Reloading exchange rates from open-exchange-rates.json
   [junit4]   2> 656605 T2006 C:control_collection c:collection1 oass.OpenExchangeRatesOrgProvider$OpenExchangeRates.<init> WARN Unknown key IMPORTANT NOTE
   [junit4]   2> 656605 T2006 C:control_collection c:collection1 oass.OpenExchangeRatesOrgProvider$OpenExchangeRates.<init> WARN Expected key, got STRING
   [junit4]   2> 656606 T2006 C:control_collection c:collection1 oass.OpenExchangeRatesOrgProvider.reload Reloading exchange rates from open-exchange-rates.json
   [junit4]   2> 656606 T2006 C:control_collection c:collection1 oass.OpenExchangeRatesOrgProvider$OpenExchangeRates.<init> WARN Unknown key IMPORTANT NOTE
   [junit4]   2> 656606 T2006 C:control_collection c:collection1 oass.OpenExchangeRatesOrgProvider$OpenExchangeRates.<init> WARN Expected key, got STRING
   [junit4]   2> 656607 T2006 C:control_collection c:collection1 oasc.CoreContainer.create Creating SolrCore 'collection1' using configuration from collection control_collection
   [junit4]   2> 656607 T2006 C:control_collection c:collection1 oasc.SolrCore.initDirectoryFactory org.apache.solr.core.MockDirectoryFactory
   [junit4]   2> 656608 T2006 C:control_collection c:collection1 oasc.SolrCore.<init> [collection1] Opening new SolrCore at /usr/home/jenkins/jenkins-slave/workspace/Lucene-Solr-Tests-5.x-Java7/solr/build/solr-core/test/J3/temp/solr.cloud.RecoveryAfterSoftCommitTest 47F5277B5BCEDC6F-001/control-001/cores/collection1/, dataDir=/usr/home/jenkins/jenkins-slave/workspace/Lucene-Solr-Tests-5.x-Java7/solr/build/solr-core/test/J3/temp/solr.cloud.RecoveryAfterSoftCommitTest 47F5277B5BCEDC6F-001/control-001/cores/collection1/data/
   [junit4]   2> 656608 T2006 C:control_collection c:collection1 oasc.JmxMonitoredMap.<init> JMX monitoring is enabled. Adding Solr mbeans to JMX Server: com.sun.jmx.mbeanserver.JmxMBeanServer@405600d7
   [junit4]   2> 656609 T2006 C:control_collection c:collection1 oasc.CachingDirectoryFactory.get return new directory for /usr/home/jenkins/jenkins-slave/workspace/Lucene-Solr-Tests-5.x-Java7/solr/build/solr-core/test/J3/temp/solr.cloud.RecoveryAfterSoftCommitTest 47F5277B5BCEDC6F-001/control-001/cores/collection1/data
   [junit4]   2> 656609 T2006 C:control_collection c:collection1 oasc.SolrCore.getNewIndexDir New index directory detected: old=null new=/usr/home/jenkins/jenkins-slave/workspace/Lucene-Solr-Tests-5.x-Java7/solr/build/solr-core/test/J3/temp/solr.cloud.RecoveryAfterSoftCommitTest 47F5277B5BCEDC6F-001/control-001/cores/collection1/data/index/
   [junit4]   2> 656609 T2006 C:control_collection c:collection1 oasc.SolrCore.initIndex WARN [collection1] Solr index directory '/usr/home/jenkins/jenkins-slave/workspace/Lucene-Solr-Tests-5.x-Java7/solr/build/solr-core/test/J3/temp/solr.cloud.RecoveryAfterSoftCommitTest 47F5277B5BCEDC6F-001/control-001/cores/collection1/data/index' doesn't exist. Creating new index...
   [junit4]   2> 656611 T2006 C:control_collection c:collection1 oasc.CachingDirectoryFactory.get return new directory for /usr/home/jenkins/jenkins-slave/workspace/Lucene-Solr-Tests-5.x-Java7/solr/build/solr-core/test/J3/temp/solr.cloud.RecoveryAfterSoftCommitTest 47F5277B5BCEDC6F-001/control-001/cores/collection1/data/index
   [junit4]   2> 656611 T2006 C:control_collection c:collection1 oasu.RandomMergePolicy.<init> RandomMergePolicy wrapping class org.apache.lucene.index.TieredMergePolicy: [TieredMergePolicy: maxMergeAtOnce=50, maxMergeAtOnceExplicit=20, maxMergedSegmentMB=80.2119140625, floorSegmentMB=1.5, forceMergeDeletesPctAllowed=3.3180332404560553, segmentsPerTier=14.0, maxCFSSegmentSizeMB=8.796093022207999E12, noCFSRatio=0.1350957791224503
   [junit4]   2> 656612 T2006 C:control_collection c:collection1 oasc.SolrDeletionPolicy.onCommit SolrDeletionPolicy.onCommit: commits: num=1
   [junit4]   2> 		commit{dir=MockDirectoryWrapper(RAMDirectory@62a9cba0 lockFactory=org.apache.lucene.store.SingleInstanceLockFactory@7977a7fa),segFN=segments_1,generation=1}
   [junit4]   2> 656612 T2006 C:control_collection c:collection1 oasc.SolrDeletionPolicy.updateCommits newest commit generation = 1
   [junit4]   2> 656619 T2006 C:control_collection c:collection1 oasup.UpdateRequestProcessorChain.init creating updateRequestProcessorChain "nodistrib"
   [junit4]   2> 656619 T2006 C:control_collection c:collection1 oasup.UpdateRequestProcessorChain.init creating updateRequestProcessorChain "dedupe"
   [junit4]   2> 656620 T2006 C:control_collection c:collection1 oasup.UpdateRequestProcessorChain.init inserting DistributedUpdateProcessorFactory into updateRequestProcessorChain "dedupe"
   [junit4]   2> 656620 T2006 C:control_collection c:collection1 oasup.UpdateRequestProcessorChain.init creating updateRequestProcessorChain "stored_sig"
   [junit4]   2> 656620 T2006 C:control_collection c:collection1 oasup.UpdateRequestProcessorChain.init inserting DistributedUpdateProcessorFactory into updateRequestProcessorChain "stored_sig"
   [junit4]   2> 656620 T2006 C:control_collection c:collection1 oasup.UpdateRequestProcessorChain.init creating updateRequestProcessorChain "distrib-dup-test-chain-explicit"
   [junit4]   2> 656621 T2006 C:control_collection c:collection1 oasup.UpdateRequestProcessorChain.init creating updateRequestProcessorChain "distrib-dup-test-chain-implicit"
   [junit4]   2> 656621 T2006 C:control_collection c:collection1 oasup.UpdateRequestProcessorChain.init inserting DistributedUpdateProcessorFactory into updateRequestProcessorChain "distrib-dup-test-chain-implicit"
   [junit4]   2> 656622 T2006 C:control_collection c:collection1 oasc.SolrCore.loadUpdateProcessorChains no updateRequestProcessorChain defined as default, creating implicit default
   [junit4]   2> 656644 T2006 C:control_collection c:collection1 oashl.XMLLoader.init xsltCacheLifetimeSeconds=60
   [junit4]   2> 656646 T2006 C:control_collection c:collection1 oashl.XMLLoader.init xsltCacheLifetimeSeconds=60
   [junit4]   2> 656649 T2006 C:control_collection c:collection1 oashl.XMLLoader.init xsltCacheLifetimeSeconds=60
   [junit4]   2> 656651 T2006 C:control_collection c:collection1 oashl.XMLLoader.init xsltCacheLifetimeSeconds=60
   [junit4]   2> 656657 T2006 C:control_collection c:collection1 oasc.RequestHandlers.initHandlersFromConfig Registered paths: /update/json/docs,/admin/luke,/config,standard,/admin/segments,/replication,/admin/system,/get,/admin/threads,/admin/plugins,/admin/file,/schema,/update,/admin/mbeans,/admin/logging,/update/json,/admin/ping,/admin/properties,/update/csv
   [junit4]   2> 656659 T2006 C:control_collection c:collection1 oasc.SolrCore.initStatsCache Using default statsCache cache: org.apache.solr.search.stats.LocalStatsCache
   [junit4]   2> 656661 T2006 C:control_collection c:collection1 oasu.UpdateHandler.<init> Using UpdateLog implementation: org.apache.solr.update.UpdateLog
   [junit4]   2> 656661 T2006 C:control_collection c:collection1 oasu.UpdateLog.init Initializing UpdateLog: dataDir= defaultSyncLevel=FLUSH numRecordsToKeep=100 maxNumLogsToKeep=10
   [junit4]   2> 656663 T2006 C:control_collection c:collection1 oasu.CommitTracker.<init> Hard AutoCommit: disabled
   [junit4]   2> 656663 T2006 C:control_collection c:collection1 oasu.CommitTracker.<init> Soft AutoCommit: disabled
   [junit4]   2> 656664 T2006 C:control_collection c:collection1 oasu.RandomMergePolicy.<init> RandomMergePolicy wrapping class org.apache.lucene.index.LogDocMergePolicy: [LogDocMergePolicy: minMergeSize=1000, mergeFactor=14, maxMergeSize=9223372036854775807, maxMergeSizeForForcedMerge=9223372036854775807, calibrateSizeByDeletes=true, maxMergeDocs=2147483647, maxCFSSegmentSizeMB=8.796093022207999E12, noCFSRatio=0.33693801321823635]
   [junit4]   2> 656666 T2006 C:control_collection c:collection1 oasc.SolrDeletionPolicy.onInit SolrDeletionPolicy.onInit: commits: num=1
   [junit4]   2> 		commit{dir=MockDirectoryWrapper(RAMDirectory@62a9cba0 lockFactory=org.apache.lucene.store.SingleInstanceLockFactory@7977a7fa),segFN=segments_1,generation=1}
   [junit4]   2> 656666 T2006 C:control_collection c:collection1 oasc.SolrDeletionPolicy.updateCommits newest commit generation = 1
   [junit4]   2> 656667 T2006 C:control_collection c:collection1 oass.SolrIndexSearcher.<init> Opening Searcher@3f3cc2fa[collection1] main
   [junit4]   2> 656667 T2006 C:control_collection c:collection1 oascc.ZkStateReader.readConfigName Load collection config from:/collections/control_collection
   [junit4]   2> 656668 T2006 C:control_collection c:collection1 oascc.ZkStateReader.readConfigName path=/collections/control_collection configName=conf1 specified config exists in ZooKeeper
   [junit4]   2> 656668 T2006 C:control_collection c:collection1 oasr.ManagedResourceStorage.newStorageIO Setting up ZooKeeper-based storage for the RestManager with znodeBase: /configs/conf1
   [junit4]   2> 656669 T2006 C:control_collection c:collection1 oasr.ManagedResourceStorage$ZooKeeperStorageIO.configure Configured ZooKeeperStorageIO with znodeBase: /configs/conf1
   [junit4]   2> 656669 T2006 C:control_collection c:collection1 oasr.RestManager.init Initializing RestManager with initArgs: {}
   [junit4]   2> 656669 T2006 C:control_collection c:collection1 oasr.ManagedResourceStorage.load Reading _rest_managed.json using ZooKeeperStorageIO:path=/configs/conf1
   [junit4]   2> 656670 T2006 C:control_collection c:collection1 oasr.ManagedResourceStorage$ZooKeeperStorageIO.openInputStream No data found for znode /configs/conf1/_rest_managed.json
   [junit4]   2> 656670 T2006 C:control_collection c:collection1 oasr.ManagedResourceStorage.load Loaded null at path _rest_managed.json using ZooKeeperStorageIO:path=/configs/conf1
   [junit4]   2> 656671 T2006 C:control_collection c:collection1 oasr.RestManager.init Initializing 0 registered ManagedResources
   [junit4]   2> 656671 T2006 C:control_collection c:collection1 oash.ReplicationHandler.inform Commits will be reserved for  10000
   [junit4]   2> 656672 T2007 C:control_collection c:collection1 oasc.SolrCore.registerSearcher [collection1] Registered new searcher Searcher@3f3cc2fa[collection1] main{ExitableDirectoryReader(UninvertingDirectoryReader())}
   [junit4]   2> 656672 T2006 C:control_collection c:collection1 oasc.CoreContainer.registerCore registering core: collection1
   [junit4]   2> 656673 T2010 C:control_collection S:shard1 oasc.ZkController.register Register replica - core:collection1 address:http://127.0.0.1:22454 collection:control_collection shard:shard1
   [junit4]   2> 656674 T1976 oass.SolrDispatchFilter.init user.dir=/usr/home/jenkins/jenkins-slave/workspace/Lucene-Solr-Tests-5.x-Java7/solr/build/solr-core/test/J3
   [junit4]   2> 656674 T1976 oass.SolrDispatchFilter.init SolrDispatchFilter.init() done
   [junit4]   2> 656674 T2010 C:control_collection S:shard1 oascc.SolrZkClient.makePath makePath: /collections/control_collection/leader_elect/shard1/election
   [junit4]   2> 656678 T1976 oascc.SolrZkClient.createZkCredentialsToAddAutomatically Using default ZkCredentialsProvider
   [junit4]   2> 656678 T1976 oascc.ConnectionManager.waitForConnected Waiting for client to connect to ZooKeeper
   [junit4]   2> 656678 T2010 C:control_collection S:shard1 oasc.ShardLeaderElectionContext.runLeaderProcess Running the leader process for shard shard1
   [junit4]   2> 656680 T2014 oascc.ConnectionManager.process Watcher org.apache.solr.common.cloud.ConnectionManager@2a5a5614 name:ZooKeeperConnection Watcher:127.0.0.1:22447/solr got event WatchedEvent state:SyncConnected type:None path:null path:null type:None
   [junit4]   2> 656680 T1976 oascc.ConnectionManager.waitForConnected Client is connected to ZooKeeper
   [junit4]   2> 656680 T2002 oasc.DistributedQueue$LatchWatcher.process NodeChildrenChanged fired on path /overseer/queue state SyncConnected
   [junit4]   2> 656681 T1976 oascc.SolrZkClient.createZkACLProvider Using default ZkACLProvider
   [junit4]   2> 656681 T2010 C:control_collection S:shard1 oasc.ShardLeaderElectionContext.waitForReplicasToComeUp Enough replicas found to continue.
   [junit4]   2> 656681 T1976 oascc.ZkStateReader.createClusterStateWatchersAndUpdate Updating cluster state from ZooKeeper... 
   [junit4]   2> 656681 T2010 C:control_collection S:shard1 oasc.ShardLeaderElectionContext.runLeaderProcess I may be the new leader - try and sync
   [junit4]   2> 656681 T2003 oasc.Overseer$ClusterStateUpdater.run processMessage: queueSize: 1, message = {
   [junit4]   2> 	  "operation":"leader",
   [junit4]   2> 	  "shard":"shard1",
   [junit4]   2> 	  "collection":"control_collection"} current state version: 1
   [junit4]   2> ASYNC  NEW_CORE C227 name=collection1 org.apache.solr.core.SolrCore@49048db8 url=http://127.0.0.1:22454/collection1 node=127.0.0.1:22454_ C227_STATE=coll:control_collection core:collection1 props:{node_name=127.0.0.1:22454_, base_url=http://127.0.0.1:22454, core=collection1, state=down}
   [junit4]   2> 656681 T2010 C:control_collection S:shard1 C227 P22454 oasc.SyncStrategy.sync Sync replicas to http://127.0.0.1:22454/collection1/
   [junit4]   2> 656682 T2010 C:control_collection S:shard1 C227 P22454 oasc.SyncStrategy.syncReplicas Sync Success - now sync replicas to me
   [junit4]   2> 656682 T2010 C:control_collection S:shard1 C227 P22454 oasc.SyncStrategy.syncToMe http://127.0.0.1:22454/collection1/ has no replicas
   [junit4]   2> 656682 T2010 C:control_collection S:shard1 oasc.ShardLeaderElectionContext.runLeaderProcess I am the new leader: http://127.0.0.1:22454/collection1/ shard1
   [junit4]   2> 656682 T2010 C:control_collection S:shard1 oascc.SolrZkClient.makePath makePath: /collections/control_collection/leaders/shard1
   [junit4]   2> 656683 T2002 oascc.ZkStateReader$2.process A cluster state change: WatchedEvent state:SyncConnected type:NodeDataChanged path:/clusterstate.json, has occurred - updating... (live nodes size: 1)
   [junit4]   2> 656683 T2014 oascc.ZkStateReader$2.process A cluster state change: WatchedEvent state:SyncConnected type:NodeDataChanged path:/clusterstate.json, has occurred - updating... (live nodes size: 0)
   [junit4]   2> 656684 T1976 oasc.ChaosMonkey.monkeyLog monkey: init - expire sessions:false cause connection loss:false
   [junit4]   2> 656684 T1976 oasc.AbstractFullDistribZkTestBase.createJettys Creating collection1 with stateFormat=2
   [junit4]   2> 656685 T1976 oascc.SolrZkClient.createZkCredentialsToAddAutomatically Using default ZkCredentialsProvider
   [junit4]   2> 656685 T1976 oascc.ConnectionManager.waitForConnected Waiting for client to connect to ZooKeeper
   [junit4]   2> 656687 T2017 oascc.ConnectionManager.process Watcher org.apache.solr.common.cloud.ConnectionManager@3ced76f4 name:ZooKeeperConnection Watcher:127.0.0.1:22447/solr got event WatchedEvent state:SyncConnected type:None path:null path:null type:None
   [junit4]   2> 656687 T1976 oascc.ConnectionManager.waitForConnected Client is connected to ZooKeeper
   [junit4]   2> 656687 T2002 oasc.DistributedQueue$LatchWatcher.process NodeChildrenChanged fired on path /overseer/queue state SyncConnected
   [junit4]   2> 656687 T1976 oascc.SolrZkClient.createZkACLProvider Using default ZkACLProvider
   [junit4]   2> 656688 T2003 oasc.Overseer$ClusterStateUpdater.run processMessage: queueSize: 1, message = {
   [junit4]   2> 	  "operation":"leader",
   [junit4]   2> 	  "shard":"shard1",
   [junit4]   2> 	  "collection":"control_collection",
   [junit4]   2> 	  "base_url":"http://127.0.0.1:22454",
   [junit4]   2> 	  "core":"collection1",
   [junit4]   2> 	  "state":"active"} current state version: 2
   [junit4]   2> 656690 T2003 oasc.Overseer$ClusterStateUpdater.run processMessage: queueSize: 1, message = {
   [junit4]   2> 	  "operation":"create",
   [junit4]   2> 	  "name":"collection1",
   [junit4]   2> 	  "numShards":"1",
   [junit4]   2> 	  "stateFormat":"2"} current state version: 2
   [junit4]   2> 656691 T2003 oasco.ClusterStateMutator.createCollection building a new cName: collection1
   [junit4]   2> 656691 T2014 oascc.ZkStateReader$2.process A cluster state change: WatchedEvent state:SyncConnected type:NodeDataChanged path:/clusterstate.json, has occurred - updating... (live nodes size: 1)
   [junit4]   2> 656691 T2002 oascc.ZkStateReader$2.process A cluster state change: WatchedEvent state:SyncConnected type:NodeDataChanged path:/clusterstate.json, has occurred - updating... (live nodes size: 1)
   [junit4]   2> 656694 T2002 oasc.DistributedQueue$LatchWatcher.process NodeChildrenChanged fired on path /overseer/queue state SyncConnected
   [junit4]   2> 656695 T2003 oasco.ZkStateWriter.writePendingUpdates going to create_collection /collections/collection1/state.json
   [junit4]   2> 656696 T2002 oascc.ZkStateReader$2.process A cluster state change: WatchedEvent state:SyncConnected type:NodeDataChanged path:/clusterstate.json, has occurred - updating... (live nodes size: 1)
   [junit4]   2> 656696 T2014 oascc.ZkStateReader$2.process A cluster state change: WatchedEvent state:SyncConnected type:NodeDataChanged path:/clusterstate.json, has occurred - updating... (live nodes size: 1)
   [junit4]   2> 656738 T2010 C:control_collection S:shard1 oasc.ZkController.register We are http://127.0.0.1:22454/collection1/ and leader is http://127.0.0.1:22454/collection1/
   [junit4]   2> 656739 T2010 C:control_collection S:shard1 oasc.ZkController.register No LogReplay needed for core=collection1 baseURL=http://127.0.0.1:22454
   [junit4]   2> 656739 T2010 C:control_collection S:shard1 oasc.ZkController.checkRecovery I am the leader, no recovery necessary
   [junit4]   2> 656739 T2010 C:control_collection S:shard1 c:collection1 oasc.ZkController.publish publishing core=collection1 state=active collection=control_collection
   [junit4]   2> 656739 T2010 C:control_collection S:shard1 c:collection1 oasc.ZkController.publish numShards not found on descriptor - reading it from system property
   [junit4]   2> 656741 T2002 oasc.DistributedQueue$LatchWatcher.process NodeChildrenChanged fired on path /overseer/queue state SyncConnected
   [junit4]   2> 656742 T2003 oasc.Overseer$ClusterStateUpdater.run processMessage: queueSize: 1, message = {
   [junit4]   2> 	  "collection":"control_collection",
   [junit4]   2> 	  "node_name":"127.0.0.1:22454_",
   [junit4]   2> 	  "shard":"shard1",
   [junit4]   2> 	  "core_node_name":"core_node1",
   [junit4]   2> 	  "base_url":"http://127.0.0.1:22454",
   [junit4]   2> 	  "roles":null,
   [junit4]   2> 	  "core":"collection1",
   [junit4]   2> 	  "numShards":"1",
   [junit4]   2> 	  "operation":"state",
   [junit4]   2> 	  "state":"active"} current state version: 4
   [junit4]   2> 656742 T2003 oasco.ReplicaMutator.updateState Update state numShards=1 message={
   [junit4]   2> 	  "collection":"control_collection",
   [junit4]   2> 	  "node_name":"127.0.0.1:22454_",
   [junit4]   2> 	  "shard":"shard1",
   [junit4]   2> 	  "core_node_name":"core_node1",
   [junit4]   2> 	  "base_url":"http://127.0.0.1:22454",
   [junit4]   2> 	  "roles":null,
   [junit4]   2> 	  "core":"collection1",
   [junit4]   2> 	  "numShards":"1",
   [junit4]   2> 	  "operation":"state",
   [junit4]   2> 	  "state":"active"}
   [junit4]   2> 656846 T2002 oascc.ZkStateReader$2.process A cluster state change: WatchedEvent state:SyncConnected type:NodeDataChanged path:/clusterstate.json, has occurred - updating... (live nodes size: 1)
   [junit4]   2> 656846 T2014 oascc.ZkStateReader$2.process A cluster state change: WatchedEvent state:SyncConnected type:NodeDataChanged path:/clusterstate.json, has occurred - updating... (live nodes size: 1)
   [junit4]   2> 658577 T1976 oas.SolrTestCaseJ4.writeCoreProperties Writing core.properties file to /usr/home/jenkins/jenkins-slave/workspace/Lucene-Solr-Tests-5.x-Java7/solr/build/solr-core/test/J3/temp/solr.cloud.RecoveryAfterSoftCommitTest 47F5277B5BCEDC6F-001/shard-1-001/cores/collection1
   [junit4]   2> 658581 T1976 oasc.AbstractFullDistribZkTestBase.createJettys create jetty 1 in directory /usr/home/jenkins/jenkins-slave/workspace/Lucene-Solr-Tests-5.x-Java7/solr/build/solr-core/test/J3/temp/solr.cloud.RecoveryAfterSoftCommitTest 47F5277B5BCEDC6F-001/shard-1-001
   [junit4]   2> 658581 T1976 oejs.Server.doStart jetty-8.1.10.v20130312
   [junit4]   2> 658584 T1976 oejs.AbstractConnector.doStart Started SocketConnector@127.0.0.1:22461
   [junit4]   2> 658584 T1976 oascse.JettySolrRunner$1.lifeCycleStarted Jetty properties: {hostPort=22460, solr.data.dir=/usr/home/jenkins/jenkins-slave/workspace/Lucene-Solr-Tests-5.x-Java7/solr/build/solr-core/test/J3/temp/solr.cloud.RecoveryAfterSoftCommitTest 47F5277B5BCEDC6F-001/tempDir-001/jetty1, solrconfig=solrconfig.xml, hostContext=/, coreRootDirectory=/usr/home/jenkins/jenkins-slave/workspace/Lucene-Solr-Tests-5.x-Java7/solr/build/solr-core/test/J3/temp/solr.cloud.RecoveryAfterSoftCommitTest 47F5277B5BCEDC6F-001/shard-1-001/cores}
   [junit4]   2> 658585 T1976 oass.SolrDispatchFilter.init SolrDispatchFilter.init()sun.misc.Launcher$AppClassLoader@17072b90
   [junit4]   2> 658585 T1976 oasc.SolrResourceLoader.<init> new SolrResourceLoader for directory: '/usr/home/jenkins/jenkins-slave/workspace/Lucene-Solr-Tests-5.x-Java7/solr/build/solr-core/test/J3/temp/solr.cloud.RecoveryAfterSoftCommitTest 47F5277B5BCEDC6F-001/shard-1-001/'
   [junit4]   2> 658629 T1976 oasc.SolrXmlConfig.fromFile Loading container configuration from /usr/home/jenkins/jenkins-slave/workspace/Lucene-Solr-Tests-5.x-Java7/solr/build/solr-core/test/J3/temp/solr.cloud.RecoveryAfterSoftCommitTest 47F5277B5BCEDC6F-001/shard-1-001/solr.xml
   [junit4]   2> 658684 T1976 oasc.CorePropertiesLocator.<init> Config-defined core root directory: /usr/home/jenkins/jenkins-slave/workspace/Lucene-Solr-Tests-5.x-Java7/solr/build/solr-core/test/J3/temp/solr.cloud.RecoveryAfterSoftCommitTest 47F5277B5BCEDC6F-001/shard-1-001/cores
   [junit4]   2> 658684 T1976 oasc.CoreContainer.<init> New CoreContainer 1807901597
   [junit4]   2> 658685 T1976 oasc.CoreContainer.load Loading cores into CoreContainer [instanceDir=/usr/home/jenkins/jenkins-slave/workspace/Lucene-Solr-Tests-5.x-Java7/solr/build/solr-core/test/J3/temp/solr.cloud.RecoveryAfterSoftCommitTest 47F5277B5BCEDC6F-001/shard-1-001/]
   [junit4]   2> 658685 T1976 oasc.CoreContainer.load loading shared library: /usr/home/jenkins/jenkins-slave/workspace/Lucene-Solr-Tests-5.x-Java7/solr/build/solr-core/test/J3/temp/solr.cloud.RecoveryAfterSoftCommitTest 47F5277B5BCEDC6F-001/shard-1-001/lib
   [junit4]   2> 658686 T1976 oasc.SolrResourceLoader.addToClassLoader WARN Can't find (or read) directory to add to classloader: lib (resolved as: /usr/home/jenkins/jenkins-slave/workspace/Lucene-Solr-Tests-5.x-Java7/solr/build/solr-core/test/J3/temp/solr.cloud.RecoveryAfterSoftCommitTest 47F5277B5BCEDC6F-001/shard-1-001/lib).
   [junit4]   2> 658697 T1976 oashc.HttpShardHandlerFactory.getParameter Setting socketTimeout to: 90000
   [junit4]   2> 658698 T1976 oashc.HttpShardHandlerFactory.getParameter Setting urlScheme to: 
   [junit4]   2> 658698 T1976 oashc.HttpShardHandlerFactory.getParameter Setting connTimeout to: 15000
   [junit4]   2> 658698 T1976 oashc.HttpShardHandlerFactory.getParameter Setting maxConnectionsPerHost to: 20
   [junit4]   2> 658698 T1976 oashc.HttpShardHandlerFactory.getParameter Setting maxConnections to: 10000
   [junit4]   2> 658698 T1976 oashc.HttpShardHandlerFactory.getParameter Setting corePoolSize to: 0
   [junit4]   2> 658699 T1976 oashc.HttpShardHandlerFactory.getParameter Setting maximumPoolSize to: 2147483647
   [junit4]   2> 658699 T1976 oashc.HttpShardHandlerFactory.getParameter Setting maxThreadIdleTime to: 5
   [junit4]   2> 658699 T1976 oashc.HttpShardHandlerFactory.getParameter Setting sizeOfQueue to: -1
   [junit4]   2> 658699 T1976 oashc.HttpShardHandlerFactory.getParameter Setting fairnessPolicy to: false
   [junit4]   2> 658700 T1976 oashc.HttpShardHandlerFactory.getParameter Setting useRetries to: false
   [junit4]   2> 658708 T1976 oasu.UpdateShardHandler.<init> Creating UpdateShardHandler HTTP client with params: socketTimeout=340000&connTimeout=45000&retry=true
   [junit4]   2> 658708 T1976 oasl.LogWatcher.createWatcher SLF4J impl is org.slf4j.impl.Log4jLoggerFactory
   [junit4]   2> 658709 T1976 oasl.LogWatcher.newRegisteredLogWatcher Registering Log Listener [Log4j (org.slf4j.impl.Log4jLoggerFactory)]
   [junit4]   2> 658709 T1976 oasc.CoreContainer.load Node Name: 127.0.0.1
   [junit4]   2> 658709 T1976 oasc.ZkContainer.initZooKeeper Zookeeper client=127.0.0.1:22447/solr
   [junit4]   2> 658709 T1976 oasc.ZkController.checkChrootPath zkHost includes chroot
   [junit4]   2> 658710 T1976 oascc.SolrZkClient.createZkCredentialsToAddAutomatically Using default ZkCredentialsProvider
   [junit4]   2> 658710 T1976 oascc.ConnectionManager.waitForConnected Waiting for client to connect to ZooKeeper
   [junit4]   2> 658712 T2029 oascc.ConnectionManager.process Watcher org.apache.solr.common.cloud.ConnectionManager@71de2711 name:ZooKeeperConnection Watcher:127.0.0.1:22447 got event WatchedEvent state:SyncConnected type:None path:null path:null type:None
   [junit4]   2> 658713 T1976 oascc.ConnectionManager.waitForConnected Client is connected to ZooKeeper
   [junit4]   2> 658714 T1976 oascc.SolrZkClient.createZkACLProvider Using default ZkACLProvider
   [junit4]   2> 658715 T1976 oascc.ConnectionManager.waitForConnected Waiting for client to connect to ZooKeeper
   [junit4]   2> 658717 T2032 oascc.ConnectionManager.process Watcher org.apache.solr.common.cloud.ConnectionManager@520ccf14 name:ZooKeeperConnection Watcher:127.0.0.1:22447/solr got event WatchedEvent state:SyncConnected type:None path:null path:null type:None
   [junit4]   2> 658717 T1976 oascc.ConnectionManager.waitForConnected Client is connected to ZooKeeper
   [junit4]   2> 658720 T1976 oascc.ZkStateReader.createClusterStateWatchersAndUpdate Updating cluster state from ZooKeeper... 
   [junit4]   2> 659724 T1976 oasc.ZkController.createEphemeralLiveNode Register node as live in ZooKeeper:/live_nodes/127.0.0.1:22460_
   [junit4]   2> 659725 T1976 oascc.SolrZkClient.makePath makePath: /live_nodes/127.0.0.1:22460_
   [junit4]   2> 659727 T1976 oasc.Overseer.close Overseer (id=null) closing
   [junit4]   2> 659730 T1976 oasc.CorePropertiesLocator.discover Looking for core definitions underneath /usr/home/jenkins/jenkins-slave/workspace/Lucene-Solr-Tests-5.x-Java7/solr/build/solr-core/test/J3/temp/solr.cloud.RecoveryAfterSoftCommitTest 47F5277B5BCEDC6F-001/shard-1-001/cores
   [junit4]   2> 659732 T1976 oasc.CoreDescriptor.<init> CORE DESCRIPTOR: {coreNodeName=, absoluteInstDir=/usr/home/jenkins/jenkins-slave/workspace/Lucene-Solr-Tests-5.x-Java7/solr/build/solr-core/test/J3/temp/solr.cloud.RecoveryAfterSoftCommitTest 47F5277B5BCEDC6F-001/shard-1-001/cores/collection1/, instanceDir=/usr/home/jenkins/jenkins-slave/workspace/Lucene-Solr-Tests-5.x-Java7/solr/build/solr-core/test/J3/temp/solr.cloud.RecoveryAfterSoftCommitTest 47F5277B5BCEDC6F-001/shard-1-001/cores/collection1, collection=collection1, dataDir=data/, shard=, loadOnStartup=true, transient=false, config=solrconfig.xml, name=collection1, schema=schema.xml}
   [junit4]   2> 659733 T1976 oasc.CorePropertiesLocator.discoverUnder Found core collection1 in /usr/home/jenkins/jenkins-slave/workspace/Lucene-Solr-Tests-5.x-Java7/solr/build/solr-core/test/J3/temp/solr.cloud.RecoveryAfterSoftCommitTest 47F5277B5BCEDC6F-001/shard-1-001/cores/collection1/
   [junit4]   2> 659733 T1976 oasc.CorePropertiesLocator.discover Found 1 core definitions
   [junit4]   2> 659735 T2033 C:collection1 c:collection1 oasc.ZkController.publish publishing core=collection1 state=down collection=collection1
   [junit4]   2> 659735 T2033 C:collection1 c:collection1 oasc.ZkController.publish numShards not found on descriptor - reading it from system property
   [junit4]   2> 659736 T2002 oasc.DistributedQueue$LatchWatcher.process NodeChildrenChanged fired on path /overseer/queue state SyncConnected
   [junit4]   2> 659737 T2033 C:collection1 c:collection1 oasc.ZkController.preRegister Registering watch for external collection collection1
   [junit4]   2> 659737 T2003 oasc.Overseer$ClusterStateUpdater.run processMessage: queueSize: 1, message = {
   [junit4]   2> 	  "collection":"collection1",
   [junit4]   2> 	  "node_name":"127.0.0.1:22460_",
   [junit4]   2> 	  "shard":null,
   [junit4]   2> 	  "base_url":"http://127.0.0.1:22460",
   [junit4]   2> 	  "roles":null,
   [junit4]   2> 	  "core":"collection1",
   [junit4]   2> 	  "numShards":"1",
   [junit4]   2> 	  "operation":"state",
   [junit4]   2> 	  "state":"down"} current state version: 5
   [junit4]   2> 659737 T2033 C:collection1 c:collection1 oascc.ZkStateReader.addZkWatch addZkWatch collection1
   [junit4]   2> 659738 T2003 oasco.ReplicaMutator.updateState Update state numShards=1 message={
   [junit4]   2> 	  "collection":"collection1",
   [junit4]   2> 	  "node_name":"127.0.0.1:22460_",
   [junit4]   2> 	  "shard":null,
   [junit4]   2> 	  "base_url":"http://127.0.0.1:22460",
   [junit4]   2> 	  "roles":null,
   [junit4]   2> 	  "core":"collection1",
   [junit4]   2> 	  "numShards":"1",
   [junit4]   2> 	  "operation":"state",
   [junit4]   2> 	  "state":"down"}
   [junit4]   2> 659738 T2033 C:collection1 c:collection1 oascc.ZkStateReader.addZkWatch Updating collection state at /collections/collection1/state.json from ZooKeeper... 
   [junit4]   2> 659738 T2003 oasco.ReplicaMutator.updateState Collection already exists with numShards=1
   [junit4]   2> 659738 T2003 oasco.ReplicaMutator.updateState Assigning new node to shard shard=shard1
   [junit4]   2> 659739 T2033 C:collection1 c:collection1 oascc.ZkStateReader.updateWatchedCollection Updating data for collection1 to ver 0 
   [junit4]   2> 659739 T2033 C:collection1 c:collection1 oasc.ZkController.waitForCoreNodeName look for our core node name
   [junit4]   2> 659739 T2003 oasco.ZkStateWriter.writePendingUpdates going to update_collection /collections/collection1/state.json version: 0
   [junit4]   2> 659740 T2032 oascc.ZkStateReader$7.process A cluster state change: WatchedEvent state:SyncConnected type:NodeDataChanged path:/collections/collection1/state.json for collection collection1 has occurred - updating... (live nodes size: 2)
   [junit4]   2> 659740 T2032 oascc.ZkStateReader.updateWatchedCollection Updating data for collection1 to ver 1 
   [junit4]   2> 660739 T2033 C:collection1 c:collection1 oasc.ZkController.waitForShardId waiting to find shard id in clusterstate for collection1
   [junit4]   2> 660740 T2033 C:collection1 c:collection1 oasc.ZkController.createCollectionZkNode Check for collection zkNode:collection1
   [junit4]   2> 660741 T2033 C:collection1 c:collection1 oasc.ZkController.createCollectionZkNode Collection zkNode exists
   [junit4]   2> 660741 T2033 C:collection1 c:collection1 oascc.ZkStateReader.readConfigName Load collection config from:/collections/collection1
   [junit4]   2> 660742 T2033 C:collection1 c:collection1 oascc.ZkStateReader.readConfigName path=/collections/collection1 configName=conf1 specified config exists in ZooKeeper
   [junit4]   2> 660742 T2033 C:collection1 c:collection1 oasc.SolrResourceLoader.<init> new SolrResourceLoader for directory: '/usr/home/jenkins/jenkins-slave/workspace/Lucene-Solr-Tests-5.x-Java7/solr/build/solr-core/test/J3/temp/solr.cloud.RecoveryAfterSoftCommitTest 47F5277B5BCEDC6F-001/shard-1-001/cores/collection1/'
   [junit4]   2> 660760 T2033 C:collection1 c:collection1 oasc.ZkController.watchZKConfDir watch zkdir /configs/conf1
   [junit4]   2> 660763 T2033 C:collection1 c:collection1 oasc.Config.<init> loaded config solrconfig.xml with version 0 
   [junit4]   2> 660775 T2033 C:collection1 c:collection1 oasc.SolrConfig.refreshRequestParams current version of requestparams : -1
   [junit4]   2> 660799 T2033 C:collection1 c:collection1 oasc.SolrConfig.<init> Using Lucene MatchVersion: 5.2.0
   [junit4]   2> 660853 T2033 C:collection1 c:collection1 oasc.SolrConfig.<init> Loaded SolrConfig: solrconfig.xml
   [junit4]   2> 660954 T2033 C:collection1 c:collection1 oass.IndexSchema.readSchema Reading Solr Schema from /configs/conf1/schema.xml
   [junit4]   2> 660961 T2033 C:collection1 c:collection1 oass.IndexSchema.readSchema [collection1] Schema name=test
   [junit4]   2> 661256 T2033 C:collection1 c:collection1 oass.OpenExchangeRatesOrgProvider.init Initialized with rates=open-exchange-rates.json, refreshInterval=1440.
   [junit4]   2> 661277 T2033 C:collection1 c:collection1 oass.IndexSchema.readSchema default search field in schema is text
   [junit4]   2> 661280 T2033 C:collection1 c:collection1 oass.IndexSchema.readSchema unique key field: id
   [junit4]   2> 661288 T2033 C:collection1 c:collection1 oass.FileExchangeRateProvider.reload Reloading exchange rates from file currency.xml
   [junit4]   2> 661292 T2033 C:collection1 c:collection1 oass.FileExchangeRateProvider.reload Reloading exchange rates from file currency.xml
   [junit4]   2> 661295 T2033 C:collection1 c:collection1 oass.OpenExchangeRatesOrgProvider.reload Reloading exchange rates from open-exchange-rates.json
   [junit4]   2> 661296 T2033 C:collection1 c:collection1 oass.OpenExchangeRatesOrgProvider$OpenExchangeRates.<init> WARN Unknown key IMPORTANT NOTE
   [junit4]   2> 661296 T2033 C:collection1 c:collection1 oass.OpenExchangeRatesOrgProvider$OpenExchangeRates.<init> WARN Expected key, got STRING
   [junit4]   2> 661297 T2033 C:collection1 c:collection1 oass.OpenExchangeRatesOrgProvider.reload Reloading exchange rates from open-exchange-rates.json
   [junit4]   2> 661297 T2033 C:collection1 c:collection1 oass.OpenExchangeRatesOrgProvider$OpenExchangeRates.<init> WARN Unknown key IMPORTANT NOTE
   [junit4]   2> 661297 T2033 C:collection1 c:collection1 oass.OpenExchangeRatesOrgProvider$OpenExchangeRates.<init> WARN Expected key, got STRING
   [junit4]   2> 661298 T2033 C:collection1 c:collection1 oasc.CoreContainer.create Creating SolrCore 'collection1' using configuration from collection collection1
   [junit4]   2> 661298 T2033 C:collection1 c:collection1 oasc.SolrCore.initDirectoryFactory org.apache.solr.core.MockDirectoryFactory
   [junit4]   2> 661298 T2033 C:collection1 c:collection1 oasc.SolrCore.<init> [collection1] Opening new SolrCore at /usr/home/jenkins/jenkins-slave/workspace/Lucene-Solr-Tests-5.x-Java7/solr/build/solr-core/test/J3/temp/solr.cloud.RecoveryAfterSoftCommitTest 47F5277B5BCEDC6F-001/shard-1-001/cores/collection1/, dataDir=/usr/home/jenkins/jenkins-slave/workspace/Lucene-Solr-Tests-5.x-Java7/solr/build/solr-core/test/J3/temp/solr.cloud.RecoveryAfterSoftCommitTest 47F5277B5BCEDC6F-001/shard-1-001/cores/collection1/data/
   [junit4]   2> 661298 T2033 C:collection1 c:collection1 oasc.JmxMonitoredMap.<init> JMX monitoring is enabled. Adding Solr mbeans to JMX Server: com.sun.jmx.mbeanserver.JmxMBeanServer@405600d7
   [junit4]   2> 661299 T2033 C:collection1 c:collection1 oasc.CachingDirectoryFactory.get return new directory for /usr/home/jenkins/jenkins-slave/workspace/Lucene-Solr-Tests-5.x-Java7/solr/build/solr-core/test/J3/temp/solr.cloud.RecoveryAfterSoftCommitTest 47F5277B5BCEDC6F-001/shard-1-001/cores/collection1/data
   [junit4]   2> 661299 T2033 C:collection1 c:collection1 oasc.SolrCore.getNewIndexDir New index directory detected: old=null new=/usr/home/jenkins/jenkins-slave/workspace/Lucene-Solr-Tests-5.x-Java7/solr/build/solr-core/test/J3/temp/solr.cloud.RecoveryAfterSoftCommitTest 47F5277B5BCEDC6F-001/shard-1-001/cores/collection1/data/index/
   [junit4]   2> 661300 T2033 C:collection1 c:collection1 oasc.SolrCore.initIndex WARN [collection1] Solr index directory '/usr/home/jenkins/jenkins-slave/workspace/Lucene-Solr-Tests-5.x-Java7/solr/build/solr-core/test/J3/temp/solr.cloud.RecoveryAfterSoftCommitTest 47F5277B5BCEDC6F-001/shard-1-001/cores/collection1/data/index' doesn't exist. Creating new index...
   [junit4]   2> 661300 T2033 C:collection1 c:collection1 oasc.CachingDirectoryFactory.get return new directory for /usr/home/jenkins/jenkins-slave/workspace/Lucene-Solr-Tests-5.x-Java7/solr/build/solr-core/test/J3/temp/solr.cloud.RecoveryAfterSoftCommitTest 47F5277B5BCEDC6F-001/shard-1-001/cores/collection1/data/index
   [junit4]   2> 661300 T2033 C:collection1 c:collection1 oasu.RandomMergePolicy.<init> RandomMergePolicy wrapping class org.apache.lucene.index.TieredMergePolicy: [TieredMergePolicy: maxMergeAtOnce=50, maxMergeAtOnceExplicit=20, maxMergedSegmentMB=80.2119140625, floorSegmentMB=1.5, forceMergeDeletesPctAllowed=3.3180332404560553, segmentsPerTier=14.0, maxCFSSegmentSizeMB=8.796093022207999E12, noCFSRatio=0.1350957791224503
   [junit4]   2> 661301 T2033 C:collection1 c:collection1 oasc.SolrDeletionPolicy.onCommit SolrDeletionPolicy.onCommit: commits: num=1
   [junit4]   2> 		commit{dir=MockDirectoryWrapper(RAMDirectory@3d4a4473 lockFactory=org.apache.lucene.store.SingleInstanceLockFactory@56d3f974),segFN=segments_1,generation=1}
   [junit4]   2> 661301 T2033 C:collection1 c:collection1 oasc.SolrDeletionPolicy.updateCommits newest commit generation = 1
   [junit4]   2> 661307 T2033 C:collection1 c:collection1 oasup.UpdateRequestProcessorChain.init creating updateRequestProcessorChain "nodistrib"
   [junit4]   2> 661307 T2033 C:collection1 c:collection1 oasup.UpdateRequestProcessorChain.init creating updateRequestProcessorChain "dedupe"
   [junit4]   2> 661307 T2033 C:collection1 c:collection1 oasup.UpdateRequestProcessorChain.init inserting DistributedUpdateProcessorFactory into updateRequestProcessorChain "dedupe"
   [junit4]   2> 661308 T2033 C:collection1 c:collection1 oasup.UpdateRequestProcessorChain.init creating updateRequestProcessorChain "stored_sig"
   [junit4]   2> 661308 T2033 C:collection1 c:collection1 oasup.UpdateRequestProcessorChain.init inserting DistributedUpdateProcessorFactory into updateRequestProcessorChain "stored_sig"
   [junit4]   2> 661308 T2033 C:collection1 c:collection1 oasup.UpdateRequestProcessorChain.init creating updateRequestProcessorChain "distrib-dup-test-chain-explicit"
   [junit4]   2> 661308 T2033 C:collection1 c:collection1 oasup.UpdateRequestProcessorChain.init creating updateRequestProcessorChain "distrib-dup-test-chain-implicit"
   [junit4]   2> 661309 T2033 C:collection1 c:collection1 oasup.UpdateRequestProcessorChain.init inserting DistributedUpdateProcessorFactory into updateRequestProcessorChain "distrib-dup-test-chain-implicit"
   [junit4]   2> 661309 T2033 C:collection1 c:collection1 oasc.SolrCore.loadUpdateProcessorChains no updateRequestProcessorChain defined as default, creating implicit default
   [junit4]   2> 661330 T2033 C:collection1 c:collection1 oashl.XMLLoader.init xsltCacheLifetimeSeconds=60
   [junit4]   2> 661332 T2033 C:collection1 c:collection1 oashl.XMLLoader.init xsltCacheLifetimeSeconds=60
   [junit4]   2> 661334 T2033 C:collection1 c:collection1 oashl.XMLLoader.init xsltCacheLifetimeSeconds=60
   [junit4]   2> 661336 T2033 C:collection1 c:collection1 oashl.XMLLoader.init xsltCacheLifetimeSeconds=60
   [junit4]   2> 661342 T2033 C:collection1 c:collection1 oasc.RequestHandlers.initHandlersFromConfig Registered paths: /update/json/docs,/admin/luke,/config,standard,/admin/segments,/replication,/admin/system,/get,/admin/threads,/admin/plugins,/admin/file,/schema,/update,/admin/mbeans,/admin/logging,/update/json,/admin/ping,/admin/properties,/update/csv
   [junit4]   2> 661344 T2033 C:collection1 c:collection1 oasc.SolrCore.initStatsCache Using default statsCache cache: org.apache.solr.search.stats.LocalStatsCache
   [junit4]   2> 661345 T2033 C:collection1 c:collection1 oasu.UpdateHandler.<init> Using UpdateLog implementation: org.apache.solr.update.UpdateLog
   [junit4]   2> 661345 T2033 C:collection1 c:collection1 oasu.UpdateLog.init Initializing UpdateLog: dataDir= defaultSyncLevel=FLUSH numRecordsToKeep=100 maxNumLogsToKeep=10
   [junit4]   2> 661347 T2033 C:collection1 c:collection1 oasu.CommitTracker.<init> Hard AutoCommit: disabled
   [junit4]   2> 661347 T2033 C:collection1 c:collection1 oasu.CommitTracker.<init> Soft AutoCommit: disabled
   [junit4]   2> 661348 T2033 C:collection1 c:collection1 oasu.RandomMergePolicy.<init> RandomMergePolicy wrapping class org.apache.lucene.index.LogDocMergePolicy: [LogDocMergePolicy: minMergeSize=1000, mergeFactor=14, maxMergeSize=9223372036854775807, maxMergeSizeForForcedMerge=9223372036854775807, calibrateSizeByDeletes=true, maxMergeDocs=2147483647, maxCFSSegmentSizeMB=8.796093022207999E12, noCFSRatio=0.33693801321823635]
   [junit4]   2> 661349 T2033 C:collection1 c:collection1 oasc.SolrDeletionPolicy.onInit SolrDeletionPolicy.onInit: commits: num=1
   [junit4]   2> 		commit{dir=MockDirectoryWrapper(RAMDirectory@3d4a4473 lockFactory=org.apache.lucene.store.SingleInstanceLockFactory@56d3f974),segFN=segments_1,generation=1}
   [junit4]   2> 661349 T2033 C:collection1 c:collection1 oasc.SolrDeletionPolicy.updateCommits newest commit generation = 1
   [junit4]   2> 661349 T2033 C:collection1 c:collection1 oass.SolrIndexSearcher.<init> Opening Searcher@52bd8264[collection1] main
   [junit4]   2> 661349 T2033 C:collection1 c:collection1 oascc.ZkStateReader.readConfigName Load collection config from:/collections/collection1
   [junit4]   2> 661350 T2033 C:collection1 c:collection1 oascc.ZkStateReader.readConfigName path=/collections/collection1 configName=conf1 specified config exists in ZooKeeper
   [junit4]   2> 661350 T2033 C:collection1 c:collection1 oasr.ManagedResourceStorage.newStorageIO Setting up ZooKeeper-based storage for the RestManager with znodeBase: /configs/conf1
   [junit4]   2> 661350 T2033 C:collection1 c:collection1 oasr.ManagedResourceStorage$ZooKeeperStorageIO.configure Configured ZooKeeperStorageIO with znodeBase: /configs/conf1
   [junit4]   2> 661351 T2033 C:collection1 c:collection1 oasr.RestManager.init Initializing RestManager with initArgs: {}
   [junit4]   2> 661351 T2033 C:collection1 c:collection1 oasr.ManagedResourceStorage.load Reading _rest_managed.json using ZooKeeperStorageIO:path=/configs/conf1
   [junit4]   2> 661351 T2033 C:collection1 c:collection1 oasr.ManagedResourceStorage$ZooKeeperStorageIO.openInputStream No data found for znode /configs/conf1/_rest_managed.json
   [junit4]   2> 661351 T2033 C:collection1 c:collection1 oasr.ManagedResourceStorage.load Loaded null at path _rest_managed.json using ZooKeeperStorageIO:path=/configs/conf1
   [junit4]   2> 661352 T2033 C:collection1 c:collection1 oasr.RestManager.init Initializing 0 registered ManagedResources
   [junit4]   2> 661352 T2033 C:collection1 c:collection1 oash.ReplicationHandler.inform Commits will be reserved for  10000
   [junit4]   2> 661353 T2034 C:collection1 c:collection1 oasc.SolrCore.registerSearcher [collection1] Registered new searcher Searcher@52bd8264[collection1] main{ExitableDirectoryReader(UninvertingDirectoryReader())}
   [junit4]   2> 661353 T2033 C:collection1 c:collection1 oasc.CoreContainer.registerCore registering core: collection1
   [junit4]   2> 661354 T2037 C:collection1 S:shard1 oasc.ZkController.register Register replica - core:collection1 address:http://127.0.0.1:22460 collection:collection1 shard:shard1
   [junit4]   2> 661354 T1976 oass.SolrDispatchFilter.init user.dir=/usr/home/jenkins/jenkins-slave/workspace/Lucene-Solr-Tests-5.x-Java7/solr/build/solr-core/test/J3
   [junit4]   2> 661354 T2037 C:collection1 S:shard1 oascc.SolrZkClient.makePath makePath: /collections/collection1/leader_elect/shard1/election
   [junit4]   2> 661355 T1976 oass.SolrDispatchFilter.init SolrDispatchFilter.init() done
   [junit4]   2> 661358 T2037 C:collection1 S:shard1 oasc.ShardLeaderElectionContext.runLeaderProcess Running the leader process for shard shard1
   [junit4]   2> 661359 T2002 oasc.DistributedQueue$LatchWatcher.process NodeChildrenChanged fired on path /overseer/queue state SyncConnected
   [junit4]   2> 661359 T2037 C:collection1 S:shard1 oasc.ShardLeaderElectionContext.waitForReplicasToComeUp Enough replicas found to continue.
   [junit4]   2> 661359 T2037 C:collection1 S:shard1 oasc.ShardLeaderElectionContext.runLeaderProcess I may be the new leader - try and sync
   [junit4]   2> ASYNC  NEW_CORE C228 name=collection1 org.apache.solr.core.SolrCore@eba0df9 url=http://127.0.0.1:22460/collection1 node=127.0.0.1:22460_ C228_STATE=coll:collection1 core:collection1 props:{node_name=127.0.0.1:22460_, base_url=http://127.0.0.1:22460, core=collection1, state=down}
   [junit4]   2> 661360 T2037 C:collection1 S:shard1 C228 P22460 oasc.SyncStrategy.sync Sync replicas to http://127.0.0.1:22460/collection1/
   [junit4]   2> 661360 T2003 oasc.Overseer$ClusterStateUpdater.run processMessage: queueSize: 1, message = {
   [junit4]   2> 	  "operation":"leader",
   [junit4]   2> 	  "shard":"shard1",
   [junit4]   2> 	  "collection":"collection1"} current state version: 5
   [junit4]   2> 661360 T2037 C:collection1 S:shard1 C228 P22460 oasc.SyncStrategy.syncReplicas Sync Success - now sync replicas to me
   [junit4]   2> 661360 T2037 C:collection1 S:shard1 C228 P22460 oasc.SyncStrategy.syncToMe http://127.0.0.1:22460/collection1/ has no replicas
   [junit4]   2> 661360 T2037 C:collection1 S:shard1 oasc.ShardLeaderElectionContext.runLeaderProcess I am the new leader: http://127.0.0.1:22460/collection1/ shard1
   [junit4]   2> 661360 T2037 C:collection1 S:shard1 oascc.SolrZkClient.makePath makePath: /collections/collection1/leaders/shard1
   [junit4]   2> 661361 T2003 oasco.ZkStateWriter.writePendingUpdates going to update_collection /collections/collection1/state.json version: 1
   [junit4]   2> 661361 T2032 oascc.ZkStateReader$7.process A cluster state change: WatchedEvent state:SyncConnected type:NodeDataChanged path:/collections/collection1/state.json for collection collection1 has occurred - updating... (live nodes size: 2)
   [junit4]   2> 661362 T2032 oascc.ZkStateReader.updateWatchedCollection Updating data for collection1 to ver 2 
   [junit4]   2> 661364 T2002 oasc.DistributedQueue$LatchWatcher.process NodeChildrenChanged fired on path /overseer/queue state SyncConnected
   [junit4]   2> 661364 T2003 oasc.Overseer$ClusterStateUpdater.run processMessage: queueSize: 1, message = {
   [junit4]   2> 	  "operation":"leader",
   [junit4]   2> 	  "shard":"shard1",
   [junit4]   2> 	  "collection":"collection1",
   [junit4]   2> 	  "base_url":"http://127.0.0.1:22460",
   [junit4]   2> 	  "core":"collection1",
   [junit4]   2> 	  "state":"active"} current state version: 5
   [junit4]   2> 661365 T2003 oasco.ZkStateWriter.writePendingUpdates going to update_collection /collections/collection1/state.json version: 2
   [junit4]   2> 661366 T2032 oascc.ZkStateReader$7.process A cluster state change: WatchedEvent state:SyncConnected type:NodeDataChanged path:/collections/collection1/state.json for collection collection1 has occurred - updating... (live nodes size: 2)
   [junit4]   2> 661366 T2032 oascc.ZkStateReader.updateWatchedCollection Updating data for collection1 to ver 3 
   [junit4]   2> 661414 T2037 C:collection1 S:shard1 oasc.ZkController.register We are http://127.0.0.1:22460/collection1/ and leader is http://127.0.0.1:22460/collection1/
   [junit4]   2> 661415 T2037 C:collection1 S:shard1 

[...truncated too long message...]

5 T6359 C:control_collection S:shard1 c:collection1 oasc.SocketProxy.close WARN Closing 2 connections to: http://127.0.0.1:16257/
   [junit4]   2> 1519576 T6359 C:control_collection S:shard1 c:collection1 oasc.SocketProxy.close WARN Closing 5 connections to: http://127.0.0.1:16228/
   [junit4]   2> 1519576 T6359 C:control_collection S:shard1 c:collection1 oasc.ReplicationFactorTest.distribTearDown super.distribTearDown complete, closing all socket proxies
   [junit4]   2> 1519576 T6359 C:control_collection S:shard1 c:collection1 oasc.SocketProxy.close WARN Closing 0 connections to: http://127.0.0.1:16215/
   [junit4]   2> 1519577 T6359 C:control_collection S:shard1 c:collection1 oasc.SocketProxy.close WARN Closing 0 connections to: http://127.0.0.1:16264/
   [junit4]   2> 1519577 T6359 C:control_collection S:shard1 c:collection1 oasc.SocketProxy.close WARN Closing 0 connections to: http://127.0.0.1:16257/
   [junit4]   2> 1519577 T6359 C:control_collection S:shard1 c:collection1 oasc.SocketProxy.close WARN Closing 0 connections to: http://127.0.0.1:16228/
   [junit4]   2> NOTE: reproduce with: ant test  -Dtestcase=ReplicationFactorTest -Dtests.method=test -Dtests.seed=47F5277B5BCEDC6F -Dtests.multiplier=2 -Dtests.slow=true -Dtests.locale=is_IS -Dtests.timezone=America/Kralendijk -Dtests.asserts=true -Dtests.file.encoding=US-ASCII
   [junit4] ERROR   82.0s J3 | ReplicationFactorTest.test <<<
   [junit4]    > Throwable #1: org.apache.solr.client.solrj.SolrServerException: org.apache.solr.client.solrj.SolrServerException: IOException occured when talking to server at: http://127.0.0.1:16215/repfacttest_c8n_1x3_shard1_replica3
   [junit4]    > 	at __randomizedtesting.SeedInfo.seed([47F5277B5BCEDC6F:CFA118A1F532B197]:0)
   [junit4]    > 	at org.apache.solr.client.solrj.impl.CloudSolrClient.directUpdate(CloudSolrClient.java:625)
   [junit4]    > 	at org.apache.solr.client.solrj.impl.CloudSolrClient.sendRequest(CloudSolrClient.java:948)
   [junit4]    > 	at org.apache.solr.client.solrj.impl.CloudSolrClient.requestWithRetryOnStaleState(CloudSolrClient.java:839)
   [junit4]    > 	at org.apache.solr.client.solrj.impl.CloudSolrClient.request(CloudSolrClient.java:782)
   [junit4]    > 	at org.apache.solr.client.solrj.SolrClient.request(SolrClient.java:1220)
   [junit4]    > 	at org.apache.solr.cloud.ReplicationFactorTest.sendDoc(ReplicationFactorTest.java:308)
   [junit4]    > 	at org.apache.solr.cloud.ReplicationFactorTest.testRf3(ReplicationFactorTest.java:234)
   [junit4]    > 	at org.apache.solr.cloud.ReplicationFactorTest.test(ReplicationFactorTest.java:113)
   [junit4]    > 	at org.apache.solr.BaseDistributedSearchTestCase$ShardsRepeatRule$ShardsFixedStatement.callStatement(BaseDistributedSearchTestCase.java:960)
   [junit4]    > 	at org.apache.solr.BaseDistributedSearchTestCase$ShardsRepeatRule$ShardsStatement.evaluate(BaseDistributedSearchTestCase.java:935)
   [junit4]    > 	at java.lang.Thread.run(Thread.java:745)
   [junit4]    > Caused by: org.apache.solr.client.solrj.SolrServerException: IOException occured when talking to server at: http://127.0.0.1:16215/repfacttest_c8n_1x3_shard1_replica3
   [junit4]    > 	at org.apache.solr.client.solrj.impl.HttpSolrClient.executeMethod(HttpSolrClient.java:570)
   [junit4]    > 	at org.apache.solr.client.solrj.impl.HttpSolrClient.request(HttpSolrClient.java:233)
   [junit4]    > 	at org.apache.solr.client.solrj.impl.HttpSolrClient.request(HttpSolrClient.java:225)
   [junit4]    > 	at org.apache.solr.client.solrj.impl.LBHttpSolrClient.doRequest(LBHttpSolrClient.java:370)
   [junit4]    > 	at org.apache.solr.client.solrj.impl.LBHttpSolrClient.request(LBHttpSolrClient.java:325)
   [junit4]    > 	at org.apache.solr.client.solrj.impl.CloudSolrClient.directUpdate(CloudSolrClient.java:622)
   [junit4]    > 	... 48 more
   [junit4]    > Caused by: org.apache.http.NoHttpResponseException: 127.0.0.1:16215 failed to respond
   [junit4]    > 	at org.apache.http.impl.conn.DefaultHttpResponseParser.parseHead(DefaultHttpResponseParser.java:143)
   [junit4]    > 	at org.apache.http.impl.conn.DefaultHttpResponseParser.parseHead(DefaultHttpResponseParser.java:57)
   [junit4]    > 	at org.apache.http.impl.io.AbstractMessageParser.parse(AbstractMessageParser.java:261)
   [junit4]    > 	at org.apache.http.impl.AbstractHttpClientConnection.receiveResponseHeader(AbstractHttpClientConnection.java:283)
   [junit4]    > 	at org.apache.http.impl.conn.DefaultClientConnection.receiveResponseHeader(DefaultClientConnection.java:251)
   [junit4]    > 	at org.apache.http.impl.conn.ManagedClientConnectionImpl.receiveResponseHeader(ManagedClientConnectionImpl.java:197)
   [junit4]    > 	at org.apache.http.protocol.HttpRequestExecutor.doReceiveResponse(HttpRequestExecutor.java:272)
   [junit4]    > 	at org.apache.http.protocol.HttpRequestExecutor.execute(HttpRequestExecutor.java:124)
   [junit4]    > 	at org.apache.http.impl.client.DefaultRequestDirector.tryExecute(DefaultRequestDirector.java:685)
   [junit4]    > 	at org.apache.http.impl.client.DefaultRequestDirector.execute(DefaultRequestDirector.java:487)
   [junit4]    > 	at org.apache.http.impl.client.AbstractHttpClient.doExecute(AbstractHttpClient.java:882)
   [junit4]    > 	at org.apache.http.impl.client.CloseableHttpClient.execute(CloseableHttpClient.java:82)
   [junit4]    > 	at org.apache.http.impl.client.CloseableHttpClient.execute(CloseableHttpClient.java:107)
   [junit4]    > 	at org.apache.http.impl.client.CloseableHttpClient.execute(CloseableHttpClient.java:55)
   [junit4]    > 	at org.apache.solr.client.solrj.impl.HttpSolrClient.executeMethod(HttpSolrClient.java:462)
   [junit4]    > 	... 53 more
   [junit4]   2> 1519603 T6359 C:control_collection S:shard1 c:collection1 oas.SolrTestCaseJ4.deleteCore ###deleteCore
   [junit4]   2> NOTE: leaving temporary files on disk at: /usr/home/jenkins/jenkins-slave/workspace/Lucene-Solr-Tests-5.x-Java7/solr/build/solr-core/test/J3/temp/solr.cloud.ReplicationFactorTest 47F5277B5BCEDC6F-001
   [junit4]   2> NOTE: test params are: codec=Asserting(Lucene50): {timestamp=Lucene50(blocksize=128), intDefault=PostingsFormat(name=MockRandom), a_t=Lucene50(blocksize=128), range_facet_l=Lucene50(blocksize=128), id=PostingsFormat(name=LuceneVarGapFixedInterval), text=PostingsFormat(name=LuceneVarGapDocFreqInterval), _version_=PostingsFormat(name=MockRandom), multiDefault=Lucene50(blocksize=128)}, docValues:{timestamp=DocValuesFormat(name=Memory)}, sim=DefaultSimilarity, locale=is_IS, timezone=America/Kralendijk
   [junit4]   2> NOTE: FreeBSD 9.1-RELEASE-p3 amd64/Oracle Corporation 1.7.0_65 (64-bit)/cpus=16,threads=1,free=172440416,total=427819008
   [junit4]   2> NOTE: All tests run in this JVM: [DocValuesMultiTest, ZkNodePropsTest, AddSchemaFieldsUpdateProcessorFactoryTest, ResponseLogComponentTest, BasicDistributedZk2Test, TestConfigSets, DistributedSuggestComponentTest, TestObjectReleaseTracker, HdfsSyncSliceTest, DirectSolrSpellCheckerTest, TestHdfsUpdateLog, TestFoldingMultitermQuery, TestRTGBase, OverseerTest, TimeZoneUtilsTest, DeleteInactiveReplicaTest, TestFuzzyAnalyzedSuggestions, TestHashQParserPlugin, TestReqParamsAPI, DocumentAnalysisRequestHandlerTest, TestHighlightDedupGrouping, TestInfoStreamLogging, ShardRoutingCustomTest, FieldMutatingUpdateProcessorTest, RegexBoostProcessorTest, StatsComponentTest, PreAnalyzedFieldTest, TestSurroundQueryParser, TestSolrQueryParser, TestOrdValues, RequestHandlersTest, DistribDocExpirationUpdateProcessorTest, TestExtendedDismaxParser, HdfsDirectoryFactoryTest, DeleteShardTest, DistributedQueryComponentCustomSortTest, RecoveryAfterSoftCommitTest, AnalysisAfterCoreReloadTest, RequiredFieldsTest, TestManagedStopFilterFactory, CSVRequestHandlerTest, RequestLoggingTest, TestInitParams, TestSweetSpotSimilarityFactory, LukeRequestHandlerTest, DistribJoinFromCollectionTest, TestRawResponseWriter, UUIDUpdateProcessorFallbackTest, TriLevelCompositeIdRoutingTest, TestIndexingPerformance, TestDynamicFieldResource, HardAutoCommitTest, TestSystemIdResolver, CloudExitableDirectoryReaderTest, TestSolrJ, SuggesterWFSTTest, TestStressReorder, CachingDirectoryFactoryTest, NumericFieldsTest, TestRemoteStreaming, TestCloudManagedSchemaConcurrent, TestReplicationHandler, CustomCollectionTest, ReplicationFactorTest]
   [junit4] Completed on J3 in 82.07s, 1 test, 1 error <<< FAILURES!

[...truncated 708 lines...]
BUILD FAILED
/usr/home/jenkins/jenkins-slave/workspace/Lucene-Solr-Tests-5.x-Java7/build.xml:529: The following error occurred while executing this line:
/usr/home/jenkins/jenkins-slave/workspace/Lucene-Solr-Tests-5.x-Java7/build.xml:477: The following error occurred while executing this line:
/usr/home/jenkins/jenkins-slave/workspace/Lucene-Solr-Tests-5.x-Java7/build.xml:61: The following error occurred while executing this line:
/usr/home/jenkins/jenkins-slave/workspace/Lucene-Solr-Tests-5.x-Java7/extra-targets.xml:39: The following error occurred while executing this line:
/usr/home/jenkins/jenkins-slave/workspace/Lucene-Solr-Tests-5.x-Java7/solr/build.xml:191: The following error occurred while executing this line:
/usr/home/jenkins/jenkins-slave/workspace/Lucene-Solr-Tests-5.x-Java7/solr/common-build.xml:509: The following error occurred while executing this line:
/usr/home/jenkins/jenkins-slave/workspace/Lucene-Solr-Tests-5.x-Java7/lucene/common-build.xml:1370: The following error occurred while executing this line:
/usr/home/jenkins/jenkins-slave/workspace/Lucene-Solr-Tests-5.x-Java7/lucene/common-build.xml:976: There were test failures: 478 suites, 1902 tests, 3 errors, 61 ignored (21 assumptions)

Total time: 53 minutes 44 seconds
Build step 'Invoke Ant' marked build as failure
Archiving artifacts
Sending artifact delta relative to Lucene-Solr-Tests-5.x-Java7 #2431
Archived 5 artifacts
Archive block size is 32768
Received 0 blocks and 217369576 bytes
Compression is 0.0%
Took 43 sec
Recording test results
Email was triggered for: Failure
Sending email for trigger: Failure



Mime
View raw message