lucene-dev mailing list archives

Site index · List index
Message view « Date » · « Thread »
Top « Date » · « Thread »
From Policeman Jenkins Server <jenk...@thetaphi.de>
Subject [JENKINS] Lucene-Solr-trunk-Windows (64bit/jdk1.8.0_40) - Build # 4719 - Failure!
Date Thu, 23 Apr 2015 19:28:33 GMT
Build: http://jenkins.thetaphi.de/job/Lucene-Solr-trunk-Windows/4719/
Java: 64bit/jdk1.8.0_40 -XX:-UseCompressedOops -XX:+UseConcMarkSweepGC

3 tests failed.
FAILED:  org.apache.solr.cloud.SaslZkACLProviderTest.testSaslZkACLProvider

Error Message:
Could not get the port for ZooKeeper server

Stack Trace:
java.lang.RuntimeException: Could not get the port for ZooKeeper server
	at org.apache.solr.cloud.ZkTestServer.run(ZkTestServer.java:506)
	at org.apache.solr.cloud.SaslZkACLProviderTest$SaslZkTestServer.run(SaslZkACLProviderTest.java:226)
	at org.apache.solr.cloud.SaslZkACLProviderTest.setUp(SaslZkACLProviderTest.java:91)
	at sun.reflect.GeneratedMethodAccessor10.invoke(Unknown Source)
	at sun.reflect.DelegatingMethodAccessorImpl.invoke(DelegatingMethodAccessorImpl.java:43)
	at java.lang.reflect.Method.invoke(Method.java:497)
	at com.carrotsearch.randomizedtesting.RandomizedRunner.invoke(RandomizedRunner.java:1627)
	at com.carrotsearch.randomizedtesting.RandomizedRunner$7.evaluate(RandomizedRunner.java:870)
	at com.carrotsearch.randomizedtesting.RandomizedRunner$8.evaluate(RandomizedRunner.java:886)
	at com.carrotsearch.randomizedtesting.rules.SystemPropertiesRestoreRule$1.evaluate(SystemPropertiesRestoreRule.java:57)
	at org.apache.lucene.util.TestRuleSetupTeardownChained$1.evaluate(TestRuleSetupTeardownChained.java:50)
	at org.apache.lucene.util.AbstractBeforeAfterRule$1.evaluate(AbstractBeforeAfterRule.java:46)
	at org.apache.lucene.util.TestRuleThreadAndTestName$1.evaluate(TestRuleThreadAndTestName.java:49)
	at org.apache.lucene.util.TestRuleIgnoreAfterMaxFailures$1.evaluate(TestRuleIgnoreAfterMaxFailures.java:65)
	at org.apache.lucene.util.TestRuleMarkFailure$1.evaluate(TestRuleMarkFailure.java:48)
	at com.carrotsearch.randomizedtesting.rules.StatementAdapter.evaluate(StatementAdapter.java:36)
	at com.carrotsearch.randomizedtesting.ThreadLeakControl$StatementRunner.run(ThreadLeakControl.java:365)
	at com.carrotsearch.randomizedtesting.ThreadLeakControl.forkTimeoutingTask(ThreadLeakControl.java:798)
	at com.carrotsearch.randomizedtesting.ThreadLeakControl$3.evaluate(ThreadLeakControl.java:458)
	at com.carrotsearch.randomizedtesting.RandomizedRunner.runSingleTest(RandomizedRunner.java:845)
	at com.carrotsearch.randomizedtesting.RandomizedRunner$3.evaluate(RandomizedRunner.java:747)
	at com.carrotsearch.randomizedtesting.RandomizedRunner$4.evaluate(RandomizedRunner.java:781)
	at com.carrotsearch.randomizedtesting.RandomizedRunner$5.evaluate(RandomizedRunner.java:792)
	at com.carrotsearch.randomizedtesting.rules.StatementAdapter.evaluate(StatementAdapter.java:36)
	at com.carrotsearch.randomizedtesting.rules.SystemPropertiesRestoreRule$1.evaluate(SystemPropertiesRestoreRule.java:57)
	at org.apache.lucene.util.AbstractBeforeAfterRule$1.evaluate(AbstractBeforeAfterRule.java:46)
	at com.carrotsearch.randomizedtesting.rules.StatementAdapter.evaluate(StatementAdapter.java:36)
	at org.apache.lucene.util.TestRuleStoreClassName$1.evaluate(TestRuleStoreClassName.java:42)
	at com.carrotsearch.randomizedtesting.rules.NoShadowingOrOverridesOnMethodsRule$1.evaluate(NoShadowingOrOverridesOnMethodsRule.java:39)
	at com.carrotsearch.randomizedtesting.rules.NoShadowingOrOverridesOnMethodsRule$1.evaluate(NoShadowingOrOverridesOnMethodsRule.java:39)
	at com.carrotsearch.randomizedtesting.rules.StatementAdapter.evaluate(StatementAdapter.java:36)
	at com.carrotsearch.randomizedtesting.rules.StatementAdapter.evaluate(StatementAdapter.java:36)
	at com.carrotsearch.randomizedtesting.rules.StatementAdapter.evaluate(StatementAdapter.java:36)
	at org.apache.lucene.util.TestRuleAssertionsRequired$1.evaluate(TestRuleAssertionsRequired.java:54)
	at org.apache.lucene.util.TestRuleMarkFailure$1.evaluate(TestRuleMarkFailure.java:48)
	at org.apache.lucene.util.TestRuleIgnoreAfterMaxFailures$1.evaluate(TestRuleIgnoreAfterMaxFailures.java:65)
	at org.apache.lucene.util.TestRuleIgnoreTestSuites$1.evaluate(TestRuleIgnoreTestSuites.java:55)
	at com.carrotsearch.randomizedtesting.rules.StatementAdapter.evaluate(StatementAdapter.java:36)
	at com.carrotsearch.randomizedtesting.ThreadLeakControl$StatementRunner.run(ThreadLeakControl.java:365)
	at java.lang.Thread.run(Thread.java:745)


FAILED:  junit.framework.TestSuite.org.apache.solr.cloud.SaslZkACLProviderTest

Error Message:
6 threads leaked from SUITE scope at org.apache.solr.cloud.SaslZkACLProviderTest:     1) Thread[id=11256, name=groupCache.data, state=TIMED_WAITING, group=TGRP-SaslZkACLProviderTest]         at sun.misc.Unsafe.park(Native Method)         at java.util.concurrent.locks.LockSupport.parkNanos(LockSupport.java:215)         at java.util.concurrent.locks.AbstractQueuedSynchronizer$ConditionObject.awaitNanos(AbstractQueuedSynchronizer.java:2078)         at java.util.concurrent.ScheduledThreadPoolExecutor$DelayedWorkQueue.take(ScheduledThreadPoolExecutor.java:1093)         at java.util.concurrent.ScheduledThreadPoolExecutor$DelayedWorkQueue.take(ScheduledThreadPoolExecutor.java:809)         at java.util.concurrent.ThreadPoolExecutor.getTask(ThreadPoolExecutor.java:1067)         at java.util.concurrent.ThreadPoolExecutor.runWorker(ThreadPoolExecutor.java:1127)         at java.util.concurrent.ThreadPoolExecutor$Worker.run(ThreadPoolExecutor.java:617)         at java.lang.Thread.run(Thread.java:745)    2) Thread[id=11255, name=kdcReplayCache.data, state=TIMED_WAITING, group=TGRP-SaslZkACLProviderTest]         at sun.misc.Unsafe.park(Native Method)         at java.util.concurrent.locks.LockSupport.parkNanos(LockSupport.java:215)         at java.util.concurrent.locks.AbstractQueuedSynchronizer$ConditionObject.awaitNanos(AbstractQueuedSynchronizer.java:2078)         at java.util.concurrent.ScheduledThreadPoolExecutor$DelayedWorkQueue.take(ScheduledThreadPoolExecutor.java:1093)         at java.util.concurrent.ScheduledThreadPoolExecutor$DelayedWorkQueue.take(ScheduledThreadPoolExecutor.java:809)         at java.util.concurrent.ThreadPoolExecutor.getTask(ThreadPoolExecutor.java:1067)         at java.util.concurrent.ThreadPoolExecutor.runWorker(ThreadPoolExecutor.java:1127)         at java.util.concurrent.ThreadPoolExecutor$Worker.run(ThreadPoolExecutor.java:617)         at java.lang.Thread.run(Thread.java:745)    3) Thread[id=11257, name=changePwdReplayCache.data, state=TIMED_WAITING, group=TGRP-SaslZkACLProviderTest]         at sun.misc.Unsafe.park(Native Method)         at java.util.concurrent.locks.LockSupport.parkNanos(LockSupport.java:215)         at java.util.concurrent.locks.AbstractQueuedSynchronizer$ConditionObject.awaitNanos(AbstractQueuedSynchronizer.java:2078)         at java.util.concurrent.ScheduledThreadPoolExecutor$DelayedWorkQueue.take(ScheduledThreadPoolExecutor.java:1093)         at java.util.concurrent.ScheduledThreadPoolExecutor$DelayedWorkQueue.take(ScheduledThreadPoolExecutor.java:809)         at java.util.concurrent.ThreadPoolExecutor.getTask(ThreadPoolExecutor.java:1067)         at java.util.concurrent.ThreadPoolExecutor.runWorker(ThreadPoolExecutor.java:1127)         at java.util.concurrent.ThreadPoolExecutor$Worker.run(ThreadPoolExecutor.java:617)         at java.lang.Thread.run(Thread.java:745)    4) Thread[id=11254, name=apacheds, state=WAITING, group=TGRP-SaslZkACLProviderTest]         at java.lang.Object.wait(Native Method)         at java.lang.Object.wait(Object.java:502)         at java.util.TimerThread.mainLoop(Timer.java:526)         at java.util.TimerThread.run(Timer.java:505)    5) Thread[id=11258, name=ou=system.data, state=TIMED_WAITING, group=TGRP-SaslZkACLProviderTest]         at sun.misc.Unsafe.park(Native Method)         at java.util.concurrent.locks.LockSupport.parkNanos(LockSupport.java:215)         at java.util.concurrent.locks.AbstractQueuedSynchronizer$ConditionObject.awaitNanos(AbstractQueuedSynchronizer.java:2078)         at java.util.concurrent.ScheduledThreadPoolExecutor$DelayedWorkQueue.take(ScheduledThreadPoolExecutor.java:1093)         at java.util.concurrent.ScheduledThreadPoolExecutor$DelayedWorkQueue.take(ScheduledThreadPoolExecutor.java:809)         at java.util.concurrent.ThreadPoolExecutor.getTask(ThreadPoolExecutor.java:1067)         at java.util.concurrent.ThreadPoolExecutor.runWorker(ThreadPoolExecutor.java:1127)         at java.util.concurrent.ThreadPoolExecutor$Worker.run(ThreadPoolExecutor.java:617)         at java.lang.Thread.run(Thread.java:745)    6) Thread[id=11259, name=NioSocketAcceptor-1, state=RUNNABLE, group=TGRP-SaslZkACLProviderTest]         at sun.nio.ch.WindowsSelectorImpl$SubSelector.poll0(Native Method)         at sun.nio.ch.WindowsSelectorImpl$SubSelector.poll(WindowsSelectorImpl.java:296)         at sun.nio.ch.WindowsSelectorImpl$SubSelector.access$400(WindowsSelectorImpl.java:278)         at sun.nio.ch.WindowsSelectorImpl.doSelect(WindowsSelectorImpl.java:159)         at sun.nio.ch.SelectorImpl.lockAndDoSelect(SelectorImpl.java:86)         at sun.nio.ch.SelectorImpl.select(SelectorImpl.java:97)         at sun.nio.ch.SelectorImpl.select(SelectorImpl.java:101)         at org.apache.mina.transport.socket.nio.NioSocketAcceptor.select(NioSocketAcceptor.java:234)         at org.apache.mina.core.polling.AbstractPollingIoAcceptor$Acceptor.run(AbstractPollingIoAcceptor.java:417)         at org.apache.mina.util.NamePreservingRunnable.run(NamePreservingRunnable.java:64)         at java.util.concurrent.ThreadPoolExecutor.runWorker(ThreadPoolExecutor.java:1142)         at java.util.concurrent.ThreadPoolExecutor$Worker.run(ThreadPoolExecutor.java:617)         at java.lang.Thread.run(Thread.java:745)

Stack Trace:
com.carrotsearch.randomizedtesting.ThreadLeakError: 6 threads leaked from SUITE scope at org.apache.solr.cloud.SaslZkACLProviderTest: 
   1) Thread[id=11256, name=groupCache.data, state=TIMED_WAITING, group=TGRP-SaslZkACLProviderTest]
        at sun.misc.Unsafe.park(Native Method)
        at java.util.concurrent.locks.LockSupport.parkNanos(LockSupport.java:215)
        at java.util.concurrent.locks.AbstractQueuedSynchronizer$ConditionObject.awaitNanos(AbstractQueuedSynchronizer.java:2078)
        at java.util.concurrent.ScheduledThreadPoolExecutor$DelayedWorkQueue.take(ScheduledThreadPoolExecutor.java:1093)
        at java.util.concurrent.ScheduledThreadPoolExecutor$DelayedWorkQueue.take(ScheduledThreadPoolExecutor.java:809)
        at java.util.concurrent.ThreadPoolExecutor.getTask(ThreadPoolExecutor.java:1067)
        at java.util.concurrent.ThreadPoolExecutor.runWorker(ThreadPoolExecutor.java:1127)
        at java.util.concurrent.ThreadPoolExecutor$Worker.run(ThreadPoolExecutor.java:617)
        at java.lang.Thread.run(Thread.java:745)
   2) Thread[id=11255, name=kdcReplayCache.data, state=TIMED_WAITING, group=TGRP-SaslZkACLProviderTest]
        at sun.misc.Unsafe.park(Native Method)
        at java.util.concurrent.locks.LockSupport.parkNanos(LockSupport.java:215)
        at java.util.concurrent.locks.AbstractQueuedSynchronizer$ConditionObject.awaitNanos(AbstractQueuedSynchronizer.java:2078)
        at java.util.concurrent.ScheduledThreadPoolExecutor$DelayedWorkQueue.take(ScheduledThreadPoolExecutor.java:1093)
        at java.util.concurrent.ScheduledThreadPoolExecutor$DelayedWorkQueue.take(ScheduledThreadPoolExecutor.java:809)
        at java.util.concurrent.ThreadPoolExecutor.getTask(ThreadPoolExecutor.java:1067)
        at java.util.concurrent.ThreadPoolExecutor.runWorker(ThreadPoolExecutor.java:1127)
        at java.util.concurrent.ThreadPoolExecutor$Worker.run(ThreadPoolExecutor.java:617)
        at java.lang.Thread.run(Thread.java:745)
   3) Thread[id=11257, name=changePwdReplayCache.data, state=TIMED_WAITING, group=TGRP-SaslZkACLProviderTest]
        at sun.misc.Unsafe.park(Native Method)
        at java.util.concurrent.locks.LockSupport.parkNanos(LockSupport.java:215)
        at java.util.concurrent.locks.AbstractQueuedSynchronizer$ConditionObject.awaitNanos(AbstractQueuedSynchronizer.java:2078)
        at java.util.concurrent.ScheduledThreadPoolExecutor$DelayedWorkQueue.take(ScheduledThreadPoolExecutor.java:1093)
        at java.util.concurrent.ScheduledThreadPoolExecutor$DelayedWorkQueue.take(ScheduledThreadPoolExecutor.java:809)
        at java.util.concurrent.ThreadPoolExecutor.getTask(ThreadPoolExecutor.java:1067)
        at java.util.concurrent.ThreadPoolExecutor.runWorker(ThreadPoolExecutor.java:1127)
        at java.util.concurrent.ThreadPoolExecutor$Worker.run(ThreadPoolExecutor.java:617)
        at java.lang.Thread.run(Thread.java:745)
   4) Thread[id=11254, name=apacheds, state=WAITING, group=TGRP-SaslZkACLProviderTest]
        at java.lang.Object.wait(Native Method)
        at java.lang.Object.wait(Object.java:502)
        at java.util.TimerThread.mainLoop(Timer.java:526)
        at java.util.TimerThread.run(Timer.java:505)
   5) Thread[id=11258, name=ou=system.data, state=TIMED_WAITING, group=TGRP-SaslZkACLProviderTest]
        at sun.misc.Unsafe.park(Native Method)
        at java.util.concurrent.locks.LockSupport.parkNanos(LockSupport.java:215)
        at java.util.concurrent.locks.AbstractQueuedSynchronizer$ConditionObject.awaitNanos(AbstractQueuedSynchronizer.java:2078)
        at java.util.concurrent.ScheduledThreadPoolExecutor$DelayedWorkQueue.take(ScheduledThreadPoolExecutor.java:1093)
        at java.util.concurrent.ScheduledThreadPoolExecutor$DelayedWorkQueue.take(ScheduledThreadPoolExecutor.java:809)
        at java.util.concurrent.ThreadPoolExecutor.getTask(ThreadPoolExecutor.java:1067)
        at java.util.concurrent.ThreadPoolExecutor.runWorker(ThreadPoolExecutor.java:1127)
        at java.util.concurrent.ThreadPoolExecutor$Worker.run(ThreadPoolExecutor.java:617)
        at java.lang.Thread.run(Thread.java:745)
   6) Thread[id=11259, name=NioSocketAcceptor-1, state=RUNNABLE, group=TGRP-SaslZkACLProviderTest]
        at sun.nio.ch.WindowsSelectorImpl$SubSelector.poll0(Native Method)
        at sun.nio.ch.WindowsSelectorImpl$SubSelector.poll(WindowsSelectorImpl.java:296)
        at sun.nio.ch.WindowsSelectorImpl$SubSelector.access$400(WindowsSelectorImpl.java:278)
        at sun.nio.ch.WindowsSelectorImpl.doSelect(WindowsSelectorImpl.java:159)
        at sun.nio.ch.SelectorImpl.lockAndDoSelect(SelectorImpl.java:86)
        at sun.nio.ch.SelectorImpl.select(SelectorImpl.java:97)
        at sun.nio.ch.SelectorImpl.select(SelectorImpl.java:101)
        at org.apache.mina.transport.socket.nio.NioSocketAcceptor.select(NioSocketAcceptor.java:234)
        at org.apache.mina.core.polling.AbstractPollingIoAcceptor$Acceptor.run(AbstractPollingIoAcceptor.java:417)
        at org.apache.mina.util.NamePreservingRunnable.run(NamePreservingRunnable.java:64)
        at java.util.concurrent.ThreadPoolExecutor.runWorker(ThreadPoolExecutor.java:1142)
        at java.util.concurrent.ThreadPoolExecutor$Worker.run(ThreadPoolExecutor.java:617)
        at java.lang.Thread.run(Thread.java:745)
	at __randomizedtesting.SeedInfo.seed([894D2A924BC1EC56]:0)


FAILED:  junit.framework.TestSuite.org.apache.solr.cloud.SaslZkACLProviderTest

Error Message:
There are still zombie threads that couldn't be terminated:    1) Thread[id=11256, name=groupCache.data, state=TIMED_WAITING, group=TGRP-SaslZkACLProviderTest]         at sun.misc.Unsafe.park(Native Method)         at java.util.concurrent.locks.LockSupport.parkNanos(LockSupport.java:215)         at java.util.concurrent.locks.AbstractQueuedSynchronizer$ConditionObject.awaitNanos(AbstractQueuedSynchronizer.java:2078)         at java.util.concurrent.ScheduledThreadPoolExecutor$DelayedWorkQueue.take(ScheduledThreadPoolExecutor.java:1093)         at java.util.concurrent.ScheduledThreadPoolExecutor$DelayedWorkQueue.take(ScheduledThreadPoolExecutor.java:809)         at java.util.concurrent.ThreadPoolExecutor.getTask(ThreadPoolExecutor.java:1067)         at java.util.concurrent.ThreadPoolExecutor.runWorker(ThreadPoolExecutor.java:1127)         at java.util.concurrent.ThreadPoolExecutor$Worker.run(ThreadPoolExecutor.java:617)         at java.lang.Thread.run(Thread.java:745)    2) Thread[id=11255, name=kdcReplayCache.data, state=TIMED_WAITING, group=TGRP-SaslZkACLProviderTest]         at sun.misc.Unsafe.park(Native Method)         at java.util.concurrent.locks.LockSupport.parkNanos(LockSupport.java:215)         at java.util.concurrent.locks.AbstractQueuedSynchronizer$ConditionObject.awaitNanos(AbstractQueuedSynchronizer.java:2078)         at java.util.concurrent.ScheduledThreadPoolExecutor$DelayedWorkQueue.take(ScheduledThreadPoolExecutor.java:1093)         at java.util.concurrent.ScheduledThreadPoolExecutor$DelayedWorkQueue.take(ScheduledThreadPoolExecutor.java:809)         at java.util.concurrent.ThreadPoolExecutor.getTask(ThreadPoolExecutor.java:1067)         at java.util.concurrent.ThreadPoolExecutor.runWorker(ThreadPoolExecutor.java:1127)         at java.util.concurrent.ThreadPoolExecutor$Worker.run(ThreadPoolExecutor.java:617)         at java.lang.Thread.run(Thread.java:745)    3) Thread[id=11257, name=changePwdReplayCache.data, state=TIMED_WAITING, group=TGRP-SaslZkACLProviderTest]         at sun.misc.Unsafe.park(Native Method)         at java.util.concurrent.locks.LockSupport.parkNanos(LockSupport.java:215)         at java.util.concurrent.locks.AbstractQueuedSynchronizer$ConditionObject.awaitNanos(AbstractQueuedSynchronizer.java:2078)         at java.util.concurrent.ScheduledThreadPoolExecutor$DelayedWorkQueue.take(ScheduledThreadPoolExecutor.java:1093)         at java.util.concurrent.ScheduledThreadPoolExecutor$DelayedWorkQueue.take(ScheduledThreadPoolExecutor.java:809)         at java.util.concurrent.ThreadPoolExecutor.getTask(ThreadPoolExecutor.java:1067)         at java.util.concurrent.ThreadPoolExecutor.runWorker(ThreadPoolExecutor.java:1127)         at java.util.concurrent.ThreadPoolExecutor$Worker.run(ThreadPoolExecutor.java:617)         at java.lang.Thread.run(Thread.java:745)    4) Thread[id=11254, name=apacheds, state=WAITING, group=TGRP-SaslZkACLProviderTest]         at java.lang.Object.wait(Native Method)         at java.lang.Object.wait(Object.java:502)         at java.util.TimerThread.mainLoop(Timer.java:526)         at java.util.TimerThread.run(Timer.java:505)    5) Thread[id=11258, name=ou=system.data, state=TIMED_WAITING, group=TGRP-SaslZkACLProviderTest]         at sun.misc.Unsafe.park(Native Method)         at java.util.concurrent.locks.LockSupport.parkNanos(LockSupport.java:215)         at java.util.concurrent.locks.AbstractQueuedSynchronizer$ConditionObject.awaitNanos(AbstractQueuedSynchronizer.java:2078)         at java.util.concurrent.ScheduledThreadPoolExecutor$DelayedWorkQueue.take(ScheduledThreadPoolExecutor.java:1093)         at java.util.concurrent.ScheduledThreadPoolExecutor$DelayedWorkQueue.take(ScheduledThreadPoolExecutor.java:809)         at java.util.concurrent.ThreadPoolExecutor.getTask(ThreadPoolExecutor.java:1067)         at java.util.concurrent.ThreadPoolExecutor.runWorker(ThreadPoolExecutor.java:1127)         at java.util.concurrent.ThreadPoolExecutor$Worker.run(ThreadPoolExecutor.java:617)         at java.lang.Thread.run(Thread.java:745)    6) Thread[id=11259, name=NioSocketAcceptor-1, state=RUNNABLE, group=TGRP-SaslZkACLProviderTest]         at sun.nio.ch.WindowsSelectorImpl.setWakeupSocket0(Native Method)         at sun.nio.ch.WindowsSelectorImpl.setWakeupSocket(WindowsSelectorImpl.java:464)         at sun.nio.ch.WindowsSelectorImpl.wakeup(WindowsSelectorImpl.java:606)         at java.nio.channels.spi.AbstractSelector$1.interrupt(AbstractSelector.java:213)         at java.nio.channels.spi.AbstractSelector.begin(AbstractSelector.java:219)         at sun.nio.ch.WindowsSelectorImpl.doSelect(WindowsSelectorImpl.java:157)         at sun.nio.ch.SelectorImpl.lockAndDoSelect(SelectorImpl.java:86)         at sun.nio.ch.SelectorImpl.select(SelectorImpl.java:97)         at sun.nio.ch.SelectorImpl.select(SelectorImpl.java:101)         at org.apache.mina.transport.socket.nio.NioSocketAcceptor.select(NioSocketAcceptor.java:234)         at org.apache.mina.core.polling.AbstractPollingIoAcceptor$Acceptor.run(AbstractPollingIoAcceptor.java:417)         at org.apache.mina.util.NamePreservingRunnable.run(NamePreservingRunnable.java:64)         at java.util.concurrent.ThreadPoolExecutor.runWorker(ThreadPoolExecutor.java:1142)         at java.util.concurrent.ThreadPoolExecutor$Worker.run(ThreadPoolExecutor.java:617)         at java.lang.Thread.run(Thread.java:745)

Stack Trace:
com.carrotsearch.randomizedtesting.ThreadLeakError: There are still zombie threads that couldn't be terminated:
   1) Thread[id=11256, name=groupCache.data, state=TIMED_WAITING, group=TGRP-SaslZkACLProviderTest]
        at sun.misc.Unsafe.park(Native Method)
        at java.util.concurrent.locks.LockSupport.parkNanos(LockSupport.java:215)
        at java.util.concurrent.locks.AbstractQueuedSynchronizer$ConditionObject.awaitNanos(AbstractQueuedSynchronizer.java:2078)
        at java.util.concurrent.ScheduledThreadPoolExecutor$DelayedWorkQueue.take(ScheduledThreadPoolExecutor.java:1093)
        at java.util.concurrent.ScheduledThreadPoolExecutor$DelayedWorkQueue.take(ScheduledThreadPoolExecutor.java:809)
        at java.util.concurrent.ThreadPoolExecutor.getTask(ThreadPoolExecutor.java:1067)
        at java.util.concurrent.ThreadPoolExecutor.runWorker(ThreadPoolExecutor.java:1127)
        at java.util.concurrent.ThreadPoolExecutor$Worker.run(ThreadPoolExecutor.java:617)
        at java.lang.Thread.run(Thread.java:745)
   2) Thread[id=11255, name=kdcReplayCache.data, state=TIMED_WAITING, group=TGRP-SaslZkACLProviderTest]
        at sun.misc.Unsafe.park(Native Method)
        at java.util.concurrent.locks.LockSupport.parkNanos(LockSupport.java:215)
        at java.util.concurrent.locks.AbstractQueuedSynchronizer$ConditionObject.awaitNanos(AbstractQueuedSynchronizer.java:2078)
        at java.util.concurrent.ScheduledThreadPoolExecutor$DelayedWorkQueue.take(ScheduledThreadPoolExecutor.java:1093)
        at java.util.concurrent.ScheduledThreadPoolExecutor$DelayedWorkQueue.take(ScheduledThreadPoolExecutor.java:809)
        at java.util.concurrent.ThreadPoolExecutor.getTask(ThreadPoolExecutor.java:1067)
        at java.util.concurrent.ThreadPoolExecutor.runWorker(ThreadPoolExecutor.java:1127)
        at java.util.concurrent.ThreadPoolExecutor$Worker.run(ThreadPoolExecutor.java:617)
        at java.lang.Thread.run(Thread.java:745)
   3) Thread[id=11257, name=changePwdReplayCache.data, state=TIMED_WAITING, group=TGRP-SaslZkACLProviderTest]
        at sun.misc.Unsafe.park(Native Method)
        at java.util.concurrent.locks.LockSupport.parkNanos(LockSupport.java:215)
        at java.util.concurrent.locks.AbstractQueuedSynchronizer$ConditionObject.awaitNanos(AbstractQueuedSynchronizer.java:2078)
        at java.util.concurrent.ScheduledThreadPoolExecutor$DelayedWorkQueue.take(ScheduledThreadPoolExecutor.java:1093)
        at java.util.concurrent.ScheduledThreadPoolExecutor$DelayedWorkQueue.take(ScheduledThreadPoolExecutor.java:809)
        at java.util.concurrent.ThreadPoolExecutor.getTask(ThreadPoolExecutor.java:1067)
        at java.util.concurrent.ThreadPoolExecutor.runWorker(ThreadPoolExecutor.java:1127)
        at java.util.concurrent.ThreadPoolExecutor$Worker.run(ThreadPoolExecutor.java:617)
        at java.lang.Thread.run(Thread.java:745)
   4) Thread[id=11254, name=apacheds, state=WAITING, group=TGRP-SaslZkACLProviderTest]
        at java.lang.Object.wait(Native Method)
        at java.lang.Object.wait(Object.java:502)
        at java.util.TimerThread.mainLoop(Timer.java:526)
        at java.util.TimerThread.run(Timer.java:505)
   5) Thread[id=11258, name=ou=system.data, state=TIMED_WAITING, group=TGRP-SaslZkACLProviderTest]
        at sun.misc.Unsafe.park(Native Method)
        at java.util.concurrent.locks.LockSupport.parkNanos(LockSupport.java:215)
        at java.util.concurrent.locks.AbstractQueuedSynchronizer$ConditionObject.awaitNanos(AbstractQueuedSynchronizer.java:2078)
        at java.util.concurrent.ScheduledThreadPoolExecutor$DelayedWorkQueue.take(ScheduledThreadPoolExecutor.java:1093)
        at java.util.concurrent.ScheduledThreadPoolExecutor$DelayedWorkQueue.take(ScheduledThreadPoolExecutor.java:809)
        at java.util.concurrent.ThreadPoolExecutor.getTask(ThreadPoolExecutor.java:1067)
        at java.util.concurrent.ThreadPoolExecutor.runWorker(ThreadPoolExecutor.java:1127)
        at java.util.concurrent.ThreadPoolExecutor$Worker.run(ThreadPoolExecutor.java:617)
        at java.lang.Thread.run(Thread.java:745)
   6) Thread[id=11259, name=NioSocketAcceptor-1, state=RUNNABLE, group=TGRP-SaslZkACLProviderTest]
        at sun.nio.ch.WindowsSelectorImpl.setWakeupSocket0(Native Method)
        at sun.nio.ch.WindowsSelectorImpl.setWakeupSocket(WindowsSelectorImpl.java:464)
        at sun.nio.ch.WindowsSelectorImpl.wakeup(WindowsSelectorImpl.java:606)
        at java.nio.channels.spi.AbstractSelector$1.interrupt(AbstractSelector.java:213)
        at java.nio.channels.spi.AbstractSelector.begin(AbstractSelector.java:219)
        at sun.nio.ch.WindowsSelectorImpl.doSelect(WindowsSelectorImpl.java:157)
        at sun.nio.ch.SelectorImpl.lockAndDoSelect(SelectorImpl.java:86)
        at sun.nio.ch.SelectorImpl.select(SelectorImpl.java:97)
        at sun.nio.ch.SelectorImpl.select(SelectorImpl.java:101)
        at org.apache.mina.transport.socket.nio.NioSocketAcceptor.select(NioSocketAcceptor.java:234)
        at org.apache.mina.core.polling.AbstractPollingIoAcceptor$Acceptor.run(AbstractPollingIoAcceptor.java:417)
        at org.apache.mina.util.NamePreservingRunnable.run(NamePreservingRunnable.java:64)
        at java.util.concurrent.ThreadPoolExecutor.runWorker(ThreadPoolExecutor.java:1142)
        at java.util.concurrent.ThreadPoolExecutor$Worker.run(ThreadPoolExecutor.java:617)
        at java.lang.Thread.run(Thread.java:745)
	at __randomizedtesting.SeedInfo.seed([894D2A924BC1EC56]:0)




Build Log:
[...truncated 10559 lines...]
   [junit4] Suite: org.apache.solr.cloud.SaslZkACLProviderTest
   [junit4]   2> Creating dataDir: C:\Users\JenkinsSlave\workspace\Lucene-Solr-trunk-Windows\solr\build\solr-core\test\J1\temp\solr.cloud.SaslZkACLProviderTest 894D2A924BC1EC56-001\init-core-data-001
   [junit4]   2> 1910580 T11252 oas.SolrTestCaseJ4.buildSSLConfig Randomized ssl (true) and clientAuth (false)
   [junit4]   2> 1910584 T11252 oas.SolrTestCaseJ4.setUp ###Starting testSaslZkACLProvider
   [junit4]   2> 1910585 T11252 oasc.SaslZkACLProviderTest.setUp ####SETUP_START testSaslZkACLProvider
   [junit4]   2> 1910587 T11252 oasc.SaslZkACLProviderTest.setUp ZooKeeper dataDir:C:\Users\JenkinsSlave\workspace\Lucene-Solr-trunk-Windows\solr\build\solr-core\test\J1\temp\solr.cloud.SaslZkACLProviderTest 894D2A924BC1EC56-001\tempDir-002\zookeeper/server1/data
   [junit4]   2> 1920120 T11252 oadsc.DefaultDirectoryService.showSecurityWarnings WARN You didn't change the admin password of directory service instance 'DefaultKrbServer'.  Please update the admin password as soon as possible to prevent a possible security breach.
   [junit4]   2> 1920803 T11252 oasc.ZkTestServer.run STARTING ZK TEST SERVER
   [junit4]   2> 1920803 T11260 oasc.ZkTestServer$2$1.setClientPort client port:0.0.0.0/0.0.0.0:0
   [junit4]   2> 1920803 T11260 oasc.ZkTestServer$ZKServerMain.runFromConfig Starting server
   [junit4]   2> 1921287 T11261 oadskka.AuthenticationService.generateTicket ERROR Ticket cannot be generated, as the endTime is below the startTime
   [junit4]   2> 1921288 T11261 oadskp.KerberosProtocolHandler.messageReceived WARN Requested start time is later than end time (11)
   [junit4]   2> 1921288 T11261 oadskp.KerberosProtocolHandler.messageReceived WARN Requested start time is later than end time (11)
   [junit4]   2> 10753 T11260 ccr.RandomizedRunner$QueueUncaughtExceptionsHandler.uncaughtException WARNING Uncaught exception in thread: Thread[Thread-3649,5,TGRP-SaslZkACLProviderTest] java.lang.RuntimeException: java.io.IOException: Could not configure server because SASL configuration did not allow the  ZooKeeper server to authenticate itself properly: javax.security.auth.login.LoginException: Requested start time is later than end time (11) - Requested start time is later than end time
   [junit4]   2> 	at __randomizedtesting.SeedInfo.seed([894D2A924BC1EC56]:0)
   [junit4]   2> 	at org.apache.solr.cloud.ZkTestServer$2.run(ZkTestServer.java:483)
   [junit4]   2> Caused by: java.io.IOException: Could not configure server because SASL configuration did not allow the  ZooKeeper server to authenticate itself properly: javax.security.auth.login.LoginException: Requested start time is later than end time (11) - Requested start time is later than end time
   [junit4]   2> 	at org.apache.zookeeper.server.ServerCnxnFactory.configureSaslLogin(ServerCnxnFactory.java:207)
   [junit4]   2> 	at org.apache.zookeeper.server.NIOServerCnxnFactory.configure(NIOServerCnxnFactory.java:87)
   [junit4]   2> 	at org.apache.solr.cloud.ZkTestServer$ZKServerMain.runFromConfig(ZkTestServer.java:305)
   [junit4]   2> 	at org.apache.solr.cloud.ZkTestServer$2.run(ZkTestServer.java:481)
   [junit4]   2> 
   [junit4]   2> NOTE: reproduce with: ant test  -Dtestcase=SaslZkACLProviderTest -Dtests.method=testSaslZkACLProvider -Dtests.seed=894D2A924BC1EC56 -Dtests.slow=true -Dtests.locale=th_TH -Dtests.timezone=Asia/Thimphu -Dtests.asserts=true -Dtests.file.encoding=UTF-8
   [junit4] ERROR   60.3s J1 | SaslZkACLProviderTest.testSaslZkACLProvider <<<
   [junit4]    > Throwable #1: java.lang.RuntimeException: Could not get the port for ZooKeeper server
   [junit4]    > 	at org.apache.solr.cloud.ZkTestServer.run(ZkTestServer.java:506)
   [junit4]    > 	at org.apache.solr.cloud.SaslZkACLProviderTest$SaslZkTestServer.run(SaslZkACLProviderTest.java:226)
   [junit4]    > 	at org.apache.solr.cloud.SaslZkACLProviderTest.setUp(SaslZkACLProviderTest.java:91)
   [junit4]    > 	at java.lang.Thread.run(Thread.java:745)Throwable #2: java.lang.NullPointerException
   [junit4]    > 	at org.apache.zookeeper.server.NIOServerCnxnFactory.getLocalPort(NIOServerCnxnFactory.java:134)
   [junit4]    > 	at org.apache.solr.cloud.ZkTestServer$ZKServerMain.shutdown(ZkTestServer.java:334)
   [junit4]    > 	at org.apache.solr.cloud.ZkTestServer.shutdown(ZkTestServer.java:516)
   [junit4]    > 	at org.apache.solr.cloud.SaslZkACLProviderTest$SaslZkTestServer.shutdown(SaslZkACLProviderTest.java:231)
   [junit4]    > 	at org.apache.solr.cloud.SaslZkACLProviderTest.tearDown(SaslZkACLProviderTest.java:126)
   [junit4]    > 	at java.lang.Thread.run(Thread.java:745)Throwable #3: com.carrotsearch.randomizedtesting.UncaughtExceptionError: Captured an uncaught exception in thread: Thread[id=11260, name=Thread-3649, state=RUNNABLE, group=TGRP-SaslZkACLProviderTest]
   [junit4]    > Caused by: java.lang.RuntimeException: java.io.IOException: Could not configure server because SASL configuration did not allow the  ZooKeeper server to authenticate itself properly: javax.security.auth.login.LoginException: Requested start time is later than end time (11) - Requested start time is later than end time
   [junit4]    > 	at __randomizedtesting.SeedInfo.seed([894D2A924BC1EC56]:0)
   [junit4]    > 	at org.apache.solr.cloud.ZkTestServer$2.run(ZkTestServer.java:483)
   [junit4]    > Caused by: java.io.IOException: Could not configure server because SASL configuration did not allow the  ZooKeeper server to authenticate itself properly: javax.security.auth.login.LoginException: Requested start time is later than end time (11) - Requested start time is later than end time
   [junit4]    > 	at org.apache.zookeeper.server.ServerCnxnFactory.configureSaslLogin(ServerCnxnFactory.java:207)
   [junit4]    > 	at org.apache.zookeeper.server.NIOServerCnxnFactory.configure(NIOServerCnxnFactory.java:87)
   [junit4]    > 	at org.apache.solr.cloud.ZkTestServer$ZKServerMain.runFromConfig(ZkTestServer.java:305)
   [junit4]    > 	at org.apache.solr.cloud.ZkTestServer$2.run(ZkTestServer.java:481)
   [junit4]   2> 1970883 T11252 oas.SolrTestCaseJ4.deleteCore ###deleteCore
   [junit4]   2> NOTE: leaving temporary files on disk at: C:\Users\JenkinsSlave\workspace\Lucene-Solr-trunk-Windows\solr\build\solr-core\test\J1\temp\solr.cloud.SaslZkACLProviderTest 894D2A924BC1EC56-001
   [junit4]   2> 60317 T11251 ccr.ThreadLeakControl.checkThreadLeaks WARNING Will linger awaiting termination of 7 leaked thread(s).
   [junit4]   2> 80551 T11251 ccr.ThreadLeakControl.checkThreadLeaks SEVERE 6 threads leaked from SUITE scope at org.apache.solr.cloud.SaslZkACLProviderTest: 
   [junit4]   2> 	   1) Thread[id=11256, name=groupCache.data, state=TIMED_WAITING, group=TGRP-SaslZkACLProviderTest]
   [junit4]   2> 	        at sun.misc.Unsafe.park(Native Method)
   [junit4]   2> 	        at java.util.concurrent.locks.LockSupport.parkNanos(LockSupport.java:215)
   [junit4]   2> 	        at java.util.concurrent.locks.AbstractQueuedSynchronizer$ConditionObject.awaitNanos(AbstractQueuedSynchronizer.java:2078)
   [junit4]   2> 	        at java.util.concurrent.ScheduledThreadPoolExecutor$DelayedWorkQueue.take(ScheduledThreadPoolExecutor.java:1093)
   [junit4]   2> 	        at java.util.concurrent.ScheduledThreadPoolExecutor$DelayedWorkQueue.take(ScheduledThreadPoolExecutor.java:809)
   [junit4]   2> 	        at java.util.concurrent.ThreadPoolExecutor.getTask(ThreadPoolExecutor.java:1067)
   [junit4]   2> 	        at java.util.concurrent.ThreadPoolExecutor.runWorker(ThreadPoolExecutor.java:1127)
   [junit4]   2> 	        at java.util.concurrent.ThreadPoolExecutor$Worker.run(ThreadPoolExecutor.java:617)
   [junit4]   2> 	        at java.lang.Thread.run(Thread.java:745)
   [junit4]   2> 	   2) Thread[id=11255, name=kdcReplayCache.data, state=TIMED_WAITING, group=TGRP-SaslZkACLProviderTest]
   [junit4]   2> 	        at sun.misc.Unsafe.park(Native Method)
   [junit4]   2> 	        at java.util.concurrent.locks.LockSupport.parkNanos(LockSupport.java:215)
   [junit4]   2> 	        at java.util.concurrent.locks.AbstractQueuedSynchronizer$ConditionObject.awaitNanos(AbstractQueuedSynchronizer.java:2078)
   [junit4]   2> 	        at java.util.concurrent.ScheduledThreadPoolExecutor$DelayedWorkQueue.take(ScheduledThreadPoolExecutor.java:1093)
   [junit4]   2> 	        at java.util.concurrent.ScheduledThreadPoolExecutor$DelayedWorkQueue.take(ScheduledThreadPoolExecutor.java:809)
   [junit4]   2> 	        at java.util.concurrent.ThreadPoolExecutor.getTask(ThreadPoolExecutor.java:1067)
   [junit4]   2> 	        at java.util.concurrent.ThreadPoolExecutor.runWorker(ThreadPoolExecutor.java:1127)
   [junit4]   2> 	        at java.util.concurrent.ThreadPoolExecutor$Worker.run(ThreadPoolExecutor.java:617)
   [junit4]   2> 	        at java.lang.Thread.run(Thread.java:745)
   [junit4]   2> 	   3) Thread[id=11257, name=changePwdReplayCache.data, state=TIMED_WAITING, group=TGRP-SaslZkACLProviderTest]
   [junit4]   2> 	        at sun.misc.Unsafe.park(Native Method)
   [junit4]   2> 	        at java.util.concurrent.locks.LockSupport.parkNanos(LockSupport.java:215)
   [junit4]   2> 	        at java.util.concurrent.locks.AbstractQueuedSynchronizer$ConditionObject.awaitNanos(AbstractQueuedSynchronizer.java:2078)
   [junit4]   2> 	        at java.util.concurrent.ScheduledThreadPoolExecutor$DelayedWorkQueue.take(ScheduledThreadPoolExecutor.java:1093)
   [junit4]   2> 	        at java.util.concurrent.ScheduledThreadPoolExecutor$DelayedWorkQueue.take(ScheduledThreadPoolExecutor.java:809)
   [junit4]   2> 	        at java.util.concurrent.ThreadPoolExecutor.getTask(ThreadPoolExecutor.java:1067)
   [junit4]   2> 	        at java.util.concurrent.ThreadPoolExecutor.runWorker(ThreadPoolExecutor.java:1127)
   [junit4]   2> 	        at java.util.concurrent.ThreadPoolExecutor$Worker.run(ThreadPoolExecutor.java:617)
   [junit4]   2> 	        at java.lang.Thread.run(Thread.java:745)
   [junit4]   2> 	   4) Thread[id=11254, name=apacheds, state=WAITING, group=TGRP-SaslZkACLProviderTest]
   [junit4]   2> 	        at java.lang.Object.wait(Native Method)
   [junit4]   2> 	        at java.lang.Object.wait(Object.java:502)
   [junit4]   2> 	        at java.util.TimerThread.mainLoop(Timer.java:526)
   [junit4]   2> 	        at java.util.TimerThread.run(Timer.java:505)
   [junit4]   2> 	   5) Thread[id=11258, name=ou=system.data, state=TIMED_WAITING, group=TGRP-SaslZkACLProviderTest]
   [junit4]   2> 	        at sun.misc.Unsafe.park(Native Method)
   [junit4]   2> 	        at java.util.concurrent.locks.LockSupport.parkNanos(LockSupport.java:215)
   [junit4]   2> 	        at java.util.concurrent.locks.AbstractQueuedSynchronizer$ConditionObject.awaitNanos(AbstractQueuedSynchronizer.java:2078)
   [junit4]   2> 	        at java.util.concurrent.ScheduledThreadPoolExecutor$DelayedWorkQueue.take(ScheduledThreadPoolExecutor.java:1093)
   [junit4]   2> 	        at java.util.concurrent.ScheduledThreadPoolExecutor$DelayedWorkQueue.take(ScheduledThreadPoolExecutor.java:809)
   [junit4]   2> 	        at java.util.concurrent.ThreadPoolExecutor.getTask(ThreadPoolExecutor.java:1067)
   [junit4]   2> 	        at java.util.concurrent.ThreadPoolExecutor.runWorker(ThreadPoolExecutor.java:1127)
   [junit4]   2> 	        at java.util.concurrent.ThreadPoolExecutor$Worker.run(ThreadPoolExecutor.java:617)
   [junit4]   2> 	        at java.lang.Thread.run(Thread.java:745)
   [junit4]   2> 	   6) Thread[id=11259, name=NioSocketAcceptor-1, state=RUNNABLE, group=TGRP-SaslZkACLProviderTest]
   [junit4]   2> 	        at sun.nio.ch.WindowsSelectorImpl$SubSelector.poll0(Native Method)
   [junit4]   2> 	        at sun.nio.ch.WindowsSelectorImpl$SubSelector.poll(WindowsSelectorImpl.java:296)
   [junit4]   2> 	        at sun.nio.ch.WindowsSelectorImpl$SubSelector.access$400(WindowsSelectorImpl.java:278)
   [junit4]   2> 	        at sun.nio.ch.WindowsSelectorImpl.doSelect(WindowsSelectorImpl.java:159)
   [junit4]   2> 	        at sun.nio.ch.SelectorImpl.lockAndDoSelect(SelectorImpl.java:86)
   [junit4]   2> 	        at sun.nio.ch.SelectorImpl.select(SelectorImpl.java:97)
   [junit4]   2> 	        at sun.nio.ch.SelectorImpl.select(SelectorImpl.java:101)
   [junit4]   2> 	        at org.apache.mina.transport.socket.nio.NioSocketAcceptor.select(NioSocketAcceptor.java:234)
   [junit4]   2> 	        at org.apache.mina.core.polling.AbstractPollingIoAcceptor$Acceptor.run(AbstractPollingIoAcceptor.java:417)
   [junit4]   2> 	        at org.apache.mina.util.NamePreservingRunnable.run(NamePreservingRunnable.java:64)
   [junit4]   2> 	        at java.util.concurrent.ThreadPoolExecutor.runWorker(ThreadPoolExecutor.java:1142)
   [junit4]   2> 	        at java.util.concurrent.ThreadPoolExecutor$Worker.run(ThreadPoolExecutor.java:617)
   [junit4]   2> 	        at java.lang.Thread.run(Thread.java:745)
   [junit4]   2> 80552 T11251 ccr.ThreadLeakControl.tryToInterruptAll Starting to interrupt leaked threads:
   [junit4]   2> 	   1) Thread[id=11256, name=groupCache.data, state=TIMED_WAITING, group=TGRP-SaslZkACLProviderTest]
   [junit4]   2> 	   2) Thread[id=11255, name=kdcReplayCache.data, state=TIMED_WAITING, group=TGRP-SaslZkACLProviderTest]
   [junit4]   2> 	   3) Thread[id=11257, name=changePwdReplayCache.data, state=TIMED_WAITING, group=TGRP-SaslZkACLProviderTest]
   [junit4]   2> 	   4) Thread[id=11254, name=apacheds, state=WAITING, group=TGRP-SaslZkACLProviderTest]
   [junit4]   2> 	   5) Thread[id=11258, name=ou=system.data, state=TIMED_WAITING, group=TGRP-SaslZkACLProviderTest]
   [junit4]   2> 	   6) Thread[id=11259, name=NioSocketAcceptor-1, state=RUNNABLE, group=TGRP-SaslZkACLProviderTest]
   [junit4]   2> 83609 T11251 ccr.ThreadLeakControl.tryToInterruptAll SEVERE There are still zombie threads that couldn't be terminated:
   [junit4]   2> 	   1) Thread[id=11256, name=groupCache.data, state=TIMED_WAITING, group=TGRP-SaslZkACLProviderTest]
   [junit4]   2> 	        at sun.misc.Unsafe.park(Native Method)
   [junit4]   2> 	        at java.util.concurrent.locks.LockSupport.parkNanos(LockSupport.java:215)
   [junit4]   2> 	        at java.util.concurrent.locks.AbstractQueuedSynchronizer$ConditionObject.awaitNanos(AbstractQueuedSynchronizer.java:2078)
   [junit4]   2> 	        at java.util.concurrent.ScheduledThreadPoolExecutor$DelayedWorkQueue.take(ScheduledThreadPoolExecutor.java:1093)
   [junit4]   2> 	        at java.util.concurrent.ScheduledThreadPoolExecutor$DelayedWorkQueue.take(ScheduledThreadPoolExecutor.java:809)
   [junit4]   2> 	        at java.util.concurrent.ThreadPoolExecutor.getTask(ThreadPoolExecutor.java:1067)
   [junit4]   2> 	        at java.util.concurrent.ThreadPoolExecutor.runWorker(ThreadPoolExecutor.java:1127)
   [junit4]   2> 	        at java.util.concurrent.ThreadPoolExecutor$Worker.run(ThreadPoolExecutor.java:617)
   [junit4]   2> 	        at java.lang.Thread.run(Thread.java:745)
   [junit4]   2> 	   2) Thread[id=11255, name=kdcReplayCache.data, state=TIMED_WAITING, group=TGRP-SaslZkACLProviderTest]
   [junit4]   2> 	        at sun.misc.Unsafe.park(Native Method)
   [junit4]   2> 	        at java.util.concurrent.locks.LockSupport.parkNanos(LockSupport.java:215)
   [junit4]   2> 	        at java.util.concurrent.locks.AbstractQueuedSynchronizer$ConditionObject.awaitNanos(AbstractQueuedSynchronizer.java:2078)
   [junit4]   2> 	        at java.util.concurrent.ScheduledThreadPoolExecutor$DelayedWorkQueue.take(ScheduledThreadPoolExecutor.java:1093)
   [junit4]   2> 	        at java.util.concurrent.ScheduledThreadPoolExecutor$DelayedWorkQueue.take(ScheduledThreadPoolExecutor.java:809)
   [junit4]   2> 	        at java.util.concurrent.ThreadPoolExecutor.getTask(ThreadPoolExecutor.java:1067)
   [junit4]   2> 	        at java.util.concurrent.ThreadPoolExecutor.runWorker(ThreadPoolExecutor.java:1127)
   [junit4]   2> 	        at java.util.concurrent.ThreadPoolExecutor$Worker.run(ThreadPoolExecutor.java:617)
   [junit4]   2> 	        at java.lang.Thread.run(Thread.java:745)
   [junit4]   2> 	   3) Thread[id=11257, name=changePwdReplayCache.data, state=TIMED_WAITING, group=TGRP-SaslZkACLProviderTest]
   [junit4]   2> 	        at sun.misc.Unsafe.park(Native Method)
   [junit4]   2> 	        at java.util.concurrent.locks.LockSupport.parkNanos(LockSupport.java:215)
   [junit4]   2> 	        at java.util.concurrent.locks.AbstractQueuedSynchronizer$ConditionObject.awaitNanos(AbstractQueuedSynchronizer.java:2078)
   [junit4]   2> 	        at java.util.concurrent.ScheduledThreadPoolExecutor$DelayedWorkQueue.take(ScheduledThreadPoolExecutor.java:1093)
   [junit4]   2> 	        at java.util.concurrent.ScheduledThreadPoolExecutor$DelayedWorkQueue.take(ScheduledThreadPoolExecutor.java:809)
   [junit4]   2> 	        at java.util.concurrent.ThreadPoolExecutor.getTask(ThreadPoolExecutor.java:1067)
   [junit4]   2> 	        at java.util.concurrent.ThreadPoolExecutor.runWorker(ThreadPoolExecutor.java:1127)
   [junit4]   2> 	        at java.util.concurrent.ThreadPoolExecutor$Worker.run(ThreadPoolExecutor.java:617)
   [junit4]   2> 	        at java.lang.Thread.run(Thread.java:745)
   [junit4]   2> 	   4) Thread[id=11254, name=apacheds, state=WAITING, group=TGRP-SaslZkACLProviderTest]
   [junit4]   2> 	        at java.lang.Object.wait(Native Method)
   [junit4]   2> 	        at java.lang.Object.wait(Object.java:502)
   [junit4]   2> 	        at java.util.TimerThread.mainLoop(Timer.java:526)
   [junit4]   2> 	        at java.util.TimerThread.run(Timer.java:505)
   [junit4]   2> 	   5) Thread[id=11258, name=ou=system.data, state=TIMED_WAITING, group=TGRP-SaslZkACLProviderTest]
   [junit4]   2> 	        at sun.misc.Unsafe.park(Native Method)
   [junit4]   2> 	        at java.util.concurrent.locks.LockSupport.parkNanos(LockSupport.java:215)
   [junit4]   2> 	        at java.util.concurrent.locks.AbstractQueuedSynchronizer$ConditionObject.awaitNanos(AbstractQueuedSynchronizer.java:2078)
   [junit4]   2> 	        at java.util.concurrent.ScheduledThreadPoolExecutor$DelayedWorkQueue.take(ScheduledThreadPoolExecutor.java:1093)
   [junit4]   2> 	        at java.util.concurrent.ScheduledThreadPoolExecutor$DelayedWorkQueue.take(ScheduledThreadPoolExecutor.java:809)
   [junit4]   2> 	        at java.util.concurrent.ThreadPoolExecutor.getTask(ThreadPoolExecutor.java:1067)
   [junit4]   2> 	        at java.util.concurrent.ThreadPoolExecutor.runWorker(ThreadPoolExecutor.java:1127)
   [junit4]   2> 	        at java.util.concurrent.ThreadPoolExecutor$Worker.run(ThreadPoolExecutor.java:617)
   [junit4]   2> 	        at java.lang.Thread.run(Thread.java:745)
   [junit4]   2> 	   6) Thread[id=11259, name=NioSocketAcceptor-1, state=RUNNABLE, group=TGRP-SaslZkACLProviderTest]
   [junit4]   2> 	        at sun.nio.ch.WindowsSelectorImpl.setWakeupSocket0(Native Method)
   [junit4]   2> 	        at sun.nio.ch.WindowsSelectorImpl.setWakeupSocket(WindowsSelectorImpl.java:464)
   [junit4]   2> 	        at sun.nio.ch.WindowsSelectorImpl.wakeup(WindowsSelectorImpl.java:606)
   [junit4]   2> 	        at java.nio.channels.spi.AbstractSelector$1.interrupt(AbstractSelector.java:213)
   [junit4]   2> 	        at java.nio.channels.spi.AbstractSelector.begin(AbstractSelector.java:219)
   [junit4]   2> 	        at sun.nio.ch.WindowsSelectorImpl.doSelect(WindowsSelectorImpl.java:157)
   [junit4]   2> 	        at sun.nio.ch.SelectorImpl.lockAndDoSelect(SelectorImpl.java:86)
   [junit4]   2> 	        at sun.nio.ch.SelectorImpl.select(SelectorImpl.java:97)
   [junit4]   2> 	        at sun.nio.ch.SelectorImpl.select(SelectorImpl.java:101)
   [junit4]   2> 	        at org.apache.mina.transport.socket.nio.NioSocketAcceptor.select(NioSocketAcceptor.java:234)
   [junit4]   2> 	        at org.apache.mina.core.polling.AbstractPollingIoAcceptor$Acceptor.run(AbstractPollingIoAcceptor.java:417)
   [junit4]   2> 	        at org.apache.mina.util.NamePreservingRunnable.run(NamePreservingRunnable.java:64)
   [junit4]   2> 	        at java.util.concurrent.ThreadPoolExecutor.runWorker(ThreadPoolExecutor.java:1142)
   [junit4]   2> 	        at java.util.concurrent.ThreadPoolExecutor$Worker.run(ThreadPoolExecutor.java:617)
   [junit4]   2> 	        at java.lang.Thread.run(Thread.java:745)
   [junit4]   2> NOTE: test params are: codec=Asserting(Lucene50): {}, docValues:{}, sim=DefaultSimilarity, locale=th_TH, timezone=Asia/Thimphu
   [junit4]   2> NOTE: Windows 7 6.1 amd64/Oracle Corporation 1.8.0_40 (64-bit)/cpus=3,threads=7,free=88202056,total=251588608
   [junit4]   2> NOTE: All tests run in this JVM: [TestSolrDeletionPolicy1, StatsComponentTest, ZkNodePropsTest, TestConfig, TestSolrQueryParser, TestLuceneMatchVersion, TestSolrJ, CurrencyFieldOpenExchangeTest, SolrTestCaseJ4Test, FacetPivotSmallTest, TestStandardQParsers, IndexBasedSpellCheckerTest, UpdateRequestProcessorFactoryTest, TestMiniSolrCloudClusterSSL, SolrIndexConfigTest, TestSearchPerf, CustomCollectionTest, TestJsonFacets, TestTolerantSearch, TestDefaultSimilarityFactory, TestPseudoReturnFields, TestInitParams, OutOfBoxZkACLAndCredentialsProvidersTest, TestSchemaVersionResource, TestRecovery, TestLMDirichletSimilarityFactory, AutoCommitTest, TestQuerySenderListener, TestZkChroot, TestCloudManagedSchemaConcurrent, TestObjectReleaseTracker, SolrCmdDistributorTest, MinimalSchemaTest, RecoveryAfterSoftCommitTest, DocumentBuilderTest, DeleteInactiveReplicaTest, TestCollapseQParserPlugin, TestLMJelinekMercerSimilarityFactory, TestCoreDiscovery, SimplePostToolTest, MoreLikeThisHandlerTest, TestBadConfig, DateMathParserTest, StandardRequestHandlerTest, BasicDistributedZk2Test, TestSystemIdResolver, TestChildDocTransformer, ShardRoutingCustomTest, ExitableDirectoryReaderTest, ResponseHeaderTest, DistribJoinFromCollectionTest, SearchHandlerTest, FastVectorHighlighterTest, TestReversedWildcardFilterFactory, PolyFieldTest, HdfsSyncSliceTest, ParsingFieldUpdateProcessorsTest, TestQuerySenderNoQuery, DistributedTermsComponentTest, TestAnalyzeInfixSuggestions, TestRandomMergePolicy, TestDefaultStatsCache, DateRangeFieldTest, HdfsChaosMonkeySafeLeaderTest, HdfsBasicDistributedZkTest, BadIndexSchemaTest, TestSimpleTrackingShardHandler, TestUniqueKeyFieldResource, TestCloudSchemaless, NotRequiredUniqueKeyTest, UpdateParamsTest, TestConfigReload, SchemaVersionSpecificBehaviorTest, TestSchemaResource, SimpleMLTQParserTest, BasicZkTest, TestDistributedGrouping, CloudMLTQParserTest, AliasIntegrationTest, SuggesterTSTTest, TestDynamicLoading, MBeansHandlerTest, TestRemoteStreaming, HdfsWriteToMultipleCollectionsTest, TestClusterStateMutator, LoggingHandlerTest, TestLeaderElectionZkExpiry, DistribCursorPagingTest, CSVRequestHandlerTest, DistributedQueryComponentCustomSortTest, LeaderInitiatedRecoveryOnCommitTest, TestInfoStreamLogging, TermsComponentTest, TestCollectionAPI, TestSuggestSpellingConverter, TermVectorComponentTest, ShardSplitTest, CopyFieldTest, TestDocSet, TestMergePolicyConfig, TestHighlightDedupGrouping, BinaryUpdateRequestHandlerTest, SolrRequestParserTest, DirectUpdateHandlerOptimizeTest, ReturnFieldsTest, TestSolrDeletionPolicy2, InfoHandlerTest, ZkSolrClientTest, TestManagedSchemaFieldTypeResource, DistributedFacetPivotSmallAdvancedTest, TestNonDefinedSimilarityFactory, AnalyticsQueryTest, TestRealTimeGet, DistributedFacetPivotLongTailTest, TestPHPSerializedResponseWriter, TestRestManager, TestSolrQueryParserResource, AnalyticsMergeStrategyTest, TestExactStatsCache, LeaderElectionIntegrationTest, TestReplicationHandler, TestFaceting, TermVectorComponentDistributedTest, TestStressReorder, TestJoin, TestReload, TestRangeQuery, TestCoreContainer, SimpleFacetsTest, TestSolr4Spatial, SolrCoreTest, SpellCheckComponentTest, TestGroupingSearch, PeerSyncTest, ConvertedLegacyTest, TestFiltering, TestFunctionQuery, BasicFunctionalityTest, DirectUpdateHandlerTest, OverseerCollectionProcessorTest, TestIndexSearcher, HighlighterTest, CurrencyFieldXmlFileTest, AnalysisAfterCoreReloadTest, SignatureUpdateProcessorFactoryTest, SpellCheckCollatorTest, CoreAdminHandlerTest, TestFoldingMultitermQuery, SuggesterTest, TestStressLucene, TestTrie, SpatialFilterTest, SuggesterWFSTTest, NoCacheHeaderTest, WordBreakSolrSpellCheckerTest, TestUpdate, FieldMutatingUpdateProcessorTest, QueryEqualityTest, DefaultValueUpdateProcessorTest, StatelessScriptUpdateProcessorFactoryTest, DocValuesMultiTest, DistanceFunctionTest, XsltUpdateRequestHandlerTest, DebugComponentTest, LukeRequestHandlerTest, DisMaxRequestHandlerTest, DirectSolrSpellCheckerTest, DocumentAnalysisRequestHandlerTest, PrimitiveFieldTypeTest, FileBasedSpellCheckerTest, RequestHandlersTest, TestValueSourceCache, RequiredFieldsTest, RegexBoostProcessorTest, SolrPluginUtilsTest, IndexSchemaTest, TestJmxIntegration, TestCollationField, QueryParsingTest, JsonLoaderTest, TestBinaryResponseWriter, HighlighterConfigTest, SOLR749Test, TestSolrIndexConfig, ResponseLogComponentTest, MultiTermTest, TestBinaryField, OutputWriterTest, TestSolrCoreProperties, TestCharFilters, EchoParamsTest, TestDFRSimilarityFactory, TestBM25SimilarityFactory, TestJmxMonitoredMap, TestFastOutputStream, URLClassifyProcessorTest, CursorPagingTest, CloudExitableDirectoryReaderTest, CollectionReloadTest, DeleteShardTest, DistributedQueueTest, HttpPartitionTest, RemoteQueryErrorTest, SSLMigrationTest, SaslZkACLProviderTest]
   [junit4]   2> NOTE: reproduce with: ant test  -Dtestcase=SaslZkACLProviderTest -Dtests.seed=894D2A924BC1EC56 -Dtests.slow=true -Dtests.locale=th_TH -Dtests.timezone=Asia/Thimphu -Dtests.asserts=true -Dtests.file.encoding=UTF-8
   [junit4] ERROR   0.00s J1 | SaslZkACLProviderTest (suite) <<<
   [junit4]    > Throwable #1: com.carrotsearch.randomizedtesting.ThreadLeakError: 6 threads leaked from SUITE scope at org.apache.solr.cloud.SaslZkACLProviderTest: 
   [junit4]    >    1) Thread[id=11256, name=groupCache.data, state=TIMED_WAITING, group=TGRP-SaslZkACLProviderTest]
   [junit4]    >         at sun.misc.Unsafe.park(Native Method)
   [junit4]    >         at java.util.concurrent.locks.LockSupport.parkNanos(LockSupport.java:215)
   [junit4]    >         at java.util.concurrent.locks.AbstractQueuedSynchronizer$ConditionObject.awaitNanos(AbstractQueuedSynchronizer.java:2078)
   [junit4]    >         at java.util.concurrent.ScheduledThreadPoolExecutor$DelayedWorkQueue.take(ScheduledThreadPoolExecutor.java:1093)
   [junit4]    >         at java.util.concurrent.ScheduledThreadPoolExecutor$DelayedWorkQueue.take(ScheduledThreadPoolExecutor.java:809)
   [junit4]    >         at java.util.concurrent.ThreadPoolExecutor.getTask(ThreadPoolExecutor.java:1067)
   [junit4]    >         at java.util.concurrent.ThreadPoolExecutor.runWorker(ThreadPoolExecutor.java:1127)
   [junit4]    >         at java.util.concurrent.ThreadPoolExecutor$Worker.run(ThreadPoolExecutor.java:617)
   [junit4]    >         at java.lang.Thread.run(Thread.java:745)
   [junit4]    >    2) Thread[id=11255, name=kdcReplayCache.data, state=TIMED_WAITING, group=TGRP-SaslZkACLProviderTest]
   [junit4]    >         at sun.misc.Unsafe.park(Native Method)
   [junit4]    >         at java.util.concurrent.locks.LockSupport.parkNanos(LockSupport.java:215)
   [junit4]    >         at java.util.concurrent.locks.AbstractQueuedSynchronizer$ConditionObject.awaitNanos(AbstractQueuedSynchronizer.java:2078)
   [junit4]    >         at java.util.concurrent.ScheduledThreadPoolExecutor$DelayedWorkQueue.take(ScheduledThreadPoolExecutor.java:1093)
   [junit4]    >         at java.util.concurrent.ScheduledThreadPoolExecutor$DelayedWorkQueue.take(ScheduledThreadPoolExecutor.java:809)
   [junit4]    >         at java.util.concurrent.ThreadPoolExecutor.getTask(ThreadPoolExecutor.java:1067)
   [junit4]    >         at java.util.concurrent.ThreadPoolExecutor.runWorker(ThreadPoolExecutor.java:1127)
   [junit4]    >         at java.util.concurrent.ThreadPoolExecutor$Worker.run(ThreadPoolExecutor.java:617)
   [junit4]    >         at java.lang.Thread.run(Thread.java:745)
   [junit4]    >    3) Thread[id=11257, name=changePwdReplayCache.data, state=TIMED_WAITING, group=TGRP-SaslZkACLProviderTest]
   [junit4]    >         at sun.misc.Unsafe.park(Native Method)
   [junit4]    >         at java.util.concurrent.locks.LockSupport.parkNanos(LockSupport.java:215)
   [junit4]    >         at java.util.concurrent.locks.AbstractQueuedSynchronizer$ConditionObject.awaitNanos(AbstractQueuedSynchronizer.java:2078)
   [junit4]    >         at java.util.concurrent.ScheduledThreadPoolExecutor$DelayedWorkQueue.take(ScheduledThreadPoolExecutor.java:1093)
   [junit4]    >         at java.util.concurrent.ScheduledThreadPoolExecutor$DelayedWorkQueue.take(ScheduledThreadPoolExecutor.java:809)
   [junit4]    >         at java.util.concurrent.ThreadPoolExecutor.getTask(ThreadPoolExecutor.java:1067)
   [junit4]    >         at java.util.concurrent.ThreadPoolExecutor.runWorker(ThreadPoolExecutor.java:1127)
   [junit4]    >         at java.util.concurrent.ThreadPoolExecutor$Worker.run(ThreadPoolExecutor.java:617)
   [junit4]    >         at java.lang.Thread.run(Thread.java:745)
   [junit4]    >    4) Thread[id=11254, name=apacheds, state=WAITING, group=TGRP-SaslZkACLProviderTest]
   [junit4]    >         at java.lang.Object.wait(Native Method)
   [junit4]    >         at java.lang.Object.wait(Object.java:502)
   [junit4]    >         at java.util.TimerThread.mainLoop(Timer.java:526)
   [junit4]    >         at java.util.TimerThread.run(Timer.java:505)
   [junit4]    >    5) Thread[id=11258, name=ou=system.data, state=TIMED_WAITING, group=TGRP-SaslZkACLProviderTest]
   [junit4]    >         at sun.misc.Unsafe.park(Native Method)
   [junit4]    >         at java.util.concurrent.locks.LockSupport.parkNanos(LockSupport.java:215)
   [junit4]    >         at java.util.concurrent.locks.AbstractQueuedSynchronizer$ConditionObject.awaitNanos(AbstractQueuedSynchronizer.java:2078)
   [junit4]    >         at java.util.concurrent.ScheduledThreadPoolExecutor$DelayedWorkQueue.take(ScheduledThreadPoolExecutor.java:1093)
   [junit4]    >         at java.util.concurrent.ScheduledThreadPoolExecutor$DelayedWorkQueue.take(ScheduledThreadPoolExecutor.java:809)
   [junit4]    >         at java.util.concurrent.ThreadPoolExecutor.getTask(ThreadPoolExecutor.java:1067)
   [junit4]    >         at java.util.concurrent.ThreadPoolExecutor.runWorker(ThreadPoolExecutor.java:1127)
   [junit4]    >         at java.util.concurrent.ThreadPoolExecutor$Worker.run(ThreadPoolExecutor.java:617)
   [junit4]    >         at java.lang.Thread.run(Thread.java:745)
   [junit4]    >    6) Thread[id=11259, name=NioSocketAcceptor-1, state=RUNNABLE, group=TGRP-SaslZkACLProviderTest]
   [junit4]    >         at sun.nio.ch.WindowsSelectorImpl$SubSelector.poll0(Native Method)
   [junit4]    >         at sun.nio.ch.WindowsSelectorImpl$SubSelector.poll(WindowsSelectorImpl.java:296)
   [junit4]    >         at sun.nio.ch.WindowsSelectorImpl$SubSelector.access$400(WindowsSelectorImpl.java:278)
   [junit4]    >         at sun.nio.ch.WindowsSelectorImpl.doSelect(WindowsSelectorImpl.java:159)
   [junit4]    >         at sun.nio.ch.SelectorImpl.lockAndDoSelect(SelectorImpl.java:86)
   [junit4]    >         at sun.nio.ch.SelectorImpl.select(SelectorImpl.java:97)
   [junit4]    >         at sun.nio.ch.SelectorImpl.select(SelectorImpl.java:101)
   [junit4]    >         at org.apache.mina.transport.socket.nio.NioSocketAcceptor.select(NioSocketAcceptor.java:234)
   [junit4]    >         at org.apache.mina.core.polling.AbstractPollingIoAcceptor$Acceptor.run(AbstractPollingIoAcceptor.java:417)
   [junit4]    >         at org.apache.mina.util.NamePreservingRunnable.run(NamePreservingRunnable.java:64)
   [junit4]    >         at java.util.concurrent.ThreadPoolExecutor.runWorker(ThreadPoolExecutor.java:1142)
   [junit4]    >         at java.util.concurrent.ThreadPoolExecutor$Worker.run(ThreadPoolExecutor.java:617)
   [junit4]    >         at java.lang.Thread.run(Thread.java:745)
   [junit4]    > 	at __randomizedtesting.SeedInfo.seed([894D2A924BC1EC56]:0)Throwable #2: com.carrotsearch.randomizedtesting.ThreadLeakError: There are still zombie threads that couldn't be terminated:
   [junit4]    >    1) Thread[id=11256, name=groupCache.data, state=TIMED_WAITING, group=TGRP-SaslZkACLProviderTest]
   [junit4]    >         at sun.misc.Unsafe.park(Native Method)
   [junit4]    >         at java.util.concurrent.locks.LockSupport.parkNanos(LockSupport.java:215)
   [junit4]    >         at java.util.concurrent.locks.AbstractQueuedSynchronizer$ConditionObject.awaitNanos(AbstractQueuedSynchronizer.java:2078)
   [junit4]    >         at java.util.concurrent.ScheduledThreadPoolExecutor$DelayedWorkQueue.take(ScheduledThreadPoolExecutor.java:1093)
   [junit4]    >         at java.util.concurrent.ScheduledThreadPoolExecutor$DelayedWorkQueue.take(ScheduledThreadPoolExecutor.java:809)
   [junit4]    >         at java.util.concurrent.ThreadPoolExecutor.getTask(ThreadPoolExecutor.java:1067)
   [junit4]    >         at java.util.concurrent.ThreadPoolExecutor.runWorker(ThreadPoolExecutor.java:1127)
   [junit4]    >         at java.util.concurrent.ThreadPoolExecutor$Worker.run(ThreadPoolExecutor.java:617)
   [junit4]    >         at java.lang.Thread.run(Thread.java:745)
   [junit4]    >    2) Thread[id=11255, name=kdcReplayCache.data, state=TIMED_WAITING, group=TGRP-SaslZkACLProviderTest]
   [junit4]    >         at sun.misc.Unsafe.park(Native Method)
   [junit4]    >         at java.util.concurrent.locks.LockSupport.parkNanos(LockSupport.java:215)
   [junit4]    >         at java.util.concurrent.locks.AbstractQueuedSynchronizer$ConditionObject.awaitNanos(AbstractQueuedSynchronizer.java:2078)
   [junit4]    >         at java.util.concurrent.ScheduledThreadPoolExecutor$DelayedWorkQueue.take(ScheduledThreadPoolExecutor.java:1093)
   [junit4]    >         at java.util.concurrent.ScheduledThreadPoolExecutor$DelayedWorkQueue.take(ScheduledThreadPoolExecutor.java:809)
   [junit4]    >         at java.util.concurrent.ThreadPoolExecutor.getTask(ThreadPoolExecutor.java:1067)
   [junit4]    >         at java.util.concurrent.ThreadPoolExecutor.runWorker(ThreadPoolExecutor.java:1127)
   [junit4]    >         at java.util.concurrent.ThreadPoolExecutor$Worker.run(ThreadPoolExecutor.java:617)
   [junit4]    >         at java.lang.Thread.run(Thread.java:745)
   [junit4]    >    3) Thread[id=11257, name=changePwdReplayCache.data, state=TIMED_WAITING, group=TGRP-SaslZkACLProviderTest]
   [junit4]    >         at sun.misc.Unsafe.park(Native Method)
   [junit4]    >         at java.util.concurrent.locks.LockSupport.parkNanos(LockSupport.java:215)
   [junit4]    >         at java.util.concurrent.locks.AbstractQueuedSynchronizer$ConditionObject.awaitNanos(AbstractQueuedSynchronizer.java:2078)
   [junit4]    >         at java.util.concurrent.ScheduledThreadPoolExecutor$DelayedWorkQueue.take(ScheduledThreadPoolExecutor.java:1093)
   [junit4]    >         at java.util.concurrent.ScheduledThreadPoolExecutor$DelayedWorkQueue.take(ScheduledThreadPoolExecutor.java:809)
   [junit4]    >         at java.util.concurrent.ThreadPoolExecutor.getTask(ThreadPoolExecutor.java:1067)
   [junit4]    >         at java.util.concurrent.ThreadPoolExecutor.runWorker(ThreadPoolExecutor.java:1127)
   [junit4]    >         at java.util.concurrent.ThreadPoolExecutor$Worker.run(ThreadPoolExecutor.java:617)
   [junit4]    >         at java.lang.Thread.run(Thread.java:745)
   [junit4]    >    4) Thread[id=11254, name=apacheds, state=WAITING, group=TGRP-SaslZkACLProviderTest]
   [junit4]    >         at java.lang.Object.wait(Native Method)
   [junit4]    >         at java.lang.Object.wait(Object.java:502)
   [junit4]    >         at java.util.TimerThread.mainLoop(Timer.java:526)
   [junit4]    >         at java.util.TimerThread.run(Timer.java:505)
   [junit4]    >    5) Thread[id=11258, name=ou=system.data, state=TIMED_WAITING, group=TGRP-SaslZkACLProviderTest]
   [junit4]    >         at sun.misc.Unsafe.park(Native Method)
   [junit4]    >         at java.util.concurrent.locks.LockSupport.parkNanos(LockSupport.java:215)
   [junit4]    >         at java.util.concurrent.locks.AbstractQueuedSynchronizer$ConditionObject.awaitNanos(AbstractQueuedSynchronizer.java:2078)
   [junit4]    >         at java.util.concurrent.ScheduledThreadPoolExecutor$DelayedWorkQueue.take(ScheduledThreadPoolExecutor.java:1093)
   [junit4]    >         at java.util.concurrent.ScheduledThreadPoolExecutor$DelayedWorkQueue.take(ScheduledThreadPoolExecutor.java:809)
   [junit4]    >         at java.util.concurrent.ThreadPoolExecutor.getTask(ThreadPoolExecutor.java:1067)
   [junit4]    >         at java.util.concurrent.ThreadPoolExecutor.runWorker(ThreadPoolExecutor.java:1127)
   [junit4]    >         at java.util.concurrent.ThreadPoolExecutor$Worker.run(ThreadPoolExecutor.java:617)
   [junit4]    >         at java.lang.Thread.run(Thread.java:745)
   [junit4]    >    6) Thread[id=11259, name=NioSocketAcceptor-1, state=RUNNABLE, group=TGRP-SaslZkACLProviderTest]
   [junit4]    >         at sun.nio.ch.WindowsSelectorImpl.setWakeupSocket0(Native Method)
   [junit4]    >         at sun.nio.ch.WindowsSelectorImpl.setWakeupSocket(WindowsSelectorImpl.java:464)
   [junit4]    >         at sun.nio.ch.WindowsSelectorImpl.wakeup(WindowsSelectorImpl.java:606)
   [junit4]    >         at java.nio.channels.spi.AbstractSelector$1.interrupt(AbstractSelector.java:213)
   [junit4]    >         at java.nio.channels.spi.AbstractSelector.begin(AbstractSelector.java:219)
   [junit4]    >         at sun.nio.ch.WindowsSelectorImpl.doSelect(WindowsSelectorImpl.java:157)
   [junit4]    >         at sun.nio.ch.SelectorImpl.lockAndDoSelect(SelectorImpl.java:86)
   [junit4]    >         at sun.nio.ch.SelectorImpl.select(SelectorImpl.java:97)
   [junit4]    >         at sun.nio.ch.SelectorImpl.select(SelectorImpl.java:101)
   [junit4]    >         at org.apache.mina.transport.socket.nio.NioSocketAcceptor.select(NioSocketAcceptor.java:234)
   [junit4]    >         at org.apache.mina.core.polling.AbstractPollingIoAcceptor$Acceptor.run(AbstractPollingIoAcceptor.java:417)
   [junit4]    >         at org.apache.mina.util.NamePreservingRunnable.run(NamePreservingRunnable.java:64)
   [junit4]    >         at java.util.concurrent.ThreadPoolExecutor.runWorker(ThreadPoolExecutor.java:1142)
   [junit4]    >         at java.util.concurrent.ThreadPoolExecutor$Worker.run(ThreadPoolExecutor.java:617)
   [junit4]    >         at java.lang.Thread.run(Thread.java:745)
   [junit4]    > 	at __randomizedtesting.SeedInfo.seed([894D2A924BC1EC56]:0)
   [junit4] Completed [388/483] on J1 in 83.64s, 1 test, 3 errors <<< FAILURES!

[...truncated 295 lines...]
BUILD FAILED
C:\Users\JenkinsSlave\workspace\Lucene-Solr-trunk-Windows\build.xml:526: The following error occurred while executing this line:
C:\Users\JenkinsSlave\workspace\Lucene-Solr-trunk-Windows\build.xml:474: The following error occurred while executing this line:
C:\Users\JenkinsSlave\workspace\Lucene-Solr-trunk-Windows\build.xml:61: The following error occurred while executing this line:
C:\Users\JenkinsSlave\workspace\Lucene-Solr-trunk-Windows\extra-targets.xml:39: The following error occurred while executing this line:
C:\Users\JenkinsSlave\workspace\Lucene-Solr-trunk-Windows\solr\build.xml:229: The following error occurred while executing this line:
C:\Users\JenkinsSlave\workspace\Lucene-Solr-trunk-Windows\solr\common-build.xml:512: The following error occurred while executing this line:
C:\Users\JenkinsSlave\workspace\Lucene-Solr-trunk-Windows\lucene\common-build.xml:1415: The following error occurred while executing this line:
C:\Users\JenkinsSlave\workspace\Lucene-Solr-trunk-Windows\lucene\common-build.xml:973: There were test failures: 483 suites, 1929 tests, 2 suite-level errors, 1 error, 331 ignored (34 assumptions)

Total time: 52 minutes 20 seconds
Build step 'Invoke Ant' marked build as failure
Archiving artifacts
Recording test results
Email was triggered for: Failure - Any
Sending email for trigger: Failure - Any



Mime
View raw message