lucene-dev mailing list archives

Site index · List index
Message view « Date » · « Thread »
Top « Date » · « Thread »
From Policeman Jenkins Server <jenk...@thetaphi.de>
Subject [JENKINS] Lucene-Solr-trunk-Linux (64bit/jdk1.8.0_40) - Build # 12191 - Still Failing!
Date Thu, 02 Apr 2015 23:58:27 GMT
Build: http://jenkins.thetaphi.de/job/Lucene-Solr-trunk-Linux/12191/
Java: 64bit/jdk1.8.0_40 -XX:+UseCompressedOops -XX:+UseParallelGC

1 tests failed.
FAILED:  org.apache.solr.handler.TestReqParamsAPI.test

Error Message:
Could not get expected value  'CY val' for path 'params/c' full output: {   "responseHeader":{     "status":0,     "QTime":0},   "params":{     "wt":"json",     "useParams":""},   "context":{     "webapp":"",     "path":"/dump",     "httpMethod":"GET"}}

Stack Trace:
java.lang.AssertionError: Could not get expected value  'CY val' for path 'params/c' full output: {
  "responseHeader":{
    "status":0,
    "QTime":0},
  "params":{
    "wt":"json",
    "useParams":""},
  "context":{
    "webapp":"",
    "path":"/dump",
    "httpMethod":"GET"}}
	at __randomizedtesting.SeedInfo.seed([FC143A11B7F9A66F:744005CB1905CB97]:0)
	at org.junit.Assert.fail(Assert.java:93)
	at org.junit.Assert.assertTrue(Assert.java:43)
	at org.apache.solr.core.TestSolrConfigHandler.testForResponseElement(TestSolrConfigHandler.java:405)
	at org.apache.solr.handler.TestReqParamsAPI.testReqParams(TestReqParamsAPI.java:180)
	at org.apache.solr.handler.TestReqParamsAPI.test(TestReqParamsAPI.java:71)
	at sun.reflect.NativeMethodAccessorImpl.invoke0(Native Method)
	at sun.reflect.NativeMethodAccessorImpl.invoke(NativeMethodAccessorImpl.java:62)
	at sun.reflect.DelegatingMethodAccessorImpl.invoke(DelegatingMethodAccessorImpl.java:43)
	at java.lang.reflect.Method.invoke(Method.java:497)
	at com.carrotsearch.randomizedtesting.RandomizedRunner.invoke(RandomizedRunner.java:1627)
	at com.carrotsearch.randomizedtesting.RandomizedRunner$6.evaluate(RandomizedRunner.java:836)
	at com.carrotsearch.randomizedtesting.RandomizedRunner$7.evaluate(RandomizedRunner.java:872)
	at com.carrotsearch.randomizedtesting.RandomizedRunner$8.evaluate(RandomizedRunner.java:886)
	at org.apache.solr.BaseDistributedSearchTestCase$ShardsRepeatRule$ShardsFixedStatement.callStatement(BaseDistributedSearchTestCase.java:960)
	at org.apache.solr.BaseDistributedSearchTestCase$ShardsRepeatRule$ShardsStatement.evaluate(BaseDistributedSearchTestCase.java:935)
	at com.carrotsearch.randomizedtesting.rules.SystemPropertiesRestoreRule$1.evaluate(SystemPropertiesRestoreRule.java:53)
	at org.apache.lucene.util.TestRuleSetupTeardownChained$1.evaluate(TestRuleSetupTeardownChained.java:50)
	at org.apache.lucene.util.AbstractBeforeAfterRule$1.evaluate(AbstractBeforeAfterRule.java:46)
	at org.apache.lucene.util.TestRuleThreadAndTestName$1.evaluate(TestRuleThreadAndTestName.java:49)
	at org.apache.lucene.util.TestRuleIgnoreAfterMaxFailures$1.evaluate(TestRuleIgnoreAfterMaxFailures.java:65)
	at org.apache.lucene.util.TestRuleMarkFailure$1.evaluate(TestRuleMarkFailure.java:48)
	at com.carrotsearch.randomizedtesting.rules.StatementAdapter.evaluate(StatementAdapter.java:36)
	at com.carrotsearch.randomizedtesting.ThreadLeakControl$StatementRunner.run(ThreadLeakControl.java:365)
	at com.carrotsearch.randomizedtesting.ThreadLeakControl.forkTimeoutingTask(ThreadLeakControl.java:798)
	at com.carrotsearch.randomizedtesting.ThreadLeakControl$3.evaluate(ThreadLeakControl.java:458)
	at com.carrotsearch.randomizedtesting.RandomizedRunner.runSingleTest(RandomizedRunner.java:845)
	at com.carrotsearch.randomizedtesting.RandomizedRunner$3.evaluate(RandomizedRunner.java:747)
	at com.carrotsearch.randomizedtesting.RandomizedRunner$4.evaluate(RandomizedRunner.java:781)
	at com.carrotsearch.randomizedtesting.RandomizedRunner$5.evaluate(RandomizedRunner.java:792)
	at com.carrotsearch.randomizedtesting.rules.StatementAdapter.evaluate(StatementAdapter.java:36)
	at com.carrotsearch.randomizedtesting.rules.SystemPropertiesRestoreRule$1.evaluate(SystemPropertiesRestoreRule.java:53)
	at org.apache.lucene.util.AbstractBeforeAfterRule$1.evaluate(AbstractBeforeAfterRule.java:46)
	at com.carrotsearch.randomizedtesting.rules.StatementAdapter.evaluate(StatementAdapter.java:36)
	at org.apache.lucene.util.TestRuleStoreClassName$1.evaluate(TestRuleStoreClassName.java:42)
	at com.carrotsearch.randomizedtesting.rules.NoShadowingOrOverridesOnMethodsRule$1.evaluate(NoShadowingOrOverridesOnMethodsRule.java:39)
	at com.carrotsearch.randomizedtesting.rules.NoShadowingOrOverridesOnMethodsRule$1.evaluate(NoShadowingOrOverridesOnMethodsRule.java:39)
	at com.carrotsearch.randomizedtesting.rules.StatementAdapter.evaluate(StatementAdapter.java:36)
	at com.carrotsearch.randomizedtesting.rules.StatementAdapter.evaluate(StatementAdapter.java:36)
	at com.carrotsearch.randomizedtesting.rules.StatementAdapter.evaluate(StatementAdapter.java:36)
	at org.apache.lucene.util.TestRuleAssertionsRequired$1.evaluate(TestRuleAssertionsRequired.java:54)
	at org.apache.lucene.util.TestRuleMarkFailure$1.evaluate(TestRuleMarkFailure.java:48)
	at org.apache.lucene.util.TestRuleIgnoreAfterMaxFailures$1.evaluate(TestRuleIgnoreAfterMaxFailures.java:65)
	at org.apache.lucene.util.TestRuleIgnoreTestSuites$1.evaluate(TestRuleIgnoreTestSuites.java:55)
	at com.carrotsearch.randomizedtesting.rules.StatementAdapter.evaluate(StatementAdapter.java:36)
	at com.carrotsearch.randomizedtesting.ThreadLeakControl$StatementRunner.run(ThreadLeakControl.java:365)
	at java.lang.Thread.run(Thread.java:745)




Build Log:
[...truncated 10325 lines...]
   [junit4] Suite: org.apache.solr.handler.TestReqParamsAPI
   [junit4]   2> Creating dataDir: /home/jenkins/workspace/Lucene-Solr-trunk-Linux/solr/build/solr-core/test/J0/temp/solr.handler.TestReqParamsAPI FC143A11B7F9A66F-001/init-core-data-001
   [junit4]   2> 1162332 T7448 oas.SolrTestCaseJ4.buildSSLConfig Randomized ssl (false) and clientAuth (false)
   [junit4]   2> 1162332 T7448 oas.BaseDistributedSearchTestCase.initHostContext Setting hostContext system property: /
   [junit4]   2> 1162335 T7448 oasc.ZkTestServer.run STARTING ZK TEST SERVER
   [junit4]   1> client port:0.0.0.0/0.0.0.0:0
   [junit4]   2> 1162336 T7449 oasc.ZkTestServer$ZKServerMain.runFromConfig Starting server
   [junit4]   2> 1162436 T7448 oasc.ZkTestServer.run start zk server on port:52587
   [junit4]   2> 1162436 T7448 oascc.SolrZkClient.createZkCredentialsToAddAutomatically Using default ZkCredentialsProvider
   [junit4]   2> 1162437 T7448 oascc.ConnectionManager.waitForConnected Waiting for client to connect to ZooKeeper
   [junit4]   2> 1162438 T7456 oascc.ConnectionManager.process Watcher org.apache.solr.common.cloud.ConnectionManager@74c9c196 name:ZooKeeperConnection Watcher:127.0.0.1:52587 got event WatchedEvent state:SyncConnected type:None path:null path:null type:None
   [junit4]   2> 1162439 T7448 oascc.ConnectionManager.waitForConnected Client is connected to ZooKeeper
   [junit4]   2> 1162439 T7448 oascc.SolrZkClient.createZkACLProvider Using default ZkACLProvider
   [junit4]   2> 1162439 T7448 oascc.SolrZkClient.makePath makePath: /solr
   [junit4]   2> 1162440 T7448 oascc.SolrZkClient.createZkCredentialsToAddAutomatically Using default ZkCredentialsProvider
   [junit4]   2> 1162441 T7448 oascc.ConnectionManager.waitForConnected Waiting for client to connect to ZooKeeper
   [junit4]   2> 1162442 T7459 oascc.ConnectionManager.process Watcher org.apache.solr.common.cloud.ConnectionManager@13b023c6 name:ZooKeeperConnection Watcher:127.0.0.1:52587/solr got event WatchedEvent state:SyncConnected type:None path:null path:null type:None
   [junit4]   2> 1162442 T7448 oascc.ConnectionManager.waitForConnected Client is connected to ZooKeeper
   [junit4]   2> 1162442 T7448 oascc.SolrZkClient.createZkACLProvider Using default ZkACLProvider
   [junit4]   2> 1162443 T7448 oascc.SolrZkClient.makePath makePath: /collections/collection1
   [junit4]   2> 1162443 T7448 oascc.SolrZkClient.makePath makePath: /collections/collection1/shards
   [junit4]   2> 1162444 T7448 oascc.SolrZkClient.makePath makePath: /collections/control_collection
   [junit4]   2> 1162445 T7448 oascc.SolrZkClient.makePath makePath: /collections/control_collection/shards
   [junit4]   2> 1162445 T7448 oasc.AbstractZkTestCase.putConfig put /home/jenkins/workspace/Lucene-Solr-trunk-Linux/solr/core/src/test-files/solr/collection1/conf/solrconfig-tlog.xml to /configs/conf1/solrconfig.xml
   [junit4]   2> 1162446 T7448 oascc.SolrZkClient.makePath makePath: /configs/conf1/solrconfig.xml
   [junit4]   2> 1162447 T7448 oasc.AbstractZkTestCase.putConfig put /home/jenkins/workspace/Lucene-Solr-trunk-Linux/solr/core/src/test-files/solr/collection1/conf/schema.xml to /configs/conf1/schema.xml
   [junit4]   2> 1162447 T7448 oascc.SolrZkClient.makePath makePath: /configs/conf1/schema.xml
   [junit4]   2> 1162448 T7448 oasc.AbstractZkTestCase.putConfig put /home/jenkins/workspace/Lucene-Solr-trunk-Linux/solr/core/src/test-files/solr/collection1/conf/solrconfig.snippet.randomindexconfig.xml to /configs/conf1/solrconfig.snippet.randomindexconfig.xml
   [junit4]   2> 1162448 T7448 oascc.SolrZkClient.makePath makePath: /configs/conf1/solrconfig.snippet.randomindexconfig.xml
   [junit4]   2> 1162449 T7448 oasc.AbstractZkTestCase.putConfig put /home/jenkins/workspace/Lucene-Solr-trunk-Linux/solr/core/src/test-files/solr/collection1/conf/stopwords.txt to /configs/conf1/stopwords.txt
   [junit4]   2> 1162449 T7448 oascc.SolrZkClient.makePath makePath: /configs/conf1/stopwords.txt
   [junit4]   2> 1162450 T7448 oasc.AbstractZkTestCase.putConfig put /home/jenkins/workspace/Lucene-Solr-trunk-Linux/solr/core/src/test-files/solr/collection1/conf/protwords.txt to /configs/conf1/protwords.txt
   [junit4]   2> 1162451 T7448 oascc.SolrZkClient.makePath makePath: /configs/conf1/protwords.txt
   [junit4]   2> 1162451 T7448 oasc.AbstractZkTestCase.putConfig put /home/jenkins/workspace/Lucene-Solr-trunk-Linux/solr/core/src/test-files/solr/collection1/conf/currency.xml to /configs/conf1/currency.xml
   [junit4]   2> 1162452 T7448 oascc.SolrZkClient.makePath makePath: /configs/conf1/currency.xml
   [junit4]   2> 1162452 T7448 oasc.AbstractZkTestCase.putConfig put /home/jenkins/workspace/Lucene-Solr-trunk-Linux/solr/core/src/test-files/solr/collection1/conf/enumsConfig.xml to /configs/conf1/enumsConfig.xml
   [junit4]   2> 1162453 T7448 oascc.SolrZkClient.makePath makePath: /configs/conf1/enumsConfig.xml
   [junit4]   2> 1162453 T7448 oasc.AbstractZkTestCase.putConfig put /home/jenkins/workspace/Lucene-Solr-trunk-Linux/solr/core/src/test-files/solr/collection1/conf/open-exchange-rates.json to /configs/conf1/open-exchange-rates.json
   [junit4]   2> 1162453 T7448 oascc.SolrZkClient.makePath makePath: /configs/conf1/open-exchange-rates.json
   [junit4]   2> 1162454 T7448 oasc.AbstractZkTestCase.putConfig put /home/jenkins/workspace/Lucene-Solr-trunk-Linux/solr/core/src/test-files/solr/collection1/conf/mapping-ISOLatin1Accent.txt to /configs/conf1/mapping-ISOLatin1Accent.txt
   [junit4]   2> 1162454 T7448 oascc.SolrZkClient.makePath makePath: /configs/conf1/mapping-ISOLatin1Accent.txt
   [junit4]   2> 1162455 T7448 oasc.AbstractZkTestCase.putConfig put /home/jenkins/workspace/Lucene-Solr-trunk-Linux/solr/core/src/test-files/solr/collection1/conf/old_synonyms.txt to /configs/conf1/old_synonyms.txt
   [junit4]   2> 1162455 T7448 oascc.SolrZkClient.makePath makePath: /configs/conf1/old_synonyms.txt
   [junit4]   2> 1162456 T7448 oasc.AbstractZkTestCase.putConfig put /home/jenkins/workspace/Lucene-Solr-trunk-Linux/solr/core/src/test-files/solr/collection1/conf/synonyms.txt to /configs/conf1/synonyms.txt
   [junit4]   2> 1162456 T7448 oascc.SolrZkClient.makePath makePath: /configs/conf1/synonyms.txt
   [junit4]   2> 1162512 T7448 oas.SolrTestCaseJ4.writeCoreProperties Writing core.properties file to /home/jenkins/workspace/Lucene-Solr-trunk-Linux/solr/build/solr-core/test/J0/temp/solr.handler.TestReqParamsAPI FC143A11B7F9A66F-001/control-001/cores/collection1
   [junit4]   2> 1162513 T7448 oejs.Server.doStart jetty-9.2.9.v20150224
   [junit4]   2> 1162514 T7448 oejsh.ContextHandler.doStart Started o.e.j.s.ServletContextHandler@2b9d23ed{/,null,AVAILABLE}
   [junit4]   2> 1162518 T7448 oejs.AbstractConnector.doStart Started ServerConnector@5ee7517d{HTTP/1.1}{127.0.0.1:57949}
   [junit4]   2> 1162518 T7448 oejs.Server.doStart Started @1163553ms
   [junit4]   2> 1162518 T7448 oascse.JettySolrRunner$1.lifeCycleStarted Jetty properties: {solr.data.dir=/home/jenkins/workspace/Lucene-Solr-trunk-Linux/solr/build/solr-core/test/J0/temp/solr.handler.TestReqParamsAPI FC143A11B7F9A66F-001/tempDir-001/control/data, hostContext=/, hostPort=57949, coreRootDirectory=/home/jenkins/workspace/Lucene-Solr-trunk-Linux/solr/build/solr-core/test/J0/../../../../../../../../../home/jenkins/workspace/Lucene-Solr-trunk-Linux/solr/build/solr-core/test/J0/temp/solr.handler.TestReqParamsAPI FC143A11B7F9A66F-001/control-001/cores}
   [junit4]   2> 1162519 T7448 oass.SolrDispatchFilter.init SolrDispatchFilter.init()sun.misc.Launcher$AppClassLoader@4e0e2f2a
   [junit4]   2> 1162519 T7448 oasc.SolrResourceLoader.<init> new SolrResourceLoader for directory: '/home/jenkins/workspace/Lucene-Solr-trunk-Linux/solr/build/solr-core/test/J0/../../../../../../../../../home/jenkins/workspace/Lucene-Solr-trunk-Linux/solr/build/solr-core/test/J0/temp/solr.handler.TestReqParamsAPI FC143A11B7F9A66F-001/control-001/'
   [junit4]   2> 1162528 T7448 oasc.SolrXmlConfig.fromFile Loading container configuration from /home/jenkins/workspace/Lucene-Solr-trunk-Linux/solr/build/solr-core/test/J0/../../../../../../../../../home/jenkins/workspace/Lucene-Solr-trunk-Linux/solr/build/solr-core/test/J0/temp/solr.handler.TestReqParamsAPI FC143A11B7F9A66F-001/control-001/solr.xml
   [junit4]   2> 1162531 T7448 oasc.CorePropertiesLocator.<init> Config-defined core root directory: /home/jenkins/workspace/Lucene-Solr-trunk-Linux/solr/build/solr-core/test/J0/../../../../../../../../../home/jenkins/workspace/Lucene-Solr-trunk-Linux/solr/build/solr-core/test/J0/temp/solr.handler.TestReqParamsAPI FC143A11B7F9A66F-001/control-001/cores
   [junit4]   2> 1162531 T7448 oasc.CoreContainer.<init> New CoreContainer 1131915931
   [junit4]   2> 1162531 T7448 oasc.CoreContainer.load Loading cores into CoreContainer [instanceDir=/home/jenkins/workspace/Lucene-Solr-trunk-Linux/solr/build/solr-core/test/J0/../../../../../../../../../home/jenkins/workspace/Lucene-Solr-trunk-Linux/solr/build/solr-core/test/J0/temp/solr.handler.TestReqParamsAPI FC143A11B7F9A66F-001/control-001/]
   [junit4]   2> 1162531 T7448 oasc.CoreContainer.load loading shared library: /home/jenkins/workspace/Lucene-Solr-trunk-Linux/solr/build/solr-core/test/J0/../../../../../../../../../home/jenkins/workspace/Lucene-Solr-trunk-Linux/solr/build/solr-core/test/J0/temp/solr.handler.TestReqParamsAPI FC143A11B7F9A66F-001/control-001/lib
   [junit4]   2> 1162531 T7448 oasc.SolrResourceLoader.addToClassLoader WARN Can't find (or read) directory to add to classloader: lib (resolved as: /home/jenkins/workspace/Lucene-Solr-trunk-Linux/solr/build/solr-core/test/J0/../../../../../../../../../home/jenkins/workspace/Lucene-Solr-trunk-Linux/solr/build/solr-core/test/J0/temp/solr.handler.TestReqParamsAPI FC143A11B7F9A66F-001/control-001/lib).
   [junit4]   2> 1162535 T7448 oashc.HttpShardHandlerFactory.getParameter Setting socketTimeout to: 90000
   [junit4]   2> 1162535 T7448 oashc.HttpShardHandlerFactory.getParameter Setting urlScheme to: 
   [junit4]   2> 1162535 T7448 oashc.HttpShardHandlerFactory.getParameter Setting connTimeout to: 15000
   [junit4]   2> 1162535 T7448 oashc.HttpShardHandlerFactory.getParameter Setting maxConnectionsPerHost to: 20
   [junit4]   2> 1162535 T7448 oashc.HttpShardHandlerFactory.getParameter Setting maxConnections to: 10000
   [junit4]   2> 1162536 T7448 oashc.HttpShardHandlerFactory.getParameter Setting corePoolSize to: 0
   [junit4]   2> 1162536 T7448 oashc.HttpShardHandlerFactory.getParameter Setting maximumPoolSize to: 2147483647
   [junit4]   2> 1162536 T7448 oashc.HttpShardHandlerFactory.getParameter Setting maxThreadIdleTime to: 5
   [junit4]   2> 1162536 T7448 oashc.HttpShardHandlerFactory.getParameter Setting sizeOfQueue to: -1
   [junit4]   2> 1162536 T7448 oashc.HttpShardHandlerFactory.getParameter Setting fairnessPolicy to: false
   [junit4]   2> 1162536 T7448 oashc.HttpShardHandlerFactory.getParameter Setting useRetries to: false
   [junit4]   2> 1162537 T7448 oasu.UpdateShardHandler.<init> Creating UpdateShardHandler HTTP client with params: socketTimeout=340000&connTimeout=45000&retry=true
   [junit4]   2> 1162537 T7448 oasl.LogWatcher.createWatcher SLF4J impl is org.slf4j.impl.Log4jLoggerFactory
   [junit4]   2> 1162537 T7448 oasl.LogWatcher.newRegisteredLogWatcher Registering Log Listener [Log4j (org.slf4j.impl.Log4jLoggerFactory)]
   [junit4]   2> 1162537 T7448 oasc.CoreContainer.load Node Name: 127.0.0.1
   [junit4]   2> 1162537 T7448 oasc.ZkContainer.initZooKeeper Zookeeper client=127.0.0.1:52587/solr
   [junit4]   2> 1162537 T7448 oasc.ZkController.checkChrootPath zkHost includes chroot
   [junit4]   2> 1162538 T7448 oascc.SolrZkClient.createZkCredentialsToAddAutomatically Using default ZkCredentialsProvider
   [junit4]   2> 1162538 T7448 oascc.ConnectionManager.waitForConnected Waiting for client to connect to ZooKeeper
   [junit4]   2> 1162540 T7473 oascc.ConnectionManager.process Watcher org.apache.solr.common.cloud.ConnectionManager@5cba3daf name:ZooKeeperConnection Watcher:127.0.0.1:52587 got event WatchedEvent state:SyncConnected type:None path:null path:null type:None
   [junit4]   2> 1162541 T7448 oascc.ConnectionManager.waitForConnected Client is connected to ZooKeeper
   [junit4]   2> 1162541 T7448 oascc.SolrZkClient.createZkACLProvider Using default ZkACLProvider
   [junit4]   2> 1162542 T7448 oascc.ConnectionManager.waitForConnected Waiting for client to connect to ZooKeeper
   [junit4]   2> 1162543 T7476 oascc.ConnectionManager.process Watcher org.apache.solr.common.cloud.ConnectionManager@4a01913f name:ZooKeeperConnection Watcher:127.0.0.1:52587/solr got event WatchedEvent state:SyncConnected type:None path:null path:null type:None
   [junit4]   2> 1162543 T7448 oascc.ConnectionManager.waitForConnected Client is connected to ZooKeeper
   [junit4]   2> 1162552 T7448 oascc.SolrZkClient.makePath makePath: /overseer/queue
   [junit4]   2> 1162553 T7448 oascc.SolrZkClient.makePath makePath: /overseer/collection-queue-work
   [junit4]   2> 1162554 T7448 oascc.SolrZkClient.makePath makePath: /overseer/collection-map-running
   [junit4]   2> 1162555 T7448 oascc.SolrZkClient.makePath makePath: /overseer/collection-map-completed
   [junit4]   2> 1162556 T7448 oascc.SolrZkClient.makePath makePath: /overseer/collection-map-failure
   [junit4]   2> 1162557 T7448 oascc.SolrZkClient.makePath makePath: /live_nodes
   [junit4]   2> 1162558 T7448 oascc.SolrZkClient.makePath makePath: /aliases.json
   [junit4]   2> 1162559 T7448 oascc.SolrZkClient.makePath makePath: /clusterstate.json
   [junit4]   2> 1162560 T7448 oasc.ZkController.createEphemeralLiveNode Register node as live in ZooKeeper:/live_nodes/127.0.0.1:57949_
   [junit4]   2> 1162561 T7448 oascc.SolrZkClient.makePath makePath: /live_nodes/127.0.0.1:57949_
   [junit4]   2> 1162561 T7448 oascc.SolrZkClient.makePath makePath: /overseer_elect
   [junit4]   2> 1162562 T7448 oascc.SolrZkClient.makePath makePath: /overseer_elect/election
   [junit4]   2> 1162563 T7448 oasc.Overseer.close Overseer (id=null) closing
   [junit4]   2> 1162564 T7448 oasc.OverseerElectionContext.runLeaderProcess I am going to be the leader 127.0.0.1:57949_
   [junit4]   2> 1162564 T7448 oascc.SolrZkClient.makePath makePath: /overseer_elect/leader
   [junit4]   2> 1162564 T7448 oasc.Overseer.start Overseer (id=93586649387499523-127.0.0.1:57949_-n_0000000000) starting
   [junit4]   2> 1162565 T7448 oascc.SolrZkClient.makePath makePath: /overseer/queue-work
   [junit4]   2> 1162568 T7448 oasc.OverseerAutoReplicaFailoverThread.<init> Starting OverseerAutoReplicaFailoverThread autoReplicaFailoverWorkLoopDelay=10000 autoReplicaFailoverWaitAfterExpiration=30000 autoReplicaFailoverBadNodeExpiration=60000
   [junit4]   2> 1162568 T7448 oascc.ZkStateReader.createClusterStateWatchersAndUpdate Updating cluster state from ZooKeeper... 
   [junit4]   2> 1162569 T7477 oasc.Overseer$ClusterStateUpdater.run Starting to work on the main queue
   [junit4]   2> 1162568 T7478 oasc.OverseerCollectionProcessor.run Process current queue of collection creations
   [junit4]   2> 1162571 T7448 oasc.CorePropertiesLocator.discover Looking for core definitions underneath /home/jenkins/workspace/Lucene-Solr-trunk-Linux/solr/build/solr-core/test/J0/../../../../../../../../../home/jenkins/workspace/Lucene-Solr-trunk-Linux/solr/build/solr-core/test/J0/temp/solr.handler.TestReqParamsAPI FC143A11B7F9A66F-001/control-001/cores
   [junit4]   2> 1162571 T7448 oasc.CoreDescriptor.<init> CORE DESCRIPTOR: {name=collection1, config=solrconfig.xml, transient=false, schema=schema.xml, loadOnStartup=true, instanceDir=/home/jenkins/workspace/Lucene-Solr-trunk-Linux/solr/build/solr-core/test/J0/../../../../../../../../../home/jenkins/workspace/Lucene-Solr-trunk-Linux/solr/build/solr-core/test/J0/temp/solr.handler.TestReqParamsAPI FC143A11B7F9A66F-001/control-001/cores/collection1, collection=control_collection, absoluteInstDir=/home/jenkins/workspace/Lucene-Solr-trunk-Linux/solr/build/solr-core/test/J0/../../../../../../../../../home/jenkins/workspace/Lucene-Solr-trunk-Linux/solr/build/solr-core/test/J0/temp/solr.handler.TestReqParamsAPI FC143A11B7F9A66F-001/control-001/cores/collection1/, coreNodeName=, dataDir=data/, shard=}
   [junit4]   2> 1162572 T7448 oasc.CorePropertiesLocator.discoverUnder Found core collection1 in /home/jenkins/workspace/Lucene-Solr-trunk-Linux/solr/build/solr-core/test/J0/../../../../../../../../../home/jenkins/workspace/Lucene-Solr-trunk-Linux/solr/build/solr-core/test/J0/temp/solr.handler.TestReqParamsAPI FC143A11B7F9A66F-001/control-001/cores/collection1/
   [junit4]   2> 1162572 T7448 oasc.CorePropertiesLocator.discover Found 1 core definitions
   [junit4]   2> 1162572 T7480 C:control_collection c:collection1 oasc.ZkController.publish publishing core=collection1 state=down collection=control_collection
   [junit4]   2> 1162573 T7480 C:control_collection c:collection1 oasc.ZkController.publish numShards not found on descriptor - reading it from system property
   [junit4]   2> 1162573 T7476 oasc.DistributedQueue$LatchWatcher.process NodeChildrenChanged fired on path /overseer/queue state SyncConnected
   [junit4]   2> 1162573 T7480 C:control_collection c:collection1 oasc.ZkController.waitForCoreNodeName look for our core node name
   [junit4]   2> 1162574 T7477 oasc.Overseer$ClusterStateUpdater.run processMessage: queueSize: 1, message = {
   [junit4]   2> 	  "core":"collection1",
   [junit4]   2> 	  "roles":null,
   [junit4]   2> 	  "base_url":"http://127.0.0.1:57949",
   [junit4]   2> 	  "node_name":"127.0.0.1:57949_",
   [junit4]   2> 	  "numShards":"1",
   [junit4]   2> 	  "state":"down",
   [junit4]   2> 	  "shard":null,
   [junit4]   2> 	  "collection":"control_collection",
   [junit4]   2> 	  "operation":"state"} current state version: 0
   [junit4]   2> 1162574 T7477 oasco.ReplicaMutator.updateState Update state numShards=1 message={
   [junit4]   2> 	  "core":"collection1",
   [junit4]   2> 	  "roles":null,
   [junit4]   2> 	  "base_url":"http://127.0.0.1:57949",
   [junit4]   2> 	  "node_name":"127.0.0.1:57949_",
   [junit4]   2> 	  "numShards":"1",
   [junit4]   2> 	  "state":"down",
   [junit4]   2> 	  "shard":null,
   [junit4]   2> 	  "collection":"control_collection",
   [junit4]   2> 	  "operation":"state"}
   [junit4]   2> 1162574 T7477 oasco.ClusterStateMutator.createCollection building a new cName: control_collection
   [junit4]   2> 1162574 T7477 oasco.ReplicaMutator.updateState Assigning new node to shard shard=shard1
   [junit4]   2> 1162575 T7476 oascc.ZkStateReader$2.process A cluster state change: WatchedEvent state:SyncConnected type:NodeDataChanged path:/clusterstate.json, has occurred - updating... (live nodes size: 1)
   [junit4]   2> 1163573 T7480 C:control_collection c:collection1 oasc.ZkController.waitForShardId waiting to find shard id in clusterstate for collection1
   [junit4]   2> 1163574 T7480 C:control_collection c:collection1 oasc.ZkController.createCollectionZkNode Check for collection zkNode:control_collection
   [junit4]   2> 1163574 T7480 C:control_collection c:collection1 oasc.ZkController.createCollectionZkNode Collection zkNode exists
   [junit4]   2> 1163574 T7480 C:control_collection c:collection1 oascc.ZkStateReader.readConfigName Load collection config from:/collections/control_collection
   [junit4]   2> 1163574 T7480 C:control_collection c:collection1 oascc.ZkStateReader.readConfigName path=/collections/control_collection configName=conf1 specified config exists in ZooKeeper
   [junit4]   2> 1163574 T7480 C:control_collection c:collection1 oasc.SolrResourceLoader.<init> new SolrResourceLoader for directory: '/home/jenkins/workspace/Lucene-Solr-trunk-Linux/solr/build/solr-core/test/J0/../../../../../../../../../home/jenkins/workspace/Lucene-Solr-trunk-Linux/solr/build/solr-core/test/J0/temp/solr.handler.TestReqParamsAPI FC143A11B7F9A66F-001/control-001/cores/collection1/'
   [junit4]   2> 1163581 T7480 C:control_collection c:collection1 oasc.ZkController.watchZKConfDir watch zkdir /configs/conf1
   [junit4]   2> 1163582 T7480 C:control_collection c:collection1 oasc.Config.<init> loaded config solrconfig.xml with version 0 
   [junit4]   2> 1163584 T7480 C:control_collection c:collection1 oasc.SolrConfig.refreshRequestParams current version of requestparams : -1
   [junit4]   2> 1163586 T7480 C:control_collection c:collection1 oasc.SolrConfig.<init> Using Lucene MatchVersion: 6.0.0
   [junit4]   2> 1163591 T7480 C:control_collection c:collection1 oasc.SolrConfig.<init> Loaded SolrConfig: solrconfig.xml
   [junit4]   2> 1163591 T7480 C:control_collection c:collection1 oass.IndexSchema.readSchema Reading Solr Schema from /configs/conf1/schema.xml
   [junit4]   2> 1163594 T7480 C:control_collection c:collection1 oass.IndexSchema.readSchema [collection1] Schema name=test
   [junit4]   2> 1163645 T7480 C:control_collection c:collection1 oass.OpenExchangeRatesOrgProvider.init Initialized with rates=open-exchange-rates.json, refreshInterval=1440.
   [junit4]   2> 1163648 T7480 C:control_collection c:collection1 oass.IndexSchema.readSchema default search field in schema is text
   [junit4]   2> 1163649 T7480 C:control_collection c:collection1 oass.IndexSchema.readSchema unique key field: id
   [junit4]   2> 1163652 T7480 C:control_collection c:collection1 oass.FileExchangeRateProvider.reload Reloading exchange rates from file currency.xml
   [junit4]   2> 1163653 T7480 C:control_collection c:collection1 oass.FileExchangeRateProvider.reload Reloading exchange rates from file currency.xml
   [junit4]   2> 1163654 T7480 C:control_collection c:collection1 oass.OpenExchangeRatesOrgProvider.reload Reloading exchange rates from open-exchange-rates.json
   [junit4]   2> 1163654 T7480 C:control_collection c:collection1 oass.OpenExchangeRatesOrgProvider$OpenExchangeRates.<init> WARN Unknown key IMPORTANT NOTE
   [junit4]   2> 1163654 T7480 C:control_collection c:collection1 oass.OpenExchangeRatesOrgProvider$OpenExchangeRates.<init> WARN Expected key, got STRING
   [junit4]   2> 1163655 T7480 C:control_collection c:collection1 oass.OpenExchangeRatesOrgProvider.reload Reloading exchange rates from open-exchange-rates.json
   [junit4]   2> 1163655 T7480 C:control_collection c:collection1 oass.OpenExchangeRatesOrgProvider$OpenExchangeRates.<init> WARN Unknown key IMPORTANT NOTE
   [junit4]   2> 1163655 T7480 C:control_collection c:collection1 oass.OpenExchangeRatesOrgProvider$OpenExchangeRates.<init> WARN Expected key, got STRING
   [junit4]   2> 1163655 T7480 C:control_collection c:collection1 oasc.CoreContainer.create Creating SolrCore 'collection1' using configuration from collection control_collection
   [junit4]   2> 1163655 T7480 C:control_collection c:collection1 oasc.SolrCore.initDirectoryFactory org.apache.solr.core.MockDirectoryFactory
   [junit4]   2> 1163656 T7480 C:control_collection c:collection1 oasc.SolrCore.<init> [collection1] Opening new SolrCore at /home/jenkins/workspace/Lucene-Solr-trunk-Linux/solr/build/solr-core/test/J0/../../../../../../../../../home/jenkins/workspace/Lucene-Solr-trunk-Linux/solr/build/solr-core/test/J0/temp/solr.handler.TestReqParamsAPI FC143A11B7F9A66F-001/control-001/cores/collection1/, dataDir=/home/jenkins/workspace/Lucene-Solr-trunk-Linux/solr/build/solr-core/test/J0/../../../../../../../../../home/jenkins/workspace/Lucene-Solr-trunk-Linux/solr/build/solr-core/test/J0/temp/solr.handler.TestReqParamsAPI FC143A11B7F9A66F-001/control-001/cores/collection1/data/
   [junit4]   2> 1163656 T7480 C:control_collection c:collection1 oasc.JmxMonitoredMap.<init> JMX monitoring is enabled. Adding Solr mbeans to JMX Server: com.sun.jmx.mbeanserver.JmxMBeanServer@50b27fa4
   [junit4]   2> 1163656 T7480 C:control_collection c:collection1 oasc.CachingDirectoryFactory.get return new directory for /home/jenkins/workspace/Lucene-Solr-trunk-Linux/solr/build/solr-core/test/J0/../../../../../../../../../home/jenkins/workspace/Lucene-Solr-trunk-Linux/solr/build/solr-core/test/J0/temp/solr.handler.TestReqParamsAPI FC143A11B7F9A66F-001/control-001/cores/collection1/data
   [junit4]   2> 1163657 T7480 C:control_collection c:collection1 oasc.SolrCore.getNewIndexDir New index directory detected: old=null new=/home/jenkins/workspace/Lucene-Solr-trunk-Linux/solr/build/solr-core/test/J0/../../../../../../../../../home/jenkins/workspace/Lucene-Solr-trunk-Linux/solr/build/solr-core/test/J0/temp/solr.handler.TestReqParamsAPI FC143A11B7F9A66F-001/control-001/cores/collection1/data/index/
   [junit4]   2> 1163657 T7480 C:control_collection c:collection1 oasc.SolrCore.initIndex WARN [collection1] Solr index directory '/home/jenkins/workspace/Lucene-Solr-trunk-Linux/solr/build/solr-core/test/J0/../../../../../../../../../home/jenkins/workspace/Lucene-Solr-trunk-Linux/solr/build/solr-core/test/J0/temp/solr.handler.TestReqParamsAPI FC143A11B7F9A66F-001/control-001/cores/collection1/data/index' doesn't exist. Creating new index...
   [junit4]   2> 1163657 T7480 C:control_collection c:collection1 oasc.CachingDirectoryFactory.get return new directory for /home/jenkins/workspace/Lucene-Solr-trunk-Linux/solr/build/solr-core/test/J0/../../../../../../../../../home/jenkins/workspace/Lucene-Solr-trunk-Linux/solr/build/solr-core/test/J0/temp/solr.handler.TestReqParamsAPI FC143A11B7F9A66F-001/control-001/cores/collection1/data/index
   [junit4]   2> 1163657 T7480 C:control_collection c:collection1 oasu.RandomMergePolicy.<init> RandomMergePolicy wrapping class org.apache.lucene.index.TieredMergePolicy: [TieredMergePolicy: maxMergeAtOnce=38, maxMergeAtOnceExplicit=40, maxMergedSegmentMB=46.4111328125, floorSegmentMB=1.7265625, forceMergeDeletesPctAllowed=6.766806868482186, segmentsPerTier=11.0, maxCFSSegmentSizeMB=8.796093022207999E12, noCFSRatio=0.0
   [junit4]   2> 1163658 T7480 C:control_collection c:collection1 oasc.SolrDeletionPolicy.onCommit SolrDeletionPolicy.onCommit: commits: num=1
   [junit4]   2> 		commit{dir=MockDirectoryWrapper(RAMDirectory@f4685c1 lockFactory=org.apache.lucene.store.SingleInstanceLockFactory@6c1e9fd5),segFN=segments_1,generation=1}
   [junit4]   2> 1163658 T7480 C:control_collection c:collection1 oasc.SolrDeletionPolicy.updateCommits newest commit generation = 1
   [junit4]   2> 1163662 T7480 C:control_collection c:collection1 oasup.UpdateRequestProcessorChain.init creating updateRequestProcessorChain "nodistrib"
   [junit4]   2> 1163662 T7480 C:control_collection c:collection1 oasup.UpdateRequestProcessorChain.init creating updateRequestProcessorChain "dedupe"
   [junit4]   2> 1163663 T7480 C:control_collection c:collection1 oasup.UpdateRequestProcessorChain.init inserting DistributedUpdateProcessorFactory into updateRequestProcessorChain "dedupe"
   [junit4]   2> 1163663 T7480 C:control_collection c:collection1 oasup.UpdateRequestProcessorChain.init creating updateRequestProcessorChain "stored_sig"
   [junit4]   2> 1163663 T7480 C:control_collection c:collection1 oasup.UpdateRequestProcessorChain.init inserting DistributedUpdateProcessorFactory into updateRequestProcessorChain "stored_sig"
   [junit4]   2> 1163663 T7480 C:control_collection c:collection1 oasup.UpdateRequestProcessorChain.init creating updateRequestProcessorChain "distrib-dup-test-chain-explicit"
   [junit4]   2> 1163663 T7480 C:control_collection c:collection1 oasup.UpdateRequestProcessorChain.init creating updateRequestProcessorChain "distrib-dup-test-chain-implicit"
   [junit4]   2> 1163663 T7480 C:control_collection c:collection1 oasup.UpdateRequestProcessorChain.init inserting DistributedUpdateProcessorFactory into updateRequestProcessorChain "distrib-dup-test-chain-implicit"
   [junit4]   2> 1163664 T7480 C:control_collection c:collection1 oasc.SolrCore.loadUpdateProcessorChains no updateRequestProcessorChain defined as default, creating implicit default
   [junit4]   2> 1163665 T7480 C:control_collection c:collection1 oashl.XMLLoader.init xsltCacheLifetimeSeconds=60
   [junit4]   2> 1163666 T7480 C:control_collection c:collection1 oashl.XMLLoader.init xsltCacheLifetimeSeconds=60
   [junit4]   2> 1163667 T7480 C:control_collection c:collection1 oashl.XMLLoader.init xsltCacheLifetimeSeconds=60
   [junit4]   2> 1163667 T7480 C:control_collection c:collection1 oashl.XMLLoader.init xsltCacheLifetimeSeconds=60
   [junit4]   2> 1163669 T7480 C:control_collection c:collection1 oasc.RequestHandlers.initHandlersFromConfig Registered paths: /admin/mbeans,standard,/update/csv,/update/json/docs,/admin/luke,/admin/segments,/get,/admin/system,/replication,/admin/properties,/config,/schema,/admin/plugins,/admin/logging,/update/json,/admin/threads,/admin/ping,/update,/admin/file
   [junit4]   2> 1163669 T7480 C:control_collection c:collection1 oasc.SolrCore.initStatsCache Using default statsCache cache: org.apache.solr.search.stats.LocalStatsCache
   [junit4]   2> 1163670 T7480 C:control_collection c:collection1 oasu.UpdateHandler.<init> Using UpdateLog implementation: org.apache.solr.update.UpdateLog
   [junit4]   2> 1163670 T7480 C:control_collection c:collection1 oasu.UpdateLog.init Initializing UpdateLog: dataDir= defaultSyncLevel=FLUSH numRecordsToKeep=100 maxNumLogsToKeep=10
   [junit4]   2> 1163670 T7480 C:control_collection c:collection1 oasu.CommitTracker.<init> Hard AutoCommit: disabled
   [junit4]   2> 1163670 T7480 C:control_collection c:collection1 oasu.CommitTracker.<init> Soft AutoCommit: disabled
   [junit4]   2> 1163670 T7480 C:control_collection c:collection1 oasu.RandomMergePolicy.<init> RandomMergePolicy wrapping class org.apache.lucene.index.TieredMergePolicy: [TieredMergePolicy: maxMergeAtOnce=42, maxMergeAtOnceExplicit=25, maxMergedSegmentMB=53.1240234375, floorSegmentMB=0.455078125, forceMergeDeletesPctAllowed=6.901531395409188, segmentsPerTier=42.0, maxCFSSegmentSizeMB=8.796093022207999E12, noCFSRatio=0.0
   [junit4]   2> 1163671 T7480 C:control_collection c:collection1 oasc.SolrDeletionPolicy.onInit SolrDeletionPolicy.onInit: commits: num=1
   [junit4]   2> 		commit{dir=MockDirectoryWrapper(RAMDirectory@f4685c1 lockFactory=org.apache.lucene.store.SingleInstanceLockFactory@6c1e9fd5),segFN=segments_1,generation=1}
   [junit4]   2> 1163671 T7480 C:control_collection c:collection1 oasc.SolrDeletionPolicy.updateCommits newest commit generation = 1
   [junit4]   2> 1163671 T7480 C:control_collection c:collection1 oass.SolrIndexSearcher.<init> Opening Searcher@1d869673[collection1] main
   [junit4]   2> 1163671 T7480 C:control_collection c:collection1 oascc.ZkStateReader.readConfigName Load collection config from:/collections/control_collection
   [junit4]   2> 1163671 T7480 C:control_collection c:collection1 oascc.ZkStateReader.readConfigName path=/collections/control_collection configName=conf1 specified config exists in ZooKeeper
   [junit4]   2> 1163672 T7480 C:control_collection c:collection1 oasr.ManagedResourceStorage.newStorageIO Setting up ZooKeeper-based storage for the RestManager with znodeBase: /configs/conf1
   [junit4]   2> 1163672 T7480 C:control_collection c:collection1 oasr.ManagedResourceStorage$ZooKeeperStorageIO.configure Configured ZooKeeperStorageIO with znodeBase: /configs/conf1
   [junit4]   2> 1163672 T7480 C:control_collection c:collection1 oasr.RestManager.init Initializing RestManager with initArgs: {}
   [junit4]   2> 1163672 T7480 C:control_collection c:collection1 oasr.ManagedResourceStorage.load Reading _rest_managed.json using ZooKeeperStorageIO:path=/configs/conf1
   [junit4]   2> 1163672 T7480 C:control_collection c:collection1 oasr.ManagedResourceStorage$ZooKeeperStorageIO.openInputStream No data found for znode /configs/conf1/_rest_managed.json
   [junit4]   2> 1163672 T7480 C:control_collection c:collection1 oasr.ManagedResourceStorage.load Loaded null at path _rest_managed.json using ZooKeeperStorageIO:path=/configs/conf1
   [junit4]   2> 1163672 T7480 C:control_collection c:collection1 oasr.RestManager.init Initializing 0 registered ManagedResources
   [junit4]   2> 1163672 T7480 C:control_collection c:collection1 oash.ReplicationHandler.inform Commits will be reserved for  10000
   [junit4]   2> 1163673 T7480 C:control_collection c:collection1 oasc.CoreContainer.registerCore registering core: collection1
   [junit4]   2> 1163673 T7481 C:control_collection c:collection1 oasc.SolrCore.registerSearcher [collection1] Registered new searcher Searcher@1d869673[collection1] main{ExitableDirectoryReader(UninvertingDirectoryReader())}
   [junit4]   2> 1163673 T7484 C:control_collection S:shard1 oasc.ZkController.register Register replica - core:collection1 address:http://127.0.0.1:57949 collection:control_collection shard:shard1
   [junit4]   2> 1163673 T7448 oass.SolrDispatchFilter.init user.dir=/home/jenkins/workspace/Lucene-Solr-trunk-Linux/solr/build/solr-core/test/J0
   [junit4]   2> 1163673 T7448 oass.SolrDispatchFilter.init SolrDispatchFilter.init() done
   [junit4]   2> 1163673 T7484 C:control_collection S:shard1 oascc.SolrZkClient.makePath makePath: /collections/control_collection/leader_elect/shard1/election
   [junit4]   2> 1163674 T7448 oascc.SolrZkClient.createZkCredentialsToAddAutomatically Using default ZkCredentialsProvider
   [junit4]   2> 1163674 T7448 oascc.ConnectionManager.waitForConnected Waiting for client to connect to ZooKeeper
   [junit4]   2> 1163675 T7487 oascc.ConnectionManager.process Watcher org.apache.solr.common.cloud.ConnectionManager@47f2cbf4 name:ZooKeeperConnection Watcher:127.0.0.1:52587/solr got event WatchedEvent state:SyncConnected type:None path:null path:null type:None
   [junit4]   2> 1163675 T7448 oascc.ConnectionManager.waitForConnected Client is connected to ZooKeeper
   [junit4]   2> 1163676 T7448 oascc.SolrZkClient.createZkACLProvider Using default ZkACLProvider
   [junit4]   2> 1163676 T7448 oascc.ZkStateReader.createClusterStateWatchersAndUpdate Updating cluster state from ZooKeeper... 
   [junit4]   2> 1163676 T7484 C:control_collection S:shard1 oasc.ShardLeaderElectionContext.runLeaderProcess Running the leader process for shard shard1
   [junit4]   2> 1163677 T7476 oasc.DistributedQueue$LatchWatcher.process NodeChildrenChanged fired on path /overseer/queue state SyncConnected
   [junit4]   2> 1163677 T7484 C:control_collection S:shard1 oasc.ShardLeaderElectionContext.waitForReplicasToComeUp Enough replicas found to continue.
   [junit4]   2> 1163677 T7484 C:control_collection S:shard1 oasc.ShardLeaderElectionContext.runLeaderProcess I may be the new leader - try and sync
   [junit4]   2> 1163677 T7448 oasc.ChaosMonkey.monkeyLog monkey: init - expire sessions:false cause connection loss:false
   [junit4]   2> ASYNC  NEW_CORE C1806 name=collection1 org.apache.solr.core.SolrCore@249eb4df url=http://127.0.0.1:57949/collection1 node=127.0.0.1:57949_ C1806_STATE=coll:control_collection core:collection1 props:{core=collection1, base_url=http://127.0.0.1:57949, node_name=127.0.0.1:57949_, state=down}
   [junit4]   2> 1163677 T7484 C:control_collection S:shard1 C1806 P57949 oasc.SyncStrategy.sync Sync replicas to http://127.0.0.1:57949/collection1/
   [junit4]   2> 1163677 T7477 oasc.Overseer$ClusterStateUpdater.run processMessage: queueSize: 1, message = {
   [junit4]   2> 	  "operation":"leader",
   [junit4]   2> 	  "shard":"shard1",
   [junit4]   2> 	  "collection":"control_collection"} current state version: 1
   [junit4]   2> 1163677 T7448 oasc.AbstractFullDistribZkTestBase.createJettys Creating collection1 with stateFormat=2
   [junit4]   2> 1163677 T7484 C:control_collection S:shard1 C1806 P57949 oasc.SyncStrategy.syncReplicas Sync Success - now sync replicas to me
   [junit4]   2> 1163678 T7448 oascc.SolrZkClient.createZkCredentialsToAddAutomatically Using default ZkCredentialsProvider
   [junit4]   2> 1163678 T7484 C:control_collection S:shard1 C1806 P57949 oasc.SyncStrategy.syncToMe http://127.0.0.1:57949/collection1/ has no replicas
   [junit4]   2> 1163678 T7484 C:control_collection S:shard1 oasc.ShardLeaderElectionContext.runLeaderProcess I am the new leader: http://127.0.0.1:57949/collection1/ shard1
   [junit4]   2> 1163679 T7448 oascc.ConnectionManager.waitForConnected Waiting for client to connect to ZooKeeper
   [junit4]   2> 1163679 T7484 C:control_collection S:shard1 oascc.SolrZkClient.makePath makePath: /collections/control_collection/leaders/shard1
   [junit4]   2> 1163679 T7490 oascc.ConnectionManager.process Watcher org.apache.solr.common.cloud.ConnectionManager@2fe4e196 name:ZooKeeperConnection Watcher:127.0.0.1:52587/solr got event WatchedEvent state:SyncConnected type:None path:null path:null type:None
   [junit4]   2> 1163679 T7448 oascc.ConnectionManager.waitForConnected Client is connected to ZooKeeper
   [junit4]   2> 1163680 T7448 oascc.SolrZkClient.createZkACLProvider Using default ZkACLProvider
   [junit4]   2> 1163680 T7476 oasc.DistributedQueue$LatchWatcher.process NodeChildrenChanged fired on path /overseer/queue state SyncConnected
   [junit4]   2> 1163681 T7477 oasc.Overseer$ClusterStateUpdater.run processMessage: queueSize: 2, message = {
   [junit4]   2> 	  "operation":"leader",
   [junit4]   2> 	  "shard":"shard1",
   [junit4]   2> 	  "collection":"control_collection",
   [junit4]   2> 	  "base_url":"http://127.0.0.1:57949",
   [junit4]   2> 	  "core":"collection1",
   [junit4]   2> 	  "state":"active"} current state version: 1
   [junit4]   2> 1163682 T7477 oasc.Overseer$ClusterStateUpdater.run processMessage: queueSize: 1, message = {
   [junit4]   2> 	  "operation":"create",
   [junit4]   2> 	  "name":"collection1",
   [junit4]   2> 	  "numShards":"2",
   [junit4]   2> 	  "stateFormat":"2"} current state version: 1
   [junit4]   2> 1163682 T7477 oasco.ClusterStateMutator.createCollection building a new cName: collection1
   [junit4]   2> 1163682 T7476 oascc.ZkStateReader$2.process A cluster state change: WatchedEvent state:SyncConnected type:NodeDataChanged path:/clusterstate.json, has occurred - updating... (live nodes size: 1)
   [junit4]   2> 1163683 T7487 oascc.ZkStateReader$2.process A cluster state change: WatchedEvent state:SyncConnected type:NodeDataChanged path:/clusterstate.json, has occurred - updating... (live nodes size: 1)
   [junit4]   2> 1163684 T7476 oasc.DistributedQueue$LatchWatcher.process NodeChildrenChanged fired on path /overseer/queue state SyncConnected
   [junit4]   2> 1163684 T7477 oasco.ZkStateWriter.writePendingUpdates going to create_collection /collections/collection1/state.json
   [junit4]   2> 1163685 T7476 oascc.ZkStateReader$2.process A cluster state change: WatchedEvent state:SyncConnected type:NodeDataChanged path:/clusterstate.json, has occurred - updating... (live nodes size: 1)
   [junit4]   2> 1163685 T7487 oascc.ZkStateReader$2.process A cluster state change: WatchedEvent state:SyncConnected type:NodeDataChanged path:/clusterstate.json, has occurred - updating... (live nodes size: 1)
   [junit4]   2> 1163727 T7448 oas.SolrTestCaseJ4.writeCoreProperties Writing core.properties file to /home/jenkins/workspace/Lucene-Solr-trunk-Linux/solr/build/solr-core/test/J0/temp/solr.handler.TestReqParamsAPI FC143A11B7F9A66F-001/shard-1-001/cores/collection1
   [junit4]   2> 1163728 T7448 oasc.AbstractFullDistribZkTestBase.createJettys create jetty 1 in directory /home/jenkins/workspace/Lucene-Solr-trunk-Linux/solr/build/solr-core/test/J0/temp/solr.handler.TestReqParamsAPI FC143A11B7F9A66F-001/shard-1-001
   [junit4]   2> 1163728 T7448 oejs.Server.doStart jetty-9.2.9.v20150224
   [junit4]   2> 1163729 T7448 oejsh.ContextHandler.doStart Started o.e.j.s.ServletContextHandler@7edecdc{/,null,AVAILABLE}
   [junit4]   2> 1163730 T7448 oejs.AbstractConnector.doStart Started ServerConnector@57c92242{HTTP/1.1}{127.0.0.1:59554}
   [junit4]   2> 1163730 T7448 oejs.Server.doStart Started @1164765ms
   [junit4]   2> 1163730 T7448 oascse.JettySolrRunner$1.lifeCycleStarted Jetty properties: {solr.data.dir=/home/jenkins/workspace/Lucene-Solr-trunk-Linux/solr/build/solr-core/test/J0/temp/solr.handler.TestReqParamsAPI FC143A11B7F9A66F-001/tempDir-001/jetty1, solrconfig=solrconfig.xml, hostContext=/, hostPort=59554, coreRootDirectory=/home/jenkins/workspace/Lucene-Solr-trunk-Linux/solr/build/solr-core/test/J0/../../../../../../../../../home/jenkins/workspace/Lucene-Solr-trunk-Linux/solr/build/solr-core/test/J0/temp/solr.handler.TestReqParamsAPI FC143A11B7F9A66F-001/shard-1-001/cores}
   [junit4]   2> 1163730 T7448 oass.SolrDispatchFilter.init SolrDispatchFilter.init()sun.misc.Launcher$AppClassLoader@4e0e2f2a
   [junit4]   2> 1163731 T7448 oasc.SolrResourceLoader.<init> new SolrResourceLoader for directory: '/home/jenkins/workspace/Lucene-Solr-trunk-Linux/solr/build/solr-core/test/J0/../../../../../../../../../home/jenkins/workspace/Lucene-Solr-trunk-Linux/solr/build/solr-core/test/J0/temp/solr.handler.TestReqParamsAPI FC143A11B7F9A66F-001/shard-1-001/'
   [junit4]   2> 1163731 T7484 C:control_collection S:shard1 oasc.ZkController.register We are http://127.0.0.1:57949/collection1/ and leader is http://127.0.0.1:57949/collection1/
   [junit4]   2> 1163731 T7484 C:control_collection S:shard1 oasc.ZkController.register No LogReplay needed for core=collection1 baseURL=http://127.0.0.1:57949
   [junit4]   2> 1163731 T7484 C:control_collection S:shard1 oasc.ZkController.checkRecovery I am the leader, no recovery necessary
   [junit4]   2> 1163731 T7484 C:control_collection S:shard1 c:collection1 oasc.ZkController.publish publishing core=collection1 state=active collection=control_collection
   [junit4]   2> 1163731 T7484 C:control_collection S:shard1 c:collection1 oasc.ZkController.publish numShards not found on descriptor - reading it from system property
   [junit4]   2> 1163732 T7476 oasc.DistributedQueue$LatchWatcher.process NodeChildrenChanged fired on path /overseer/queue state SyncConnected
   [junit4]   2> 1163733 T7477 oasc.Overseer$ClusterStateUpdater.run processMessage: queueSize: 1, message = {
   [junit4]   2> 	  "core":"collection1",
   [junit4]   2> 	  "core_node_name":"core_node1",
   [junit4]   2> 	  "roles":null,
   [junit4]   2> 	  "base_url":"http://127.0.0.1:57949",
   [junit4]   2> 	  "node_name":"127.0.0.1:57949_",
   [junit4]   2> 	  "numShards":"2",
   [junit4]   2> 	  "state":"active",
   [junit4]   2> 	  "shard":"shard1",
   [junit4]   2> 	  "collection":"control_collection",
   [junit4]   2> 	  "operation":"state"} current state version: 3
   [junit4]   2> 1163733 T7477 oasco.ReplicaMutator.updateState Update state numShards=2 message={
   [junit4]   2> 	  "core":"collection1",
   [junit4]   2> 	  "core_node_name":"core_node1",
   [junit4]   2> 	  "roles":null,
   [junit4]   2> 	  "base_url":"http://127.0.0.1:57949",
   [junit4]   2> 	  "node_name":"127.0.0.1:57949_",
   [junit4]   2> 	  "numShards":"2",
   [junit4]   2> 	  "state":"active",
   [junit4]   2> 	  "shard":"shard1",
   [junit4]   2> 	  "collection":"control_collection",
   [junit4]   2> 	  "operation":"state"}
   [junit4]   2> 1163740 T7448 oasc.SolrXmlConfig.fromFile Loading container configuration from /home/jenkins/workspace/Lucene-Solr-trunk-Linux/solr/build/solr-core/test/J0/../../../../../../../../../home/jenkins/workspace/Lucene-Solr-trunk-Linux/solr/build/solr-core/test/J0/temp/solr.handler.TestReqParamsAPI FC143A11B7F9A66F-001/shard-1-001/solr.xml
   [junit4]   2> 1163743 T7448 oasc.CorePropertiesLocator.<init> Config-defined core root directory: /home/jenkins/workspace/Lucene-Solr-trunk-Linux/solr/build/solr-core/test/J0/../../../../../../../../../home/jenkins/workspace/Lucene-Solr-trunk-Linux/solr/build/solr-core/test/J0/temp/solr.handler.TestReqParamsAPI FC143A11B7F9A66F-001/shard-1-001/cores
   [junit4]   2> 1163743 T7448 oasc.CoreContainer.<init> New CoreContainer 968590960
   [junit4]   2> 1163743 T7448 oasc.CoreContainer.load Loading cores into CoreContainer [instanceDir=/home/jenkins/workspace/Lucene-Solr-trunk-Linux/solr/build/solr-core/test/J0/../../../../../../../../../home/jenkins/workspace/Lucene-Solr-trunk-Linux/solr/build/solr-core/test/J0/temp/solr.handler.TestReqParamsAPI FC143A11B7F9A66F-001/shard-1-001/]
   [junit4]   2> 1163743 T7448 oasc.CoreContainer.load loading shared library: /home/jenkins/workspace/Lucene-Solr-trunk-Linux/solr/build/solr-core/test/J0/../../../../../../../../../home/jenkins/workspace/Lucene-Solr-trunk-Linux/solr/build/solr-core/test/J0/temp/solr.handler.TestReqParamsAPI FC143A11B7F9A66F-001/shard-1-001/lib
   [junit4]   2> 1163744 T7448 oasc.SolrResourceLoader.addToClassLoader WARN Can't find (or read) directory to add to classloader: lib (resolved as: /home/jenkins/workspace/Lucene-Solr-trunk-Linux/solr/build/solr-core/test/J0/../../../../../../../../../home/jenkins/workspace/Lucene-Solr-trunk-Linux/solr/build/solr-core/test/J0/temp/solr.handler.TestReqParamsAPI FC143A11B7F9A66F-001/shard-1-001/lib).
   [junit4]   2> 1163747 T7448 oashc.HttpShardHandlerFactory.getParameter Setting socketTimeout to: 90000
   [junit4]   2> 1163748 T7448 oashc.HttpShardHandlerFactory.getParameter Setting urlScheme to: 
   [junit4]   2> 1163748 T7448 oashc.HttpShardHandlerFactory.getParameter Setting connTimeout to: 15000
   [junit4]   2> 1163748 T7448 oashc.HttpShardHandlerFactory.getParameter Setting maxConnectionsPerHost to: 20
   [junit4]   2> 1163748 T7448 oashc.HttpShardHandlerFactory.getParameter Setting maxConnections to: 10000
   [junit4]   2> 1163748 T7448 oashc.HttpShardHandlerFactory.getParameter Setting corePoolSize to: 0
   [junit4]   2> 1163748 T7448 oashc.HttpShardHandlerFactory.getParameter Setting maximumPoolSize to: 2147483647
   [junit4]   2> 1163748 T7448 oashc.HttpShardHandlerFactory.getParameter Setting maxThreadIdleTime to: 5
   [junit4]   2> 1163749 T7448 oashc.HttpShardHandlerFactory.getParameter Setting sizeOfQueue to: -1
   [junit4]   2> 1163749 T7448 oashc.HttpShardHandlerFactory.getParameter Setting fairnessPolicy to: false
   [junit4]   2> 1163749 T7448 oashc.HttpShardHandlerFactory.getParameter Setting useRetries to: false
   [junit4]   2> 1163749 T7448 oasu.UpdateShardHandler.<init> Creating UpdateShardHandler HTTP client with params: socketTimeout=340000&connTimeout=45000&retry=true
   [junit4]   2> 1163749 T7448 oasl.LogWatcher.createWatcher SLF4J impl is org.slf4j.impl.Log4jLoggerFactory
   [junit4]   2> 1163749 T7448 oasl.LogWatcher.newRegisteredLogWatcher Registering Log Listener [Log4j (org.slf4j.impl.Log4jLoggerFactory)]
   [junit4]   2> 1163750 T7448 oasc.CoreContainer.load Node Name: 127.0.0.1
   [junit4]   2> 1163750 T7448 oasc.ZkContainer.initZooKeeper Zookeeper client=127.0.0.1:52587/solr
   [junit4]   2> 1163750 T7448 oasc.ZkController.checkChrootPath zkHost includes chroot
   [junit4]   2> 1163750 T7448 oascc.SolrZkClient.createZkCredentialsToAddAutomatically Using default ZkCredentialsProvider
   [junit4]   2> 1163751 T7448 oascc.ConnectionManager.waitForConnected Waiting for client to connect to ZooKeeper
   [junit4]   2> 1163751 T7504 oascc.ConnectionManager.process Watcher org.apache.solr.common.cloud.ConnectionManager@77b6986c name:ZooKeeperConnection Watcher:127.0.0.1:52587 got event WatchedEvent state:SyncConnected type:None path:null path:null type:None
   [junit4]   2> 1163751 T7448 oascc.ConnectionManager.waitForConnected Client is connected to ZooKeeper
   [junit4]   2> 1163752 T7448 oascc.SolrZkClient.createZkACLProvider Using default ZkACLProvider
   [junit4]   2> 1163752 T7448 oascc.ConnectionManager.waitForConnected Waiting for client to connect to ZooKeeper
   [junit4]   2> 1163753 T7507 oascc.ConnectionManager.process Watcher org.apache.solr.common.cloud.ConnectionManager@2f73be4a name:ZooKeeperConnection Watcher:127.0.0.1:52587/solr got event WatchedEvent state:SyncConnected type:None path:null path:null type:None
   [junit4]   2> 1163753 T7448 oascc.ConnectionManager.waitForConnected Client is connected to ZooKeeper
   [junit4]   2> 1163756 T7448 oascc.ZkStateReader.createClusterStateWatchersAndUpdate Updating cluster state from ZooKeeper... 
   [junit4]   2> 1163835 T7476 oascc.ZkStateReader$2.process A cluster state change: WatchedEvent state:SyncConnected type:NodeDataChanged path:/clusterstate.json, has occurred - updating... (live nodes size: 1)
   [junit4]   2> 1163835 T7507 oascc.ZkStateReader$2.process A cluster state change: WatchedEvent state:SyncConnected type:NodeDataChanged path:/clusterstate.json, has occurred - updating... (live nodes size: 1)
   [junit4]   2> 1163835 T7487 oascc.ZkStateReader$2.process A cluster state change: WatchedEvent state:SyncConnected type:NodeDataChanged path:/clusterstate.json, has occurred - updating... (live nodes size: 1)
   [junit4]   2> 1164758 T7448 oasc.ZkController.createEphemeralLiveNode Register node as live in ZooKeeper:/live_nodes/127.0.0.1:59554_
   [junit4]   2> 1164758 T7448 oascc.SolrZkClient.makePath makePath: /live_nodes/127.0.0.1:59554_
   [junit4]   2> 1164759 T7448 oasc.Overseer.close Overseer (id=null) closing
   [junit4]   2> 1164760 T7448 oasc.CorePropertiesLocator.discover Looking for core definitions underneath /home/jenkins/workspace/Lucene-Solr-trunk-Linux/solr/build/solr-core/test/J0/../../../../../../../../../home/jenkins/workspace/Lucene-Solr-trunk-Linux/solr/build/solr-core/test/J0/temp/solr.handler.TestReqParamsAPI FC143A11B7F9A66F-001/shard-1-001/cores
   [junit4]   2> 1164760 T7448 oasc.CoreDescriptor.<init> CORE DESCRIPTOR: {name=collection1, config=solrconfig.xml, transient=false, schema=schema.xml, loadOnStartup=true, instanceDir=/home/jenkins/workspace/Lucene-Solr-trunk-Linux/solr/build/solr-core/test/J0/../../../../../../../../../home/jenkins/workspace/Lucene-Solr-trunk-Linux/solr/build/solr-core/test/J0/temp/solr.handler.TestReqParamsAPI FC143A11B7F9A66F-001/shard-1-001/cores/collection1, collection=collection1, absoluteInstDir=/home/jenkins/workspace/Lucene-Solr-trunk-Linux/solr/build/solr-core/test/J0/../../../../../../../../../home/jenkins/workspace/Lucene-Solr-trunk-Linux/solr/build/solr-core/test/J0/temp/solr.handler.TestReqParamsAPI FC143A11B7F9A66F-001/shard-1-001/cores/collection1/, coreNodeName=, dataDir=data/, shard=}
   [junit4]   2> 1164761 T7448 oasc.CorePropertiesLocator.discoverUnder Found core collection1 in /home/jenkins/workspace/Lucene-Solr-trunk-Linux/solr/build/solr-core/test/J0/../../../../../../../../../home/jenkins/workspace/Lucene-Solr-trunk-Linux/solr/build/solr-core/test/J0/temp/solr.handler.TestReqParamsAPI FC143A11B7F9A66F-001/shard-1-001/cores/collection1/
   [junit4]   2> 1164761 T7448 oasc.CorePropertiesLocator.discover Found 1 core definitions
   [junit4]   2> 1164762 T7508 C:collection1 c:collection1 oasc.ZkController.publish publishing core=collection1 state=down collection=collection1
   [junit4]   2> 1164762 T7508 C:collection1 c:collection1 oasc.ZkController.publish numShards not found on descriptor - reading it from system property
   [junit4]   2> 1164762 T7476 oasc.DistributedQueue$LatchWatcher.process NodeChildrenChanged fired on path /overseer/queue state SyncConnected
   [junit4]   2> 1164762 T7508 C:collection1 c:collection1 oasc.ZkController.preRegister Registering watch for external collection collection1
   [junit4]   2> 1164763 T7508 C:collection1 c:collection1 oascc.ZkStateReader.addZkWatch addZkWatch collection1
   [junit4]   2> 1164763 T7477 oasc.Overseer$ClusterStateUpdater.run processMessage: queueSize: 1, message = {
   [junit4]   2> 	  "core":"collection1",
   [junit4]   2> 	  "roles":null,
   [junit4]   2> 	  "base_url":"http://127.0.0.1:59554",
   [junit4]   2> 	  "node_name":"127.0.0.1:59554_",
   [junit4]   2> 	  "numShards":"2",
   [junit4]   2> 	  "state":"down",
   [junit4]   2> 	  "shard":null,
   [junit4]   2> 	  "collection":"collection1",
   [junit4]   2> 	  "operation":"state"} current state version: 4
   [junit4]   2> 1164763 T7508 C:collection1 c:collection1 oascc.ZkStateReader.addZkWatch Updating collection state at /collections/collection1/state.json from ZooKeeper... 
   [junit4]   2> 1164763 T7477 oasco.ReplicaMutator.updateState Update state numShards=2 message={
   [junit4]   2> 	  "core":"collection1",
   [junit4]   2> 	  "roles":null,
   [junit4]   2> 	  "base_url":"http://127.0.0.1:59554",
   [junit4]   2> 	  "node_name":"127.0.0.1:59554_",
   [junit4]   2> 	  "numShards":"2",
   [junit4]   2> 	  "state":"down",
   [junit4]   2> 	  "shard":null,
   [junit4]   2> 	  "collection":"collection1",
   [junit4]   2> 	  "operation":"state"}
   [junit4]   2> 1164763 T7477 oasco.ReplicaMutator.updateState Collection already exists with numShards=2
   [junit4]   2> 1164763 T7477 oasco.ReplicaMutator.updateState Assigning new node to shard shard=shard2
   [junit4]   2> 1164764 T7508 C:collection1 c:collection1 oascc.ZkStateReader.updateWatchedCollection Updating data for collection1 to ver 0 
   [junit4]   2> 1164764 T7508 C:collection1 c:collection1 oasc.ZkController.waitForCoreNodeName look for our core node name
   [junit4]   2> 1164864 T7477 oasco.ZkStateWriter.writePendingUpdates going to update_collection /collections/collection1/state.json version: 0
   [junit4]   2> 1164865 T7507 oascc.ZkStateReader$7.process A cluster state change: WatchedEvent state:SyncConnected type:NodeDataChanged path:/collections/collection1/state.json for collection collection1 has occurred - updating... (live nodes size: 2)
   [junit4]   2> 1164865 T7507 oascc.ZkStateReader.updateWatchedCollection Updating data for collection1 to ver 1 
   [junit4]   2> 1165764 T7508 C:collection1 c:collection1 oasc.ZkController.waitForShardId waiting to find shard id in clusterstate for collection1
   [junit4]   2> 1165764 T7508 C:collection1 c:collection1 oasc.ZkController.createCollectionZkNode Check for collection zkNode:collection1
   [junit4]   2> 1165764 T7508 C:collection1 c:collection1 oasc.ZkController.createCollectionZkNode Collection zkNode exists
   [junit4]   2> 1165765 T7508 C:collection1 c:collection1 oascc.ZkStateReader.readConfigName Load collection config from:/collections/collection1
   [junit4]   2> 1165765 T7508 C:collection1 c:collection1 oascc.ZkStateReader.readConfigName path=/collections/collection1 configName=conf1 specified config exists in ZooKeeper
   [junit4]   2> 1165765 T7508 C:collection1 c:collection1 oasc.SolrResourceLoader.<init> new SolrResourceLoader for directory: '/home/jenkins/workspace/Lucene-Solr-trunk-Linux/solr/build/solr-core/test/J0/../../../../../../../../../home/jenkins/workspace/Lucene-Solr-trunk-Linux/solr/build/solr-core/test/J0/temp/solr.handler.TestReqParamsAPI FC143A11B7F9A66F-001/shard-1-001/cores/collection1/'
   [junit4]   2> 1165772 T7508 C:collection1 c:collection1 oasc.ZkController.watchZKConfDir watch zkdir /configs/conf1
   [junit4]   2> 1165772 T7508 C:collection1 c:collection1 oasc.Config.<init> loaded config solrconfig.xml with version 0 
   [junit4]   2> 1165775 T7508 C:collection1 c:collection1 oasc.SolrConfig.refreshRequestParams current version of requestparams : -1
   [junit4]   2> 1165777 T7508 C:collection1 c:collection1 oasc.SolrConfig.<init> Using Lucene MatchVersion: 6.0.0
   [junit4]   2> 1165781 T7508 C:collection1 c:collection1 oasc.SolrConfig.<init> Loaded SolrConfig: solrconfig.xml
   [junit4]   2> 1165782 T7508 C:collection1 c:collection1 oass.IndexSchema.readSchema Reading Solr Schema from /configs/conf1/schema.xml
   [junit4]   2> 1165785 T7508 C:collection1 c:collection1 oass.IndexSchema.readSchema [collection1] Schema name=test
   [junit4]   2> 1165840 T7508 C:collection1 c:collection1 oass.OpenExchangeRatesOrgProvider.init Initialized with rates=open-exchange-rates.json, refreshInterval=1440.
   [junit4]   2> 1165843 T7508 C:collection1 c:collection1 oass.IndexSchema.readSchema default search field in schema is text
   [junit4]   2> 1165844 T7508 C:collection1 c:collection1 oass.IndexSchema.readSchema unique key field: id
   [junit4]   2> 1165847 T7508 C:collection1 c:collection1 oass.FileExchangeRateProvider.reload Reloading exchange rates from file currency.xml
   [junit4]   2> 1165849 T7508 C:collection1 c:collection1 oass.FileExchangeRateProvider.reload Reloading exchange rates from file currency.xml
   [junit4]   2> 1165850 T7508 C:collection1 c:collection1 oass.OpenExchangeRatesOrgProvider.reload Reloading exchange rates from open-exchange-rates.json
   [junit4]   2> 1165850 T7508 C:collection1 c:collection1 oass.OpenExchangeRatesOrgProvider$OpenExchangeRates.<init> WARN Unknown key IMPORTANT NOTE
   [junit4]   2> 1165850 T7508 C:collection1 c:collection1 oass.OpenExchangeRatesOrgProvider$OpenExchangeRates.<init> WARN Expected key, got STRING
   [junit4]   2> 1165850 T7508 C:collection1 c:collection1 oass.OpenExchangeRatesOrgProvider.reload Reloading exchange rates from open-exchange-rates.json
   [junit4]   2> 1165850 T7508 C:collection1 c:collection1 oass.OpenExchangeRatesOrgProvider$OpenExchangeRates.<init> WARN Unknown key IMPORTANT NOTE
   [junit4]   2> 1165851 T7508 C:collection1 c:collection1 oass.OpenExchangeRatesOrgProvider$OpenExchangeRates.<init> WARN Expected key, got STRING
   [junit4]   2> 1165851 T7508 C:collection1 c:collection1 oasc.CoreContainer.create Creating SolrCore 'collection1' using configuration from collection collection1
   [junit4]   2> 1165851 T7508 C:collection1 c:collection1 oasc.SolrCore.initDirectoryFactory org.apache.solr.core.MockDirectoryFactory
   [junit4]   2> 1165851 T7508 C:collection1 c:collection1 oasc.SolrCore.<init> [collection1] Opening new SolrCore at /home/jenkins/workspace/Lucene-Solr-trunk-Linux/solr/build/solr-core/test/J0/../../../../../../../../../home/jenkins/workspace/Lucene-Solr-trunk-Linux/solr/build/solr-core/test/J0/temp/solr.handler.TestReqParamsAPI FC143A11B7F9A66F-001/shard-1-001/cores/collection1/, dataDir=/home/jenkins/workspace/Lucene-Solr-trunk-Linux/solr/build/solr-core/test/J0/../../../../../../../../../home/jenkins/workspace/Lucene-Solr-trunk-Linux/solr/build/solr-core/test/J0/temp/solr.handler.TestReqParamsAPI FC143A11B7F9A66F-001/shard-1-001/cores/collection1/data/
   [junit4]   2> 1165851 T7508 C:collection1 c:collection1 oasc.JmxMonitoredMap.<init> JMX monitoring is enabled. Adding Solr mbeans to JMX Server: com.sun.jmx.mbeanserver.JmxMBeanServer@50b27fa4
   [junit4]   2> 1165851 T7508 C:collection1 c:collection1 oasc.CachingDirectoryFactory.get return new directory for /home/jenkins/workspace/Lucene-Solr-trunk-Linux/solr/build/solr-core/test/J0/../../../../../../../../../home/jenkins/workspace/Lucene-Solr-trunk-Linux/solr/build/solr-core/test/J0/temp/solr.handler.TestReqParamsAPI FC143A11B7F9A66F-001/shard-1-001/cores/collection1/data
   [junit4]   2> 1165852 T7508 C:collection1 c:collection1 oasc.SolrCore.getNewIndexDir New index directory detected: old=null new=/home/jenkins/workspace/Lucene-Solr-trunk-Linux/solr/build/solr-core/test/J0/../../../../../../../../../home/jenkins/workspace/Lucene-Solr-trunk-Linux/solr/build/solr-core/test/J0/temp/solr.handler.TestReqParamsAPI FC143A11B7F9A66F-001/shard-1-001/cores/collection1/data/index/
   [junit4]   2> 1165852 T7508 C:collection1 c:collection1 oasc.SolrCore.initIndex WARN [collection1] Solr index directory '/home/jenkins/workspace/Lucene-Solr-trunk-Linux/solr/build/solr-core/test/J0/../../../../../../../../../home/jenkins/workspace/Lucene-Solr-trunk-Linux/solr/build/solr-core/test/J0/temp/solr.handler.TestReqParamsAPI FC143A11B7F9A66F-001/shard-1-001/cores/collection1/data/index' doesn't exist. Creating new index...
   [junit4]   2> 1165852 T7508 C:collection1 c:collection1 oasc.CachingDirectoryFactory.get return new directory for /home/jenkins/workspace/Lucene-Solr-trunk-Linux/solr/build/solr-core/test/J0/../../../../../../../../../home/jenkins/workspace/Lucene-Solr-trunk-Linux/solr/build/solr-core/test/J0/temp/solr.handler.TestReqParamsAPI FC143A11B7F9A66F-001/shard-1-001/cores/collection1/data/index
   [junit4]   2> 1165852 T7508 C:collection1 c:collection1 oasu.RandomMergePolicy.<init> RandomMergePolicy wrapping class org.apache.lucene.index.TieredMergePolicy: [TieredMergePolicy: maxMergeAtOnce=38, maxMergeAtOnceExplicit=40, maxMergedSegmentMB=46.4111328125, floorSegmentMB=1.7265625, forceMergeDeletesPctAllowed=6.766806868482186, segmentsPerTier=11.0, maxCFSSegmentSizeMB=8.796093022207999E12, noCFSRatio=0.0
   [junit4]   2> 1165852 T7508 C:collection1 c:collection1 oasc.SolrDeletionPolicy.onCommit SolrDeletionPolicy.onCommit: commits: num=1
   [junit4]   2> 		commit{dir=MockDirectoryWrapper(RAMDirectory@7d3665c lockFactory=org.apache.lucene.store.SingleInstanceLockFactory@6aeb571d),segFN=segments_1,generation=1}
   [junit4]   2> 1165853 T7508 C:collection1 c:collection1 oasc.SolrDeletionPolicy.updateCommits newest commit generation = 1
   [junit4]   2> 1165856 T7508 C:collection1 c:collection1 oasup.UpdateRequestProcessorChain.init creating updateRequestProcessorChain "nodistrib"
   [junit4]   2> 1165856 T7508 C:collection1 c:collection1 oasup.UpdateRequestProcessorChain.init creating updateRequestProcessorChain "dedupe"
   [junit4]   2> 1165856 T7508 C:collection1 c:collection1 oasup.UpdateRequestProcessorChain.init inserting DistributedUpdateProcessorFactory into updateRequestProcessorChain "dedupe"
   [junit4]   2> 1165856 T7508 C:collection1 c:collection1 oasup.UpdateRequestProcessorChain.init creating updateRequestProcessorChain "stored_sig"
   [junit4]   2> 1165856 T7508 C:collection1 c:collection1 oasup.UpdateRequestProcessorChain.init inserting DistributedUpdateProcessorFactory into updateRequestProcessorChain "stored_sig"
   [junit4]   2> 1165856 T7508 C:collection1 c:collection1 oasup.UpdateRequestProcessorChain.init creating updateRequestProcessorChain "distrib-dup-test-chain-explicit"
   [junit4]   2> 1165856 T7508 C:collection1 c:collection1 oasup.UpdateRequestProcessorChain.init creating updateRequestProcessorChain "distrib-dup-test-chain-implicit"
   [junit4]   2> 1165857 T7508 C:collection1 c:collection1 oasup.UpdateRequestProcessorChain.init inserting DistributedUpdateProcessorFactory into updateRequestProcessorChain "distrib-dup-test-chain-implicit"
   [junit4]   2> 1165857 T7508 C:collection1 c:collection1 oasc.SolrCore.loadUpdateProcessorChains no updateRequestProcessorChain defined as default, creating implicit default
   [junit4]   2> 1165858 T7508 C:collection1 c:collection1 oashl.XMLLoader.init xsltCacheLifetimeSeconds=60
   [junit4]   2> 1165858 T7508 C:collection1 c:collection1 oashl.XMLLoader.init xsltCacheLifetimeSeconds=60
   [junit4]   2> 1165859 T7508 C:collection1 c:collection1 oashl.XMLLoader.init xsltCacheLifetimeSeconds=60
   [junit4]   2> 1165859 T7508 C:collection1 c:collection1 oashl.XMLLoader.init xsltCacheLifetimeSeconds=60
   [junit4]   2> 1165862 T7508 C:collection1 c:collection1 oasc.RequestHandlers.initHandlersFromConfig Registered paths: /admin/mbeans,standard,/update/csv,/update/json/docs,/admin/luke,/admin/segments,/get,/admin/system,/replication,/admin/properties,/config,/schema,/admin/plugins,/admin/logging,/update/json,/admin/threads,/admin/ping,/update,/admin/file
   [junit4]   2> 1165862 T7508 C:collection1 c:collection1 oasc.SolrCore.initStatsCache Using default statsCache cache: org.apache.solr.search.stats.LocalStatsCache
   [junit4]   2> 1165862 T7508 C:collection1 c:collection1 oasu.UpdateHandler.<init> Using UpdateLog implementation: org.apache.solr.update.UpdateLog
   [junit4]   2> 1165863 T7508 C:collection1 c:collection1 oasu.UpdateLog.init Initializing UpdateLog: dataDir= defaultSyncLevel=FLUSH numRecordsToKeep=100 maxNumLogsToKeep=10
   [junit4]   2> 1165863 T7508 C:collection1 c:collection1 oasu.CommitTracker.<init> Hard AutoCommit: disabled
   [junit4]   2> 1165863 T7508 C:collection1 c:collection1 oasu.CommitTracker.<init> Soft AutoCommit: disabled
   [junit4]   2> 1165864 T7508 C:collection1 c:collection1 oasu.RandomMergePolicy.<init> RandomMergePolicy wrapping class org.apache.lucene.index.TieredMergePolicy: [TieredMergePolicy: maxMergeAtOnce=42, maxMergeAtOnceExplicit=25, maxMergedSegmentMB=53.1240234375, floorSegmentMB=0.455078125, forceMergeDeletesPctAllowed=6.901531395409188, segmentsPerTier=42.0, maxCFSSegmentSizeMB=8.796093022207999E12, noCFSRatio=0.0
   [junit4]   2> 1165864 T7508 C:collection1 c:collection1 oasc.SolrDeletionPolicy.onInit SolrDeletionPolicy.onInit: commits: num=1
   [junit4]   2> 		commit{dir=MockDirectoryWrapper(RAMDirectory@7d3665c lockFactory=org.apache.lucene.store.SingleInstanceLockFactory@6aeb571d),segFN=segments_1,generation=1}
   [junit4]   2> 1165864 T7508 C:collection1 c:collection1 oasc.SolrDeletionPolicy.updateCommits newest commit generation = 1
   [junit4]   2> 1165864 T7508 C:collection1 c:collection1 oass.SolrIndexSearcher.<init> Opening Searcher@436a48f2[collection1] main
   [junit4]   2> 1165864 T7508 C:collection1 c:collection1 oascc.ZkStateReader.readConfigName Load collection config from:/collections/collection1
   [junit4]   2> 1165865 T7508 C:collection1 c:collection1 oascc.ZkStateReader.readConfigName path=/collections/collection1 configName=conf1 specified config exists in ZooKeeper
   [junit4]   2> 1165865 T7508 C:collection1 c:collection1 oasr.ManagedResourceStorage.newStorageIO Setting up ZooKeeper-based storage for the RestManager with znodeBase: /configs/conf1
   [junit4]   2> 1165865 T7508 C:collection1 c:collection1 oasr.ManagedResourceStorage$ZooKeeperStorageIO.configure Configured ZooKeeperStorageIO with znodeBase: /configs/conf1
   [junit4]   2> 1165865 T7508 C:collection1 c:collection1 oasr.RestManager.init Initializing RestManager with initArgs: {}
   [junit4]   2> 1165865 T7508 C:collection1 c:collection1 oasr.ManagedResourceStorage.load Reading _rest_managed.json using ZooKeeperStorageIO:path=/configs/conf1
   [junit4]   2> 1165866 T7508 C:collection1 c:collection1 oasr.ManagedResourceStorage$ZooKeeperStorageIO.openInputStream No data found for znode /configs/conf1/_rest_managed.json
   [junit4]   2> 1165866 T7508 C:collection1 c:collection1 oasr.ManagedResourceStorage.load Loaded null at path _rest_managed.json using ZooKeeperStorageIO:path=/configs/conf1
   [junit4]   2> 1165866 T7508 C:collection1 c:collection1 oasr.RestManager.init Initializing 0 registered ManagedResources
   [junit4]   2> 1165866 T7508 C:collection1 c:collection1 oash.ReplicationHandler.inform Commits will be reserved for  10000
   [junit4]   2> 1165867 T7509 C:collection1 c:collection1 oasc.SolrCore.registerSearcher [collection1] Registered new searcher Searcher@436a48f2[collection1] main{ExitableDirectoryReader(UninvertingDirectoryReader())}
   [junit4]   2> 1165867 T7508 C:collection1 c:collection1 oasc.CoreContainer.registerCore registering core: collection1
   [junit4]   2> 1165867 T7512 C:collection1 S:shard2 oasc.ZkController.register Register replica - core:collection1 address:http://127.0.0.1:59554 collection:collection1 shard:shard2
   [junit4]   2> 1165867 T7448 oass.SolrDispatchFilter.init user.dir=/home/jenkins/workspace/Lucene-Solr-trunk-Linux/solr/build/solr-core/test/J0
   [junit4]   2> 1165868 T7448 oass.SolrDispatchFilter.init SolrDispatchFilter.init() done
   [junit4]   2> 1165868 T7512 C:collection1 S:shard2 oascc.SolrZkClient.makePath makePath: /collections/collection1/leader_elect/shard2/election
   [junit4]   2> 1165870 T7512 C:collection1 S:shard2 oasc.ShardLeaderElectionContext.runLeaderProcess Running the leader process for shard shard2
   [junit4]   2> 1165871 T7476 oasc.DistributedQueue$LatchWatcher.process NodeChildrenChanged fired on path /overseer/queue state SyncConnected
   [junit4]   2> 1165871 T7512 C:collection1 S:shard2 oasc.ShardLeaderElectionContext.waitForReplicasToComeUp Enough replicas found to continue.
   [junit4]   2> 1165871 T7512 C:collection1 S:shard2 oasc.ShardLeaderElectionContext.runLeaderProcess I may be the new leader - try and sync
   [junit4]   2> ASYNC  NEW_CORE C1807 name=collection1 org.apache.solr.core.SolrCore@79664846 url=http://127.0.0.1:59554/collection1 node=127.0.0.1:59554_ C1807_STATE=coll:collection1 core:collection1 props:{core=collection1, base_url=http://127.0.0.1:59554, node_name=127.0.0.1:59554_, state=down}
   [junit4]   2> 1165871 T7512 C:collection1 S:shard2 C1807 P59554 oasc.SyncStrategy.sync Sync replicas to http://127.0.0.1:59554/collection1/
   [junit4]   2> 1165871 T7477 oasc.Overseer$ClusterStateUpdater.run processMessage: queueSize: 1, message = {
   [junit4]   2> 	  "operation":"leader",
   [junit4]   2> 	  "shard":"shard2",
   [junit4]   2> 	  "collection":"collection1"} current state version: 4
   [junit4]   2> 1165871 T7512 C:collection1 S:shard2 C1807 P59554 oasc.SyncStrategy.syncReplicas Sync Success - now sync replicas to me
   [junit4]   2> 1165872 T7512 C:collection1 S:shard2 C1807 P59554 oasc.SyncStrategy.syncToMe http://127.0.0.1:59554/collection1/ has no replicas
   [junit4]   2> 1165872 T7512 C:collection1 S:shard2 oasc.ShardLeaderElectionContext.runLeaderProcess I am the new leader: http://127.0.0.1:59554/collection1/ shard2
   [junit4]   2> 1165872 T7477 oasco.ZkStateWriter.writePendingUpdates going to update_collection /collections/collection1/state.json version: 1
   [junit4]   2> 1165872 T7512 C:collection1 S:shard2 oascc.SolrZkClient.makePath makePath: /collections/collection1/leaders/shard2
   [junit4]   2> 1165872 T7507 oascc.ZkStateReader$7.process A cluster state change: WatchedEvent state:SyncConnected type:NodeDataChanged path:/collections/collection1/state.json for collection collection1 has occurred - updating... (live nodes size: 2)
   [junit4]   2> 1165873 T7507 oascc.ZkStateReader.updateWatchedCollection Updating data for collection1 to ver 2 
   [junit4]   2> 1165875 T7476 oasc.DistributedQueue$LatchWatcher.process NodeChildrenChanged fired on path /overseer/queue state SyncConnected
   [junit4]   2> 1165875 T7477 oasc.Overseer$ClusterStateUpdater.run processMessage: queueSize: 1, message = {
   [junit4]   2> 	  "operation":"leader",
   [junit4]   2> 	  "shard":"shard2",
   [junit4]   2> 	  "collection":"collection1",
   [junit4]   2> 	  "base_url":"http://127.0.0.1:59554",
   [junit4]   2> 	  "core":"collection1",
   [junit4]   2> 	  "state":"active"} current state version: 4
   [junit4]   2> 1165876 T7477 oasco.ZkStateWriter.writePendingUpdates going to update_collection /collections/collection1/state.json version: 2
   [junit4]   2> 1165876 T7507 oascc.ZkStateReader$7.process A cluster state change: WatchedEvent state:SyncConnected type:NodeDataChanged path:/collections/collection1/state.json for collection collection1 has occurred - updating... (live nodes size: 2)
   [junit4]   2> 1165877 T7507 oascc.ZkStateReader.updateWatchedCollection Updating data for collection1 to ver 3 
   [junit4]   2> 1165912 T7448 oas.SolrTestCaseJ4.writeCoreProperties Writing core.properties file to /home/jenkins/workspace/Lucene-Solr-trunk-Linux/solr/build/solr-core/test/J0/temp/solr.handler.TestReqParamsAPI FC143A11B7F9A66F-001/shard-2-001/cores/collection1
   [junit4]   2> 1165913 T7448 oasc.AbstractFullDistribZkTestBase.createJettys create jetty 2 in directory /home/jenkins/workspace/Lucene-Solr-trunk-Linux/solr/build/solr-core/test/J0/temp/solr.handler.TestReqParamsAPI FC143A11B7F9A66F-001/shard-2-001
   [junit4]   2> 1165914 T7448 oejs.Server.doStart jetty-9.2.9.v20150224
   [junit4]   2> 1165915 T7448 oejsh.ContextHandler.doStart Started o.e.j.s.ServletContextHandler@74360241{/,null,AVAILABLE}
   [junit4]   2> 1165915 T7448 oejs.AbstractConnector.doStart Started ServerConnector@12c487f3{HTTP/1.1}{127.0.0.1:58743}
   [junit4]   2> 1165915 T7448 oejs.Server.doStart Started @1166950ms
   [junit4]   2> 1165915 T7448 oascse.JettySolrRunner$1.lifeCycleStarted Jetty properties: {solr.data.dir=/home/jenkins/workspace/Lucene-Solr-trunk-Linux/solr/build/solr-core/test/J0/temp/solr.handler.TestReqParamsAPI FC143A11B7F9A66F-001/tempDir-001/jetty2, solrconfig=solrconfig.xml, hostContext=/, hostPort=58743, coreRootDirectory=/home/jenkins/workspace/Lucene-Solr-trunk-Linux/solr/build/solr-core/test/J0/temp/solr.handler.TestReqParamsAPI FC143A11B7F9A66F-001/shard-2-001/cores}
   [junit4]   2> 1165916 T7448 oass.SolrDispatchFilter.init SolrDispatchFilter.init()sun.misc.Launcher$AppClassLoader@4e0e2f2a
   [junit4]   2> 1165916 T7448 oasc.SolrResourceLoader.<init> new SolrResourceLoader for directory: '/home/jenkins/workspace/Lucene-Solr-trunk-Linux/solr/build/solr-core/test/J0/temp/solr.handler.TestReqParamsAPI FC143A11B7F9A66F-001/shard-2-001/'
   [junit4]   2> 1165925 T7448 oasc.SolrXmlConfig.fromFile Loading container configuration from /home/jenkins/workspace/Lucene-Solr-trunk-Linux/solr/build/solr-core/test/J0/temp/solr.handler.TestReqParamsAPI FC143A11B7F9A66F-001/shard-2-001/solr.xml
   [junit4]   2> 1165925 T7512 C:collection1 S:shard2 oasc.ZkController.register We are http://127.0.0.1:59554/collection1/ and leader is http://127.0.0.1:59554/collection1/
   [junit4]   2> 1165925 T7512 C:collection1 S:shard2 oasc.ZkController.register No LogReplay needed for core=collection1 baseURL=http://127.0.0.1:59554
   [junit4]   2> 1165925 T7512 C:collection1 S:shard2 oasc.ZkController.checkRecovery I am the leader, no recovery necessary
   [junit4]   2> 1165926 T7512 C:collection1 S:shard2 c:collection1 oasc.ZkController.publish publishing core=collection1 state=active collection=collection1
   [junit4]   2> 1165926 T7512 C:collection1 S:shard2 c:collection1 oasc.ZkController.publish numShards not found on descriptor - reading it from system property
   [junit4]   2> 1165926 T7476 oasc.DistributedQueue$LatchWatcher.process NodeChildrenChanged fired on path /overseer/queue state SyncConnected
   [junit4]   2> 1165927 T7477 oasc.Overseer$ClusterStateUpdater.run processMessage: queueSize: 1, message = {
   [junit4]   2> 	  "core":"collection1",
   [junit4]   2> 	  "core_node_name":"core_node1",
   [junit4]   2> 	  "roles":null,
   [junit4]   2> 	  "base_url":"http://127.0.0.1:59554",
   [junit4]   2> 	  "node_name":"127.0.0.1:59554_",
   [junit4]   2> 	  "numShards":"2",
   [junit4]   2> 	  "state":"active",
   [junit4]   2> 	  "shard":"shard2",
   [junit4]   2> 	  "collection":"collection1",
   [junit4]   2> 	  "operation":"state"} current state version: 4
   [junit4]   2> 1165927 T7477 oasco.ReplicaMutator.updateState Update state numShards=2 message={
   [junit4]   2> 	  "core":"collection1",
   [junit4]   2> 	  "core_node_name":"core_node1",
   [junit4]   2> 	  "roles":null,
   [junit4]   2> 	  "base_url":"http://127.0.0.1:59554",
   [junit4]   2> 	  "node_name":"127.0.0.1:59554_",
   [junit4]   2> 	  "numShards":"2",
   [junit4]   2> 	  "state":"active",
   [junit4]   2> 	  "shard":"shard2",
   [junit4]   2> 	  "collection":"collection1",
   [junit4]   2> 	  "operation":"state"}
   [junit4]   2> 1165927 T7512 C:collection1 S:shard2 oascc.ZkStateReader.updateWatchedCollection Updating data for collection1 to ver 3 
   [junit4]   2> 1165928 T7448 oasc.CorePropertiesLocator.<init> Config-defined core root directory: /home/jenkins/workspace/Lucene-Solr-trunk-Linux/solr/build/solr-core/test/J0/temp/solr.handler.TestReqParamsAPI FC143A11B7F9A66F-001/shard-2-001/cores
   [junit4]   2> 1165928 T7477 oasco.ZkStateWriter.writePendingUpdates going to update_collection /collections/collection1/state.json version: 3
   [junit4]   2> 1165928 T7448 oasc.CoreContainer.<init> New CoreContainer 1597978945
   [junit4]   2> 1165928 T7448 oasc.CoreContainer.load Loading cores into CoreContainer [instanceDir=/home/jenkins/workspace/Lucene-Solr-trunk-Linux/solr/build/solr-core/test/J0/temp/solr.handler.TestReqParamsAPI FC143A11B7F9A66F-001/shard-2-001/]
   [junit4]   2> 1165928 T7448 oasc.CoreContainer.load loading shared library: /home/jenkins/workspace/Lucene-Solr-trunk-Linux/solr/build/solr-core/test/J0/temp/solr.handler.TestReqParamsAPI FC143A11B7F9A66F-001/shard-2-001/lib
   [junit4]   2> 1165928 T7507 oascc.ZkStateReader$7.process A cluster state change: WatchedEvent state:SyncConnected type:NodeDataChanged path:/collections/collection1/state.json for collection collection1 has occurred - updating... (live nodes size: 2)
   [junit4]   2> 1165929 T7448 oasc.SolrResourceLoader.addToClassLoader WARN Can't find (or read) directory to add to classloader: lib (resolved as: /home/jenkins/workspace/Lucene-Solr-trunk-Linux/solr/build/solr-core/test/J0/temp/solr.handler.TestReqParamsAPI FC143A11B7F9A66F-001/shard-2-001/lib).
   [junit4]   2> 1165929 T7507 oascc.ZkStateReader.updateWatchedCollection Updating data for collection1 to ver 4 
   [junit4]   2> 1165932 T7448 oashc.HttpShardHandlerFactory.getParameter Setting socketTimeout to: 90000
   [junit4]   2> 1165932 T7448 oashc.HttpShardHandlerFactory.getParameter Setting urlScheme to: 
   [junit4]   2> 1165933 T7448 oashc.HttpShardHandlerFactory.getParameter Setting connTimeout to: 15000
   [junit4]   2> 1165933 T7448 oashc.HttpShardHandlerFactory.getParameter Setting maxConnectionsPerHost to: 20
   [junit4]   2> 1165933 T7448 oashc.HttpShardHandlerFactory.getParameter Setting maxConnections to: 10000
   [junit4]   2> 1165933 T7448 oashc.HttpShardHandlerFactory.getParameter Setting corePoolSize to: 0
   [junit4]   2> 1165933 T7448 oashc.HttpShardHandlerFactory.getParameter Setting maximumPoolSize to: 2147483647
   [junit4]   2> 1165933 T7448 oashc.HttpShardHandlerFactory.getParameter Setting maxThreadIdleTime to: 5
   [junit4]   2> 1165933 T7448 oashc.HttpShardHandlerFactory.getParameter Setting sizeOfQueue to: -1
   [junit4]   2> 1165934 T7448 oashc.HttpShardHandlerFactory.getParameter Setting fairnessPolicy to: false
   [junit4]   2> 1165934 T7448 oashc.HttpShardHandlerFactory.getParameter Setting useRetries to: false
   [junit4]   2> 1165934 T7448 oasu.UpdateShardHandler.<init> Creating UpdateShardHandler HTTP client with params: socketTimeout=340000&connTimeout=45000&retry=true
   [junit4]   2> 1165934 T7448 oasl.LogWatcher.createWatcher SLF4J impl is org.slf4j.impl.Log4jLoggerFactory
   [junit4]   2> 1165934 T7448 oasl.LogWatcher.newRegisteredLogWatcher Registering Log Listener [Log4j (org.slf4j.impl.Log4jLoggerFactory)]
   [junit4]   2> 1165934 T7448 oasc.CoreContainer.load Node Name: 127.0.0.1
   [junit4]   2> 1165935 T7448 oasc.ZkContainer.initZooKeeper Zookeeper client=127.0.0.1:52587/solr
   [junit4]   2> 1165935 T7448 oasc.ZkController.checkChrootPath zkHost includes chroot
   [junit4]   2> 1165935 T7448 oascc.SolrZkClient.createZkCredentialsToAddAutomatically Using default ZkCredentialsProvider
   [junit4]   2> 1165935 T7448 oascc.ConnectionManager.waitForConnected Waiting for client to connect to ZooKeeper
   [junit4]   2> 1165936 T7526 oascc.ConnectionManager.process Watcher org.apache.solr.common.cloud.ConnectionManager@723d33f7 name:ZooKeeperConnection Watcher:127.0.0.1:52587 got event WatchedEvent state:SyncConnected type:None path:null path:null type:None
   [junit4]   2> 1165936 T7448 oascc.ConnectionManager.waitForConnected Client is connected to ZooKeeper
   [junit4]   2> 1165937 T7448 oascc.SolrZkClient.createZkACLProvider Using default ZkACLProvider
   [junit4]   2> 1165937 T7448 oascc.ConnectionManager.waitForConnected Waiting for client to connect to ZooKeeper
   [junit4]   2> 1165938 T7529 oascc.ConnectionManager.process Watcher org.apache.solr.common.cloud.ConnectionManager@3a64cae7 name:ZooKeeperConnection Watcher:127.0.0.1:52587/solr got event WatchedEvent state:SyncConnected type:None path:null path:null type:None
   [junit4]   2> 1165938 T7448 oascc.ConnectionManager.waitForConnected Client is connected to ZooKeeper
   [junit4]   2> 1165940 T7448 oascc.ZkStateReader.createClusterStateWatchersAndUpdate Updating cluster state from ZooKeeper... 
   [junit4]   2> 1166941 T7448 oasc.ZkController.createEphemeralLiveNode Register node as live in ZooKeeper:/live_nodes/127.0.0.1:58743_
   [junit4]   2> 1166942 T7448 oascc.SolrZkClient.makePath makePath: /live_nodes/127.0.0.1:58743_
   [junit4]   2> 1166944 T7448 oasc.Overseer.close Overseer (id=null) closing
   [junit4]   2> 1166945 T7448 oasc.CorePropertiesLocator.discover Looking for core definitions underneath /home/jenkins/workspace/Lucene-Solr-trunk-Linux/solr/build/solr-core/test/J0/temp/solr.handler.TestReqParamsAPI FC143A11B7F9A66F-001/shard-2-001/cores
   [junit4]   2> 1167019 T7448 oasc.CoreDescriptor.<init> CORE DESCRIPTOR: {name=collection1, config=solrconfig.xml, transient=false, schema=schema.xml, loadOnStartup=true, instanceDir=/home/jenkins/workspace/Lucene-Solr-trunk-Linux/solr/build/solr-core/test/J0/temp/solr.handler.TestReqParamsAPI FC143A11B7F9A66F-001/shard-2-001/cores/collection1, collection=collection1, absoluteInstDir=/home/jenkins/workspace/Lucene-Solr-trunk-Linux/solr/build/solr-core/test/J0/temp/solr.handler.TestReqParamsAPI FC143A11B7F9A66F-001/shard-2-001/cores/collection1/, coreNodeName=, dataDir=data/, shard=}
   [junit4]   2> 1167019 T7448 oasc.CorePropertiesLocator.discoverUnder Found core collection1 in /home/jenkins/workspace/Lucene-Solr-trunk-Linux/solr/build/solr-core/test/J0/temp/solr.handler.TestReqParamsAPI FC143A11B7F9A66F-001/shard-2-001/cores/collection1/
   [junit4]   2> 1167019 T7448 oasc.CorePropertiesLocator.discover Found 1 core definitions
   [junit4]   2> 1167020 T7530 C:collection1 c:collection1 oasc.ZkController.publish publishing core=collection1 state=down collection=collection1
   [junit4]   2> 1167020 T7530 C:collection1 c:collection1 oasc.ZkController.publish numShards not found on descriptor - reading it from system property
   [junit4]   2> 1167021 T7476 oasc.DistributedQueue$LatchWatcher.process NodeChildrenChanged fired on path /overseer/queue state SyncConnected
   [junit4]   2> 1167021 T7530 C:collection1 c:collection1 oasc.ZkController.preRegister Registering watch for external collection collection1
   [junit4]   2> 1167021 T7530 C:collection1 c:collection1 oascc.ZkStateReader.addZkWatch addZkWatch collection1
   [junit4]   2> 1167021 T7477 oasc.Overseer$ClusterStateUpdater.run processMessage: queueSize: 1, message = {
   [junit4]   2> 	  "core":"collection1",
   [junit4]   2> 	  "roles":null,
   [junit4]   2> 	  "base_url":"http://127.0.0.1:58743",
   [junit4]   2> 	  "node_name":"127.0.0.1:58743_",
   [junit4]   2> 	  "numShards":"2",
   [junit4]   2> 	  "state":"down",
   [junit4]   2> 	  "shard":null,
   [junit4]   2> 	  "collection":"collection1",
   [junit4]   2> 	  "operation":"state"} current state version: 4
   [junit4]   2> 1167021 T7530 C:collection1 c:collection1 oascc.ZkStateReader.addZkWatch Updating collection state at /collections/collection1/state.json from ZooKeeper... 
   [junit4]   2> 1167021 T7477 oasco.ReplicaMutator.updateState Update state numShards=2 message={
   [junit4]   2> 	  "core":"collection1",
   [junit4]   2> 	  "roles":null,
   [junit4]   2> 	  "base_url":"http://127.0.0.1:58743",
   [junit4]   2> 	  "node_name":"127.0.0.1:58743_",
   [junit4]   2> 	  "numShards":"2",
   [junit4]   2> 	  "state":"down",
   [junit4]   2> 	  "shard":null,
   [junit4]   2> 	  "collection":"collection1",
   [junit4]   2> 	  "operation":"state"}
   [junit4]   2> 1167022 T7477 oasco.ReplicaMutator.updateState Collection already exists with numShards=2
   [junit4]   2> 1167022 T7477 oasco.ReplicaMutator.updateState Assigning new node to shard shard=shard1
   [junit4]   2> 1167022 T7530 C:collection1 c:collection1 oascc.ZkStateReader.updateWatchedCollection Updating data for collection1 to ver 4 
   [junit4]   2> 1167022 T7530 C:collection1 c:collection1 oasc.ZkController.waitForCoreNodeName look for our core node name
   [junit4]   2> 1167022 T7477 oasco.ZkStateWriter.writePendingUpdates going to update_collection /collections/collection1/state.json version: 4
   [junit4]   2> 1167022 T7507 oascc.ZkStateReader$7.process A cluster state change: WatchedEvent state:SyncConnected type:NodeDataChanged path:/collections/collection1/state.json for collection collection1 has occurred - updating... (live nodes size: 3)
   [junit4]   2> 1167023 T7529 oascc.ZkStateReader$7.process A cluster state change: WatchedEvent state:SyncConnected type:NodeDataChanged path:/collections/collection1/state.json for collection collection1 has occurred - updating... (live nodes size: 3)
   [junit4]   2> 1167023 T7507 oascc.ZkStateReader.updateWatchedCollection Updating data for collection1 to ver 5 
   [junit4]   2> 1167023 T7529 oascc.ZkStateReader.updateWatchedCollection Updating data for collection1 to ver 5 
   [junit4]   2> 1168022 T7530 C:collection1 c:collection1 oasc.ZkController.waitForShardId waiting to find shard id in clusterstate for collection1
   [junit4]   2> 1168022 T7530 C:collection1 c:collection1 oasc.ZkController.createCollectionZkNode Check for collection zkNode:collection1
   [junit4]   2> 1168023 T7530 C:collection1 c:collection1 oasc.ZkController.createCollectionZkNode Collection zkNode exists
   [junit4]

[...truncated too long message...]

current.ThreadPoolExecutor.runWorker(ThreadPoolExecutor.java:1142)
   [junit4]   2> 		at java.util.concurrent.ThreadPoolExecutor$Worker.run(ThreadPoolExecutor.java:617)
   [junit4]   2> 		at java.lang.Thread.run(Thread.java:745)
   [junit4]   2> 	Caused by: org.apache.zookeeper.KeeperException$SessionExpiredException: KeeperErrorCode = Session expired for /collections
   [junit4]   2> 		at org.apache.zookeeper.KeeperException.create(KeeperException.java:127)
   [junit4]   2> 		at org.apache.zookeeper.KeeperException.create(KeeperException.java:51)
   [junit4]   2> 		at org.apache.zookeeper.ZooKeeper.exists(ZooKeeper.java:1045)
   [junit4]   2> 		at org.apache.solr.common.cloud.SolrZkClient$4.execute(SolrZkClient.java:294)
   [junit4]   2> 		at org.apache.solr.common.cloud.SolrZkClient$4.execute(SolrZkClient.java:291)
   [junit4]   2> 		at org.apache.solr.common.cloud.ZkCmdExecutor.retryOperation(ZkCmdExecutor.java:61)
   [junit4]   2> 		at org.apache.solr.common.cloud.SolrZkClient.exists(SolrZkClient.java:291)
   [junit4]   2> 		at org.apache.solr.common.cloud.SolrZkClient.makePath(SolrZkClient.java:486)
   [junit4]   2> 		at org.apache.solr.common.cloud.SolrZkClient.makePath(SolrZkClient.java:455)
   [junit4]   2> 		at org.apache.solr.common.cloud.SolrZkClient.makePath(SolrZkClient.java:442)
   [junit4]   2> 		at org.apache.solr.cloud.ShardLeaderElectionContextBase$1.execute(ElectionContext.java:146)
   [junit4]   2> 		at org.apache.solr.common.util.RetryUtil.retryOnThrowable(RetryUtil.java:31)
   [junit4]   2> 		at org.apache.solr.cloud.ShardLeaderElectionContextBase.runLeaderProcess(ElectionContext.java:142)
   [junit4]   2> 		... 11 more
   [junit4]   2> 	
   [junit4]   2> 1184728 T7448 C:control_collection S:shard1 c:collection1 oejs.AbstractConnector.doStop Stopped ServerConnector@7b6ce725{HTTP/1.1}{127.0.0.1:0}
   [junit4]   2> 1184728 T7448 C:control_collection S:shard1 c:collection1 oejsh.ContextHandler.doStop Stopped o.e.j.s.ServletContextHandler@24684b72{/,null,UNAVAILABLE}
   [junit4]   2> 1184729 T7448 C:control_collection S:shard1 c:collection1 oasc.ZkTestServer.send4LetterWord connecting to 127.0.0.1:52587 52587
   [junit4]   2> 1189770 T7449 oasc.ZkTestServer.send4LetterWord connecting to 127.0.0.1:52587 52587
   [junit4]   2> 1189771 T7449 oasc.ZkTestServer$ZKServerMain.runFromConfig WARN Watch limit violations: 
   [junit4]   2> 	Maximum concurrent create/delete watches above limit:
   [junit4]   2> 	
   [junit4]   2> 		25	/solr/configs/conf1
   [junit4]   2> 		6	/solr/aliases.json
   [junit4]   2> 		6	/solr/clusterstate.json
   [junit4]   2> 		4	/solr/collections/collection1/state.json
   [junit4]   2> 	
   [junit4]   2> 	Maximum concurrent children watches above limit:
   [junit4]   2> 	
   [junit4]   2> 		6	/solr/live_nodes
   [junit4]   2> 		4	/solr/overseer/queue
   [junit4]   2> 		4	/solr/overseer/collection-queue-work
   [junit4]   2> 	
   [junit4]   2> NOTE: reproduce with: ant test  -Dtestcase=TestReqParamsAPI -Dtests.method=test -Dtests.seed=FC143A11B7F9A66F -Dtests.multiplier=3 -Dtests.slow=true -Dtests.locale=ar_AE -Dtests.timezone=Mexico/BajaNorte -Dtests.asserts=true -Dtests.file.encoding=UTF-8
   [junit4] FAILURE 27.4s J0 | TestReqParamsAPI.test <<<
   [junit4]    > Throwable #1: java.lang.AssertionError: Could not get expected value  'CY val' for path 'params/c' full output: {
   [junit4]    >   "responseHeader":{
   [junit4]    >     "status":0,
   [junit4]    >     "QTime":0},
   [junit4]    >   "params":{
   [junit4]    >     "wt":"json",
   [junit4]    >     "useParams":""},
   [junit4]    >   "context":{
   [junit4]    >     "webapp":"",
   [junit4]    >     "path":"/dump",
   [junit4]    >     "httpMethod":"GET"}}
   [junit4]    > 	at __randomizedtesting.SeedInfo.seed([FC143A11B7F9A66F:744005CB1905CB97]:0)
   [junit4]    > 	at org.apache.solr.core.TestSolrConfigHandler.testForResponseElement(TestSolrConfigHandler.java:405)
   [junit4]    > 	at org.apache.solr.handler.TestReqParamsAPI.testReqParams(TestReqParamsAPI.java:180)
   [junit4]    > 	at org.apache.solr.handler.TestReqParamsAPI.test(TestReqParamsAPI.java:71)
   [junit4]    > 	at org.apache.solr.BaseDistributedSearchTestCase$ShardsRepeatRule$ShardsFixedStatement.callStatement(BaseDistributedSearchTestCase.java:960)
   [junit4]    > 	at org.apache.solr.BaseDistributedSearchTestCase$ShardsRepeatRule$ShardsStatement.evaluate(BaseDistributedSearchTestCase.java:935)
   [junit4]    > 	at java.lang.Thread.run(Thread.java:745)
   [junit4]   2> 1189776 T7448 C:control_collection S:shard1 c:collection1 oas.SolrTestCaseJ4.deleteCore ###deleteCore
   [junit4]   2> NOTE: leaving temporary files on disk at: /home/jenkins/workspace/Lucene-Solr-trunk-Linux/solr/build/solr-core/test/J0/temp/solr.handler.TestReqParamsAPI FC143A11B7F9A66F-001
   [junit4]   2> NOTE: test params are: codec=Asserting(Lucene50): {}, docValues:{}, sim=RandomSimilarityProvider(queryNorm=true,coord=yes): {}, locale=ar_AE, timezone=Mexico/BajaNorte
   [junit4]   2> NOTE: Linux 3.13.0-46-generic amd64/Oracle Corporation 1.8.0_40 (64-bit)/cpus=12,threads=1,free=118232280,total=534249472
   [junit4]   2> NOTE: All tests run in this JVM: [TestRandomDVFaceting, AddSchemaFieldsUpdateProcessorFactoryTest, TestConfig, DistribJoinFromCollectionTest, TestDocumentBuilder, TestSimpleTrackingShardHandler, IndexBasedSpellCheckerTest, TestReplicationHandler, SignatureUpdateProcessorFactoryTest, InfoHandlerTest, DistributedFacetPivotLongTailTest, DocValuesMissingTest, TestBadConfig, URLClassifyProcessorTest, PeerSyncTest, TestArbitraryIndexDir, AnalyticsMergeStrategyTest, ClusterStateTest, TestDynamicFieldResource, OverseerRolesTest, TestDistributedSearch, TestSimpleQParserPlugin, TermsComponentTest, LeaderFailoverAfterPartitionTest, AddBlockUpdateTest, RecoveryAfterSoftCommitTest, TestManagedSynonymFilterFactory, TestRealTimeGet, TestImplicitCoreProperties, TestQuerySenderListener, UUIDFieldTest, TestSolrConfigHandler, UpdateRequestProcessorFactoryTest, TestRangeQuery, ResponseHeaderTest, SolrCoreTest, DistributedQueueTest, BasicZkTest, TestMergePolicyConfig, TestUpdate, TestHdfsUpdateLog, DefaultValueUpdateProcessorTest, DateFieldTest, TestCloudSchemaless, SimpleMLTQParserTest, AnalyticsQueryTest, TimeZoneUtilsTest, ExternalFileFieldSortTest, BlockCacheTest, SolrIndexConfigTest, ExitableDirectoryReaderTest, TestSweetSpotSimilarityFactory, TestConfigReload, TestOrdValues, TestInfoStreamLogging, VMParamsZkACLAndCredentialsProvidersTest, TestSolr4Spatial, TestDistribDocBasedVersion, TestFieldTypeCollectionResource, TestJoin, DistributedFacetPivotLargeTest, IndexSchemaTest, DateRangeFieldTest, TestDFRSimilarityFactory, CoreMergeIndexesAdminHandlerTest, CloudExitableDirectoryReaderTest, TestCodecSupport, TestShardHandlerFactory, DistributedFacetPivotSmallTest, TermVectorComponentTest, SharedFSAutoReplicaFailoverTest, TestPhraseSuggestions, RequestHandlersTest, SuggesterWFSTTest, TestReversedWildcardFilterFactory, TestHighFrequencyDictionaryFactory, TestRawResponseWriter, DistribDocExpirationUpdateProcessorTest, EnumFieldTest, CollectionsAPIDistributedZkTest, FullSolrCloudDistribCmdsTest, ZkControllerTest, SpellCheckComponentTest, CurrencyFieldXmlFileTest, SimplePostToolTest, TestExtendedDismaxParser, CoreAdminHandlerTest, DocValuesTest, SpatialFilterTest, NoCacheHeaderTest, SchemaVersionSpecificBehaviorTest, DirectUpdateHandlerOptimizeTest, XsltUpdateRequestHandlerTest, StandardRequestHandlerTest, DocumentAnalysisRequestHandlerTest, XmlUpdateRequestHandlerTest, FieldAnalysisRequestHandlerTest, TestCSVResponseWriter, UniqFieldsUpdateProcessorFactoryTest, PingRequestHandlerTest, SearchHandlerTest, TestSolrIndexConfig, MultiTermTest, TestBinaryField, TestSearchPerf, OutputWriterTest, TestFuzzyAnalyzedSuggestions, TestLuceneMatchVersion, TestCharFilters, TestLMJelinekMercerSimilarityFactory, TestDefaultSimilarityFactory, TestJmxMonitoredMap, DateMathParserTest, PreAnalyzedFieldTest, TestSystemIdResolver, PrimUtilsTest, SpellingQueryConverterTest, RAMDirectoryFactoryTest, TestSolrJ, SliceStateTest, SystemInfoHandlerTest, FileUtilsTest, CursorPagingTest, TestCursorMarkWithoutUniqueKey, TestHighlightDedupGrouping, TestTolerantSearch, TestJettySolrRunner, AsyncMigrateRouteKeyTest, LeaderInitiatedRecoveryOnCommitTest, OutOfBoxZkACLAndCredentialsProvidersTest, OverriddenZkACLAndCredentialsProvidersTest, ReplicationFactorTest, TestLeaderElectionZkExpiry, TestMiniSolrCloudCluster, TriLevelCompositeIdRoutingTest, TestReloadAndDeleteDocs, TestReqParamsAPI]
   [junit4] Completed on J0 in 27.46s, 1 test, 1 failure <<< FAILURES!

[...truncated 223 lines...]
BUILD FAILED
/home/jenkins/workspace/Lucene-Solr-trunk-Linux/build.xml:519: The following error occurred while executing this line:
/home/jenkins/workspace/Lucene-Solr-trunk-Linux/build.xml:467: The following error occurred while executing this line:
/home/jenkins/workspace/Lucene-Solr-trunk-Linux/build.xml:61: The following error occurred while executing this line:
/home/jenkins/workspace/Lucene-Solr-trunk-Linux/extra-targets.xml:39: The following error occurred while executing this line:
/home/jenkins/workspace/Lucene-Solr-trunk-Linux/solr/build.xml:191: The following error occurred while executing this line:
/home/jenkins/workspace/Lucene-Solr-trunk-Linux/solr/common-build.xml:510: The following error occurred while executing this line:
/home/jenkins/workspace/Lucene-Solr-trunk-Linux/lucene/common-build.xml:1351: The following error occurred while executing this line:
/home/jenkins/workspace/Lucene-Solr-trunk-Linux/lucene/common-build.xml:958: There were test failures: 479 suites, 1901 tests, 1 failure, 48 ignored (20 assumptions)

Total time: 45 minutes 56 seconds
Build step 'Invoke Ant' marked build as failure
[description-setter] Description set: Java: 64bit/jdk1.8.0_40 -XX:+UseCompressedOops -XX:+UseParallelGC
Archiving artifacts
Recording test results
Email was triggered for: Failure - Any
Sending email for trigger: Failure - Any



Mime
View raw message