lucene-dev mailing list archives

Site index · List index
Message view « Date » · « Thread »
Top « Date » · « Thread »
From Apache Jenkins Server <jenk...@builds.apache.org>
Subject [JENKINS] Lucene-Solr-Tests-5.x-Java7 - Build # 2895 - Still Failing
Date Mon, 06 Apr 2015 00:19:53 GMT
Build: https://builds.apache.org/job/Lucene-Solr-Tests-5.x-Java7/2895/

7 tests failed.
REGRESSION:  org.apache.solr.schema.TestCloudManagedSchemaConcurrent.test

Error Message:
QUERY FAILED: xpath=/response/lst[@name='responseHeader']/int[@name='status'][.='0']  request=/schema/copyfields/?wt=xml&updateTimeoutSecs=15  response=<?xml version="1.0" encoding="UTF-8"?> <response>  <lst name="responseHeader">   <int name="status">500</int>   <int name="QTime">46117</int> </lst> <lst name="error">   <str name="msg">7 out of 8 replicas failed to update their schema to version 25 within 15 seconds! Failed cores: [http://127.0.0.1:29575/ocp/s/collection1/, http://127.0.0.1:29583/ocp/s/collection1/, http://127.0.0.1:10348/ocp/s/collection1/, http://127.0.0.1:29603/ocp/s/collection1/, http://127.0.0.1:57708/ocp/s/collection1/, http://127.0.0.1:29609/ocp/s/collection1/, http://127.0.0.1:64149/ocp/s/collection1/]</str>   <str name="trace">org.apache.solr.common.SolrException: 7 out of 8 replicas failed to update their schema to version 25 within 15 seconds! Failed cores: [http://127.0.0.1:29575/ocp/s/collection1/, http://127.0.0.1:29583/ocp/s/collection1/, http://127.0.0.1:10348/ocp/s/collection1/, http://127.0.0.1:29603/ocp/s/collection1/, http://127.0.0.1:57708/ocp/s/collection1/, http://127.0.0.1:29609/ocp/s/collection1/, http://127.0.0.1:64149/ocp/s/collection1/]  at org.apache.solr.schema.ManagedIndexSchema.waitForSchemaZkVersionAgreement(ManagedIndexSchema.java:265)  at org.apache.solr.rest.schema.BaseFieldResource.waitForSchemaUpdateToPropagate(BaseFieldResource.java:120)  at org.apache.solr.rest.schema.CopyFieldCollectionResource.post(CopyFieldCollectionResource.java:189)  at org.restlet.resource.ServerResource.doHandle(ServerResource.java:437)  at org.restlet.resource.ServerResource.doConditionalHandle(ServerResource.java:350)  at org.restlet.resource.ServerResource.handle(ServerResource.java:952)  at org.restlet.resource.Finder.handle(Finder.java:246)  at org.restlet.routing.Filter.doHandle(Filter.java:159)  at org.restlet.routing.Filter.handle(Filter.java:206)  at org.restlet.routing.Router.doHandle(Router.java:431)  at org.restlet.routing.Router.handle(Router.java:648)  at org.restlet.routing.Filter.doHandle(Filter.java:159)  at org.restlet.routing.Filter.handle(Filter.java:206)  at org.restlet.routing.Filter.doHandle(Filter.java:159)  at org.restlet.routing.Filter.handle(Filter.java:206)  at org.restlet.routing.Filter.doHandle(Filter.java:159)  at org.restlet.engine.application.StatusFilter.doHandle(StatusFilter.java:155)  at org.restlet.routing.Filter.handle(Filter.java:206)  at org.restlet.routing.Filter.doHandle(Filter.java:159)  at org.restlet.routing.Filter.handle(Filter.java:206)  at org.restlet.engine.CompositeHelper.handle(CompositeHelper.java:211)  at org.restlet.engine.application.ApplicationHelper.handle(ApplicationHelper.java:84)  at org.restlet.Application.handle(Application.java:381)  at org.restlet.routing.Filter.doHandle(Filter.java:159)  at org.restlet.routing.Filter.handle(Filter.java:206)  at org.restlet.routing.Router.doHandle(Router.java:431)  at org.restlet.routing.Router.handle(Router.java:648)  at org.restlet.routing.Filter.doHandle(Filter.java:159)  at org.restlet.routing.Filter.handle(Filter.java:206)  at org.restlet.routing.Router.doHandle(Router.java:431)  at org.restlet.routing.Router.handle(Router.java:648)  at org.restlet.routing.Filter.doHandle(Filter.java:159)  at org.restlet.routing.Filter.handle(Filter.java:206)  at org.restlet.engine.CompositeHelper.handle(CompositeHelper.java:211)  at org.restlet.Component.handle(Component.java:392)  at org.restlet.Server.handle(Server.java:516)  at org.restlet.engine.ServerHelper.handle(ServerHelper.java:72)  at org.restlet.engine.adapter.HttpServerHelper.handle(HttpServerHelper.java:152)  at org.restlet.ext.servlet.ServerServlet.service(ServerServlet.java:1089)  at javax.servlet.http.HttpServlet.service(HttpServlet.java:848)  at org.eclipse.jetty.servlet.ServletHolder.handle(ServletHolder.java:669)  at org.eclipse.jetty.servlet.ServletHandler.doHandle(ServletHandler.java:457)  at org.eclipse.jetty.server.session.SessionHandler.doHandle(SessionHandler.java:229)  at org.eclipse.jetty.server.handler.ScopedHandler.handle(ScopedHandler.java:137)  at org.eclipse.jetty.server.handler.GzipHandler.handle(GzipHandler.java:301)  at org.eclipse.jetty.server.handler.ContextHandler.doHandle(ContextHandler.java:1077)  at org.eclipse.jetty.servlet.ServletHandler.doScope(ServletHandler.java:384)  at org.eclipse.jetty.server.session.SessionHandler.doScope(SessionHandler.java:193)  at org.eclipse.jetty.server.handler.ContextHandler.doScope(ContextHandler.java:1009)  at org.eclipse.jetty.server.handler.ScopedHandler.handle(ScopedHandler.java:135)  at org.eclipse.jetty.server.Dispatcher.forward(Dispatcher.java:276)  at org.eclipse.jetty.server.Dispatcher.forward(Dispatcher.java:103)  at org.apache.solr.servlet.SolrDispatchFilter.doFilter(SolrDispatchFilter.java:395)  at org.apache.solr.servlet.SolrDispatchFilter.doFilter(SolrDispatchFilter.java:220)  at org.eclipse.jetty.servlet.ServletHandler$CachedChain.doFilter(ServletHandler.java:1419)  at org.apache.solr.client.solrj.embedded.JettySolrRunner$DebugFilter.doFilter(JettySolrRunner.java:102)  at org.eclipse.jetty.servlet.ServletHandler$CachedChain.doFilter(ServletHandler.java:1419)  at org.eclipse.jetty.servlet.ServletHandler.doHandle(ServletHandler.java:455)  at org.eclipse.jetty.server.session.SessionHandler.doHandle(SessionHandler.java:229)  at org.eclipse.jetty.server.handler.ScopedHandler.handle(ScopedHandler.java:137)  at org.eclipse.jetty.server.handler.GzipHandler.handle(GzipHandler.java:301)  at org.eclipse.jetty.server.handler.ContextHandler.doHandle(ContextHandler.java:1077)  at org.eclipse.jetty.servlet.ServletHandler.doScope(ServletHandler.java:384)  at org.eclipse.jetty.server.session.SessionHandler.doScope(SessionHandler.java:193)  at org.eclipse.jetty.server.handler.ContextHandler.doScope(ContextHandler.java:1009)  at org.eclipse.jetty.server.handler.ScopedHandler.handle(ScopedHandler.java:135)  at org.eclipse.jetty.server.handler.HandlerWrapper.handle(HandlerWrapper.java:116)  at org.eclipse.jetty.server.Server.handle(Server.java:368)  at org.eclipse.jetty.server.AbstractHttpConnection.handleRequest(AbstractHttpConnection.java:489)  at org.eclipse.jetty.server.BlockingHttpConnection.handleRequest(BlockingHttpConnection.java:53)  at org.eclipse.jetty.server.AbstractHttpConnection.content(AbstractHttpConnection.java:953)  at org.eclipse.jetty.server.AbstractHttpConnection$RequestHandler.content(AbstractHttpConnection.java:1014)  at org.eclipse.jetty.http.HttpParser.parseNext(HttpParser.java:861)  at org.eclipse.jetty.http.HttpParser.parseAvailable(HttpParser.java:240)  at org.eclipse.jetty.server.BlockingHttpConnection.handle(BlockingHttpConnection.java:72)  at org.eclipse.jetty.server.bio.SocketConnector$ConnectorEndPoint.run(SocketConnector.java:264)  at org.eclipse.jetty.util.thread.QueuedThreadPool.runJob(QueuedThreadPool.java:608)  at org.eclipse.jetty.util.thread.QueuedThreadPool$3.run(QueuedThreadPool.java:543)  at java.lang.Thread.run(Thread.java:745) </str>   <int name="code">500</int> </lst> </response> 

Stack Trace:
java.lang.AssertionError: QUERY FAILED: xpath=/response/lst[@name='responseHeader']/int[@name='status'][.='0']  request=/schema/copyfields/?wt=xml&updateTimeoutSecs=15  response=<?xml version="1.0" encoding="UTF-8"?>
<response>

<lst name="responseHeader">
  <int name="status">500</int>
  <int name="QTime">46117</int>
</lst>
<lst name="error">
  <str name="msg">7 out of 8 replicas failed to update their schema to version 25 within 15 seconds! Failed cores: [http://127.0.0.1:29575/ocp/s/collection1/, http://127.0.0.1:29583/ocp/s/collection1/, http://127.0.0.1:10348/ocp/s/collection1/, http://127.0.0.1:29603/ocp/s/collection1/, http://127.0.0.1:57708/ocp/s/collection1/, http://127.0.0.1:29609/ocp/s/collection1/, http://127.0.0.1:64149/ocp/s/collection1/]</str>
  <str name="trace">org.apache.solr.common.SolrException: 7 out of 8 replicas failed to update their schema to version 25 within 15 seconds! Failed cores: [http://127.0.0.1:29575/ocp/s/collection1/, http://127.0.0.1:29583/ocp/s/collection1/, http://127.0.0.1:10348/ocp/s/collection1/, http://127.0.0.1:29603/ocp/s/collection1/, http://127.0.0.1:57708/ocp/s/collection1/, http://127.0.0.1:29609/ocp/s/collection1/, http://127.0.0.1:64149/ocp/s/collection1/]
	at org.apache.solr.schema.ManagedIndexSchema.waitForSchemaZkVersionAgreement(ManagedIndexSchema.java:265)
	at org.apache.solr.rest.schema.BaseFieldResource.waitForSchemaUpdateToPropagate(BaseFieldResource.java:120)
	at org.apache.solr.rest.schema.CopyFieldCollectionResource.post(CopyFieldCollectionResource.java:189)
	at org.restlet.resource.ServerResource.doHandle(ServerResource.java:437)
	at org.restlet.resource.ServerResource.doConditionalHandle(ServerResource.java:350)
	at org.restlet.resource.ServerResource.handle(ServerResource.java:952)
	at org.restlet.resource.Finder.handle(Finder.java:246)
	at org.restlet.routing.Filter.doHandle(Filter.java:159)
	at org.restlet.routing.Filter.handle(Filter.java:206)
	at org.restlet.routing.Router.doHandle(Router.java:431)
	at org.restlet.routing.Router.handle(Router.java:648)
	at org.restlet.routing.Filter.doHandle(Filter.java:159)
	at org.restlet.routing.Filter.handle(Filter.java:206)
	at org.restlet.routing.Filter.doHandle(Filter.java:159)
	at org.restlet.routing.Filter.handle(Filter.java:206)
	at org.restlet.routing.Filter.doHandle(Filter.java:159)
	at org.restlet.engine.application.StatusFilter.doHandle(StatusFilter.java:155)
	at org.restlet.routing.Filter.handle(Filter.java:206)
	at org.restlet.routing.Filter.doHandle(Filter.java:159)
	at org.restlet.routing.Filter.handle(Filter.java:206)
	at org.restlet.engine.CompositeHelper.handle(CompositeHelper.java:211)
	at org.restlet.engine.application.ApplicationHelper.handle(ApplicationHelper.java:84)
	at org.restlet.Application.handle(Application.java:381)
	at org.restlet.routing.Filter.doHandle(Filter.java:159)
	at org.restlet.routing.Filter.handle(Filter.java:206)
	at org.restlet.routing.Router.doHandle(Router.java:431)
	at org.restlet.routing.Router.handle(Router.java:648)
	at org.restlet.routing.Filter.doHandle(Filter.java:159)
	at org.restlet.routing.Filter.handle(Filter.java:206)
	at org.restlet.routing.Router.doHandle(Router.java:431)
	at org.restlet.routing.Router.handle(Router.java:648)
	at org.restlet.routing.Filter.doHandle(Filter.java:159)
	at org.restlet.routing.Filter.handle(Filter.java:206)
	at org.restlet.engine.CompositeHelper.handle(CompositeHelper.java:211)
	at org.restlet.Component.handle(Component.java:392)
	at org.restlet.Server.handle(Server.java:516)
	at org.restlet.engine.ServerHelper.handle(ServerHelper.java:72)
	at org.restlet.engine.adapter.HttpServerHelper.handle(HttpServerHelper.java:152)
	at org.restlet.ext.servlet.ServerServlet.service(ServerServlet.java:1089)
	at javax.servlet.http.HttpServlet.service(HttpServlet.java:848)
	at org.eclipse.jetty.servlet.ServletHolder.handle(ServletHolder.java:669)
	at org.eclipse.jetty.servlet.ServletHandler.doHandle(ServletHandler.java:457)
	at org.eclipse.jetty.server.session.SessionHandler.doHandle(SessionHandler.java:229)
	at org.eclipse.jetty.server.handler.ScopedHandler.handle(ScopedHandler.java:137)
	at org.eclipse.jetty.server.handler.GzipHandler.handle(GzipHandler.java:301)
	at org.eclipse.jetty.server.handler.ContextHandler.doHandle(ContextHandler.java:1077)
	at org.eclipse.jetty.servlet.ServletHandler.doScope(ServletHandler.java:384)
	at org.eclipse.jetty.server.session.SessionHandler.doScope(SessionHandler.java:193)
	at org.eclipse.jetty.server.handler.ContextHandler.doScope(ContextHandler.java:1009)
	at org.eclipse.jetty.server.handler.ScopedHandler.handle(ScopedHandler.java:135)
	at org.eclipse.jetty.server.Dispatcher.forward(Dispatcher.java:276)
	at org.eclipse.jetty.server.Dispatcher.forward(Dispatcher.java:103)
	at org.apache.solr.servlet.SolrDispatchFilter.doFilter(SolrDispatchFilter.java:395)
	at org.apache.solr.servlet.SolrDispatchFilter.doFilter(SolrDispatchFilter.java:220)
	at org.eclipse.jetty.servlet.ServletHandler$CachedChain.doFilter(ServletHandler.java:1419)
	at org.apache.solr.client.solrj.embedded.JettySolrRunner$DebugFilter.doFilter(JettySolrRunner.java:102)
	at org.eclipse.jetty.servlet.ServletHandler$CachedChain.doFilter(ServletHandler.java:1419)
	at org.eclipse.jetty.servlet.ServletHandler.doHandle(ServletHandler.java:455)
	at org.eclipse.jetty.server.session.SessionHandler.doHandle(SessionHandler.java:229)
	at org.eclipse.jetty.server.handler.ScopedHandler.handle(ScopedHandler.java:137)
	at org.eclipse.jetty.server.handler.GzipHandler.handle(GzipHandler.java:301)
	at org.eclipse.jetty.server.handler.ContextHandler.doHandle(ContextHandler.java:1077)
	at org.eclipse.jetty.servlet.ServletHandler.doScope(ServletHandler.java:384)
	at org.eclipse.jetty.server.session.SessionHandler.doScope(SessionHandler.java:193)
	at org.eclipse.jetty.server.handler.ContextHandler.doScope(ContextHandler.java:1009)
	at org.eclipse.jetty.server.handler.ScopedHandler.handle(ScopedHandler.java:135)
	at org.eclipse.jetty.server.handler.HandlerWrapper.handle(HandlerWrapper.java:116)
	at org.eclipse.jetty.server.Server.handle(Server.java:368)
	at org.eclipse.jetty.server.AbstractHttpConnection.handleRequest(AbstractHttpConnection.java:489)
	at org.eclipse.jetty.server.BlockingHttpConnection.handleRequest(BlockingHttpConnection.java:53)
	at org.eclipse.jetty.server.AbstractHttpConnection.content(AbstractHttpConnection.java:953)
	at org.eclipse.jetty.server.AbstractHttpConnection$RequestHandler.content(AbstractHttpConnection.java:1014)
	at org.eclipse.jetty.http.HttpParser.parseNext(HttpParser.java:861)
	at org.eclipse.jetty.http.HttpParser.parseAvailable(HttpParser.java:240)
	at org.eclipse.jetty.server.BlockingHttpConnection.handle(BlockingHttpConnection.java:72)
	at org.eclipse.jetty.server.bio.SocketConnector$ConnectorEndPoint.run(SocketConnector.java:264)
	at org.eclipse.jetty.util.thread.QueuedThreadPool.runJob(QueuedThreadPool.java:608)
	at org.eclipse.jetty.util.thread.QueuedThreadPool$3.run(QueuedThreadPool.java:543)
	at java.lang.Thread.run(Thread.java:745)
</str>
  <int name="code">500</int>
</lst>
</response>

	at __randomizedtesting.SeedInfo.seed([932E7C58AD80ADA2:1B7A4382037CC05A]:0)
	at org.junit.Assert.fail(Assert.java:93)
	at org.apache.solr.schema.TestCloudManagedSchemaConcurrent.verifySuccess(TestCloudManagedSchemaConcurrent.java:107)
	at org.apache.solr.schema.TestCloudManagedSchemaConcurrent.copyField(TestCloudManagedSchemaConcurrent.java:153)
	at org.apache.solr.schema.TestCloudManagedSchemaConcurrent.access$500(TestCloudManagedSchemaConcurrent.java:45)
	at org.apache.solr.schema.TestCloudManagedSchemaConcurrent$Operation$5.execute(TestCloudManagedSchemaConcurrent.java:320)
	at org.apache.solr.schema.TestCloudManagedSchemaConcurrent.concurrentOperationsTest(TestCloudManagedSchemaConcurrent.java:450)
	at org.apache.solr.schema.TestCloudManagedSchemaConcurrent.test(TestCloudManagedSchemaConcurrent.java:252)
	at sun.reflect.NativeMethodAccessorImpl.invoke0(Native Method)
	at sun.reflect.NativeMethodAccessorImpl.invoke(NativeMethodAccessorImpl.java:57)
	at sun.reflect.DelegatingMethodAccessorImpl.invoke(DelegatingMethodAccessorImpl.java:43)
	at java.lang.reflect.Method.invoke(Method.java:606)
	at com.carrotsearch.randomizedtesting.RandomizedRunner.invoke(RandomizedRunner.java:1627)
	at com.carrotsearch.randomizedtesting.RandomizedRunner$6.evaluate(RandomizedRunner.java:836)
	at com.carrotsearch.randomizedtesting.RandomizedRunner$7.evaluate(RandomizedRunner.java:872)
	at com.carrotsearch.randomizedtesting.RandomizedRunner$8.evaluate(RandomizedRunner.java:886)
	at org.apache.solr.BaseDistributedSearchTestCase$ShardsRepeatRule$ShardsFixedStatement.callStatement(BaseDistributedSearchTestCase.java:960)
	at org.apache.solr.BaseDistributedSearchTestCase$ShardsRepeatRule$ShardsStatement.evaluate(BaseDistributedSearchTestCase.java:935)
	at com.carrotsearch.randomizedtesting.rules.SystemPropertiesRestoreRule$1.evaluate(SystemPropertiesRestoreRule.java:53)
	at org.apache.lucene.util.TestRuleSetupTeardownChained$1.evaluate(TestRuleSetupTeardownChained.java:50)
	at org.apache.lucene.util.AbstractBeforeAfterRule$1.evaluate(AbstractBeforeAfterRule.java:46)
	at org.apache.lucene.util.TestRuleThreadAndTestName$1.evaluate(TestRuleThreadAndTestName.java:49)
	at org.apache.lucene.util.TestRuleIgnoreAfterMaxFailures$1.evaluate(TestRuleIgnoreAfterMaxFailures.java:65)
	at org.apache.lucene.util.TestRuleMarkFailure$1.evaluate(TestRuleMarkFailure.java:48)
	at com.carrotsearch.randomizedtesting.rules.StatementAdapter.evaluate(StatementAdapter.java:36)
	at com.carrotsearch.randomizedtesting.ThreadLeakControl$StatementRunner.run(ThreadLeakControl.java:365)
	at com.carrotsearch.randomizedtesting.ThreadLeakControl.forkTimeoutingTask(ThreadLeakControl.java:798)
	at com.carrotsearch.randomizedtesting.ThreadLeakControl$3.evaluate(ThreadLeakControl.java:458)
	at com.carrotsearch.randomizedtesting.RandomizedRunner.runSingleTest(RandomizedRunner.java:845)
	at com.carrotsearch.randomizedtesting.RandomizedRunner$3.evaluate(RandomizedRunner.java:747)
	at com.carrotsearch.randomizedtesting.RandomizedRunner$4.evaluate(RandomizedRunner.java:781)
	at com.carrotsearch.randomizedtesting.RandomizedRunner$5.evaluate(RandomizedRunner.java:792)
	at com.carrotsearch.randomizedtesting.rules.StatementAdapter.evaluate(StatementAdapter.java:36)
	at com.carrotsearch.randomizedtesting.rules.SystemPropertiesRestoreRule$1.evaluate(SystemPropertiesRestoreRule.java:53)
	at org.apache.lucene.util.AbstractBeforeAfterRule$1.evaluate(AbstractBeforeAfterRule.java:46)
	at com.carrotsearch.randomizedtesting.rules.StatementAdapter.evaluate(StatementAdapter.java:36)
	at org.apache.lucene.util.TestRuleStoreClassName$1.evaluate(TestRuleStoreClassName.java:42)
	at com.carrotsearch.randomizedtesting.rules.NoShadowingOrOverridesOnMethodsRule$1.evaluate(NoShadowingOrOverridesOnMethodsRule.java:39)
	at com.carrotsearch.randomizedtesting.rules.NoShadowingOrOverridesOnMethodsRule$1.evaluate(NoShadowingOrOverridesOnMethodsRule.java:39)
	at com.carrotsearch.randomizedtesting.rules.StatementAdapter.evaluate(StatementAdapter.java:36)
	at com.carrotsearch.randomizedtesting.rules.StatementAdapter.evaluate(StatementAdapter.java:36)
	at com.carrotsearch.randomizedtesting.rules.StatementAdapter.evaluate(StatementAdapter.java:36)
	at org.apache.lucene.util.TestRuleAssertionsRequired$1.evaluate(TestRuleAssertionsRequired.java:54)
	at org.apache.lucene.util.TestRuleMarkFailure$1.evaluate(TestRuleMarkFailure.java:48)
	at org.apache.lucene.util.TestRuleIgnoreAfterMaxFailures$1.evaluate(TestRuleIgnoreAfterMaxFailures.java:65)
	at org.apache.lucene.util.TestRuleIgnoreTestSuites$1.evaluate(TestRuleIgnoreTestSuites.java:55)
	at com.carrotsearch.randomizedtesting.rules.StatementAdapter.evaluate(StatementAdapter.java:36)
	at com.carrotsearch.randomizedtesting.ThreadLeakControl$StatementRunner.run(ThreadLeakControl.java:365)
	at java.lang.Thread.run(Thread.java:745)


FAILED:  junit.framework.TestSuite.org.apache.solr.update.SoftAutoCommitTest

Error Message:
Some resources were not closed, shutdown, or released.

Stack Trace:
java.lang.AssertionError: Some resources were not closed, shutdown, or released.
	at __randomizedtesting.SeedInfo.seed([932E7C58AD80ADA2]:0)
	at org.junit.Assert.fail(Assert.java:93)
	at org.junit.Assert.assertTrue(Assert.java:43)
	at org.apache.solr.SolrTestCaseJ4.afterClass(SolrTestCaseJ4.java:234)
	at sun.reflect.NativeMethodAccessorImpl.invoke0(Native Method)
	at sun.reflect.NativeMethodAccessorImpl.invoke(NativeMethodAccessorImpl.java:57)
	at sun.reflect.DelegatingMethodAccessorImpl.invoke(DelegatingMethodAccessorImpl.java:43)
	at java.lang.reflect.Method.invoke(Method.java:606)
	at com.carrotsearch.randomizedtesting.RandomizedRunner.invoke(RandomizedRunner.java:1627)
	at com.carrotsearch.randomizedtesting.RandomizedRunner$5.evaluate(RandomizedRunner.java:799)
	at com.carrotsearch.randomizedtesting.rules.StatementAdapter.evaluate(StatementAdapter.java:36)
	at com.carrotsearch.randomizedtesting.rules.SystemPropertiesRestoreRule$1.evaluate(SystemPropertiesRestoreRule.java:53)
	at org.apache.lucene.util.AbstractBeforeAfterRule$1.evaluate(AbstractBeforeAfterRule.java:46)
	at com.carrotsearch.randomizedtesting.rules.StatementAdapter.evaluate(StatementAdapter.java:36)
	at org.apache.lucene.util.TestRuleStoreClassName$1.evaluate(TestRuleStoreClassName.java:42)
	at com.carrotsearch.randomizedtesting.rules.NoShadowingOrOverridesOnMethodsRule$1.evaluate(NoShadowingOrOverridesOnMethodsRule.java:39)
	at com.carrotsearch.randomizedtesting.rules.NoShadowingOrOverridesOnMethodsRule$1.evaluate(NoShadowingOrOverridesOnMethodsRule.java:39)
	at com.carrotsearch.randomizedtesting.rules.StatementAdapter.evaluate(StatementAdapter.java:36)
	at com.carrotsearch.randomizedtesting.rules.StatementAdapter.evaluate(StatementAdapter.java:36)
	at com.carrotsearch.randomizedtesting.rules.StatementAdapter.evaluate(StatementAdapter.java:36)
	at org.apache.lucene.util.TestRuleAssertionsRequired$1.evaluate(TestRuleAssertionsRequired.java:54)
	at org.apache.lucene.util.TestRuleMarkFailure$1.evaluate(TestRuleMarkFailure.java:48)
	at org.apache.lucene.util.TestRuleIgnoreAfterMaxFailures$1.evaluate(TestRuleIgnoreAfterMaxFailures.java:65)
	at org.apache.lucene.util.TestRuleIgnoreTestSuites$1.evaluate(TestRuleIgnoreTestSuites.java:55)
	at com.carrotsearch.randomizedtesting.rules.StatementAdapter.evaluate(StatementAdapter.java:36)
	at com.carrotsearch.randomizedtesting.ThreadLeakControl$StatementRunner.run(ThreadLeakControl.java:365)
	at java.lang.Thread.run(Thread.java:745)


REGRESSION:  org.apache.solr.update.processor.TestNamedUpdateProcessors.test

Error Message:
Error from server at http://127.0.0.1:29369: Expected mime type application/octet-stream but got text/html. <html> <head> <meta http-equiv="Content-Type" content="text/html;charset=ISO-8859-1"/> <title>Error 404 Can not find: /admin/collections</title> </head> <body> <h2>HTTP ERROR: 404</h2> <p>Problem accessing /admin/collections. Reason: <pre>    Can not find: /admin/collections</pre></p> <hr /><i><small>Powered by Jetty://</small></i>                                                                                                                                                                                                                                                                                                                                                                                                                                                                                                                                                                                                                                                                                                                                                                                                                                                                                                                                                                                                                     </body> </html> 

Stack Trace:
org.apache.solr.client.solrj.impl.HttpSolrClient$RemoteSolrException: Error from server at http://127.0.0.1:29369: Expected mime type application/octet-stream but got text/html. <html>
<head>
<meta http-equiv="Content-Type" content="text/html;charset=ISO-8859-1"/>
<title>Error 404 Can not find: /admin/collections</title>
</head>
<body>
<h2>HTTP ERROR: 404</h2>
<p>Problem accessing /admin/collections. Reason:
<pre>    Can not find: /admin/collections</pre></p>
<hr /><i><small>Powered by Jetty://</small></i>
                                                
                                                
                                                
                                                
                                                
                                                
                                                
                                                
                                                
                                                
                                                
                                                
                                                
                                                
                                                
                                                
                                                
                                                
                                                
                                                
</body>
</html>

	at __randomizedtesting.SeedInfo.seed([932E7C58AD80ADA2:1B7A4382037CC05A]:0)
	at org.apache.solr.client.solrj.impl.HttpSolrClient.executeMethod(HttpSolrClient.java:525)
	at org.apache.solr.client.solrj.impl.HttpSolrClient.request(HttpSolrClient.java:233)
	at org.apache.solr.client.solrj.impl.HttpSolrClient.request(HttpSolrClient.java:225)
	at org.apache.solr.client.solrj.SolrRequest.process(SolrRequest.java:135)
	at org.apache.solr.client.solrj.SolrRequest.process(SolrRequest.java:152)
	at org.apache.solr.handler.TestBlobHandler.createSystemCollection(TestBlobHandler.java:112)
	at org.apache.solr.update.processor.TestNamedUpdateProcessors.test(TestNamedUpdateProcessors.java:86)
	at sun.reflect.NativeMethodAccessorImpl.invoke0(Native Method)
	at sun.reflect.NativeMethodAccessorImpl.invoke(NativeMethodAccessorImpl.java:57)
	at sun.reflect.DelegatingMethodAccessorImpl.invoke(DelegatingMethodAccessorImpl.java:43)
	at java.lang.reflect.Method.invoke(Method.java:606)
	at com.carrotsearch.randomizedtesting.RandomizedRunner.invoke(RandomizedRunner.java:1627)
	at com.carrotsearch.randomizedtesting.RandomizedRunner$6.evaluate(RandomizedRunner.java:836)
	at com.carrotsearch.randomizedtesting.RandomizedRunner$7.evaluate(RandomizedRunner.java:872)
	at com.carrotsearch.randomizedtesting.RandomizedRunner$8.evaluate(RandomizedRunner.java:886)
	at org.apache.solr.BaseDistributedSearchTestCase$ShardsRepeatRule$ShardsFixedStatement.callStatement(BaseDistributedSearchTestCase.java:960)
	at org.apache.solr.BaseDistributedSearchTestCase$ShardsRepeatRule$ShardsStatement.evaluate(BaseDistributedSearchTestCase.java:935)
	at com.carrotsearch.randomizedtesting.rules.SystemPropertiesRestoreRule$1.evaluate(SystemPropertiesRestoreRule.java:53)
	at org.apache.lucene.util.TestRuleSetupTeardownChained$1.evaluate(TestRuleSetupTeardownChained.java:50)
	at org.apache.lucene.util.AbstractBeforeAfterRule$1.evaluate(AbstractBeforeAfterRule.java:46)
	at org.apache.lucene.util.TestRuleThreadAndTestName$1.evaluate(TestRuleThreadAndTestName.java:49)
	at org.apache.lucene.util.TestRuleIgnoreAfterMaxFailures$1.evaluate(TestRuleIgnoreAfterMaxFailures.java:65)
	at org.apache.lucene.util.TestRuleMarkFailure$1.evaluate(TestRuleMarkFailure.java:48)
	at com.carrotsearch.randomizedtesting.rules.StatementAdapter.evaluate(StatementAdapter.java:36)
	at com.carrotsearch.randomizedtesting.ThreadLeakControl$StatementRunner.run(ThreadLeakControl.java:365)
	at com.carrotsearch.randomizedtesting.ThreadLeakControl.forkTimeoutingTask(ThreadLeakControl.java:798)
	at com.carrotsearch.randomizedtesting.ThreadLeakControl$3.evaluate(ThreadLeakControl.java:458)
	at com.carrotsearch.randomizedtesting.RandomizedRunner.runSingleTest(RandomizedRunner.java:845)
	at com.carrotsearch.randomizedtesting.RandomizedRunner$3.evaluate(RandomizedRunner.java:747)
	at com.carrotsearch.randomizedtesting.RandomizedRunner$4.evaluate(RandomizedRunner.java:781)
	at com.carrotsearch.randomizedtesting.RandomizedRunner$5.evaluate(RandomizedRunner.java:792)
	at com.carrotsearch.randomizedtesting.rules.StatementAdapter.evaluate(StatementAdapter.java:36)
	at com.carrotsearch.randomizedtesting.rules.SystemPropertiesRestoreRule$1.evaluate(SystemPropertiesRestoreRule.java:53)
	at org.apache.lucene.util.AbstractBeforeAfterRule$1.evaluate(AbstractBeforeAfterRule.java:46)
	at com.carrotsearch.randomizedtesting.rules.StatementAdapter.evaluate(StatementAdapter.java:36)
	at org.apache.lucene.util.TestRuleStoreClassName$1.evaluate(TestRuleStoreClassName.java:42)
	at com.carrotsearch.randomizedtesting.rules.NoShadowingOrOverridesOnMethodsRule$1.evaluate(NoShadowingOrOverridesOnMethodsRule.java:39)
	at com.carrotsearch.randomizedtesting.rules.NoShadowingOrOverridesOnMethodsRule$1.evaluate(NoShadowingOrOverridesOnMethodsRule.java:39)
	at com.carrotsearch.randomizedtesting.rules.StatementAdapter.evaluate(StatementAdapter.java:36)
	at com.carrotsearch.randomizedtesting.rules.StatementAdapter.evaluate(StatementAdapter.java:36)
	at com.carrotsearch.randomizedtesting.rules.StatementAdapter.evaluate(StatementAdapter.java:36)
	at org.apache.lucene.util.TestRuleAssertionsRequired$1.evaluate(TestRuleAssertionsRequired.java:54)
	at org.apache.lucene.util.TestRuleMarkFailure$1.evaluate(TestRuleMarkFailure.java:48)
	at org.apache.lucene.util.TestRuleIgnoreAfterMaxFailures$1.evaluate(TestRuleIgnoreAfterMaxFailures.java:65)
	at org.apache.lucene.util.TestRuleIgnoreTestSuites$1.evaluate(TestRuleIgnoreTestSuites.java:55)
	at com.carrotsearch.randomizedtesting.rules.StatementAdapter.evaluate(StatementAdapter.java:36)
	at com.carrotsearch.randomizedtesting.ThreadLeakControl$StatementRunner.run(ThreadLeakControl.java:365)
	at java.lang.Thread.run(Thread.java:745)


FAILED:  junit.framework.TestSuite.org.apache.solr.update.processor.TestNamedUpdateProcessors

Error Message:
Some resources were not closed, shutdown, or released.

Stack Trace:
java.lang.AssertionError: Some resources were not closed, shutdown, or released.
	at __randomizedtesting.SeedInfo.seed([932E7C58AD80ADA2]:0)
	at org.junit.Assert.fail(Assert.java:93)
	at org.junit.Assert.assertTrue(Assert.java:43)
	at org.apache.solr.SolrTestCaseJ4.afterClass(SolrTestCaseJ4.java:234)
	at sun.reflect.NativeMethodAccessorImpl.invoke0(Native Method)
	at sun.reflect.NativeMethodAccessorImpl.invoke(NativeMethodAccessorImpl.java:57)
	at sun.reflect.DelegatingMethodAccessorImpl.invoke(DelegatingMethodAccessorImpl.java:43)
	at java.lang.reflect.Method.invoke(Method.java:606)
	at com.carrotsearch.randomizedtesting.RandomizedRunner.invoke(RandomizedRunner.java:1627)
	at com.carrotsearch.randomizedtesting.RandomizedRunner$5.evaluate(RandomizedRunner.java:799)
	at com.carrotsearch.randomizedtesting.rules.StatementAdapter.evaluate(StatementAdapter.java:36)
	at com.carrotsearch.randomizedtesting.rules.SystemPropertiesRestoreRule$1.evaluate(SystemPropertiesRestoreRule.java:53)
	at org.apache.lucene.util.AbstractBeforeAfterRule$1.evaluate(AbstractBeforeAfterRule.java:46)
	at com.carrotsearch.randomizedtesting.rules.StatementAdapter.evaluate(StatementAdapter.java:36)
	at org.apache.lucene.util.TestRuleStoreClassName$1.evaluate(TestRuleStoreClassName.java:42)
	at com.carrotsearch.randomizedtesting.rules.NoShadowingOrOverridesOnMethodsRule$1.evaluate(NoShadowingOrOverridesOnMethodsRule.java:39)
	at com.carrotsearch.randomizedtesting.rules.NoShadowingOrOverridesOnMethodsRule$1.evaluate(NoShadowingOrOverridesOnMethodsRule.java:39)
	at com.carrotsearch.randomizedtesting.rules.StatementAdapter.evaluate(StatementAdapter.java:36)
	at com.carrotsearch.randomizedtesting.rules.StatementAdapter.evaluate(StatementAdapter.java:36)
	at com.carrotsearch.randomizedtesting.rules.StatementAdapter.evaluate(StatementAdapter.java:36)
	at org.apache.lucene.util.TestRuleAssertionsRequired$1.evaluate(TestRuleAssertionsRequired.java:54)
	at org.apache.lucene.util.TestRuleMarkFailure$1.evaluate(TestRuleMarkFailure.java:48)
	at org.apache.lucene.util.TestRuleIgnoreAfterMaxFailures$1.evaluate(TestRuleIgnoreAfterMaxFailures.java:65)
	at org.apache.lucene.util.TestRuleIgnoreTestSuites$1.evaluate(TestRuleIgnoreTestSuites.java:55)
	at com.carrotsearch.randomizedtesting.rules.StatementAdapter.evaluate(StatementAdapter.java:36)
	at com.carrotsearch.randomizedtesting.ThreadLeakControl$StatementRunner.run(ThreadLeakControl.java:365)
	at java.lang.Thread.run(Thread.java:745)


FAILED:  org.apache.solr.cloud.LeaderInitiatedRecoveryOnCommitTest.test

Error Message:
IOException occured when talking to server at: http://127.0.0.1:33528/c8n_1x3_commits_shard1_replica3

Stack Trace:
org.apache.solr.client.solrj.SolrServerException: IOException occured when talking to server at: http://127.0.0.1:33528/c8n_1x3_commits_shard1_replica3
	at __randomizedtesting.SeedInfo.seed([932E7C58AD80ADA2:1B7A4382037CC05A]:0)
	at org.apache.solr.client.solrj.impl.HttpSolrClient.executeMethod(HttpSolrClient.java:570)
	at org.apache.solr.client.solrj.impl.HttpSolrClient.request(HttpSolrClient.java:233)
	at org.apache.solr.client.solrj.impl.HttpSolrClient.request(HttpSolrClient.java:225)
	at org.apache.solr.client.solrj.SolrRequest.process(SolrRequest.java:135)
	at org.apache.solr.client.solrj.SolrClient.commit(SolrClient.java:483)
	at org.apache.solr.client.solrj.SolrClient.commit(SolrClient.java:464)
	at org.apache.solr.cloud.LeaderInitiatedRecoveryOnCommitTest.oneShardTest(LeaderInitiatedRecoveryOnCommitTest.java:132)
	at org.apache.solr.cloud.LeaderInitiatedRecoveryOnCommitTest.test(LeaderInitiatedRecoveryOnCommitTest.java:64)
	at sun.reflect.NativeMethodAccessorImpl.invoke0(Native Method)
	at sun.reflect.NativeMethodAccessorImpl.invoke(NativeMethodAccessorImpl.java:57)
	at sun.reflect.DelegatingMethodAccessorImpl.invoke(DelegatingMethodAccessorImpl.java:43)
	at java.lang.reflect.Method.invoke(Method.java:606)
	at com.carrotsearch.randomizedtesting.RandomizedRunner.invoke(RandomizedRunner.java:1627)
	at com.carrotsearch.randomizedtesting.RandomizedRunner$6.evaluate(RandomizedRunner.java:836)
	at com.carrotsearch.randomizedtesting.RandomizedRunner$7.evaluate(RandomizedRunner.java:872)
	at com.carrotsearch.randomizedtesting.RandomizedRunner$8.evaluate(RandomizedRunner.java:886)
	at org.apache.solr.BaseDistributedSearchTestCase$ShardsRepeatRule$ShardsFixedStatement.callStatement(BaseDistributedSearchTestCase.java:960)
	at org.apache.solr.BaseDistributedSearchTestCase$ShardsRepeatRule$ShardsStatement.evaluate(BaseDistributedSearchTestCase.java:935)
	at com.carrotsearch.randomizedtesting.rules.SystemPropertiesRestoreRule$1.evaluate(SystemPropertiesRestoreRule.java:53)
	at org.apache.lucene.util.TestRuleSetupTeardownChained$1.evaluate(TestRuleSetupTeardownChained.java:50)
	at org.apache.lucene.util.AbstractBeforeAfterRule$1.evaluate(AbstractBeforeAfterRule.java:46)
	at org.apache.lucene.util.TestRuleThreadAndTestName$1.evaluate(TestRuleThreadAndTestName.java:49)
	at org.apache.lucene.util.TestRuleIgnoreAfterMaxFailures$1.evaluate(TestRuleIgnoreAfterMaxFailures.java:65)
	at org.apache.lucene.util.TestRuleMarkFailure$1.evaluate(TestRuleMarkFailure.java:48)
	at com.carrotsearch.randomizedtesting.rules.StatementAdapter.evaluate(StatementAdapter.java:36)
	at com.carrotsearch.randomizedtesting.ThreadLeakControl$StatementRunner.run(ThreadLeakControl.java:365)
	at com.carrotsearch.randomizedtesting.ThreadLeakControl.forkTimeoutingTask(ThreadLeakControl.java:798)
	at com.carrotsearch.randomizedtesting.ThreadLeakControl$3.evaluate(ThreadLeakControl.java:458)
	at com.carrotsearch.randomizedtesting.RandomizedRunner.runSingleTest(RandomizedRunner.java:845)
	at com.carrotsearch.randomizedtesting.RandomizedRunner$3.evaluate(RandomizedRunner.java:747)
	at com.carrotsearch.randomizedtesting.RandomizedRunner$4.evaluate(RandomizedRunner.java:781)
	at com.carrotsearch.randomizedtesting.RandomizedRunner$5.evaluate(RandomizedRunner.java:792)
	at com.carrotsearch.randomizedtesting.rules.StatementAdapter.evaluate(StatementAdapter.java:36)
	at com.carrotsearch.randomizedtesting.rules.SystemPropertiesRestoreRule$1.evaluate(SystemPropertiesRestoreRule.java:53)
	at org.apache.lucene.util.AbstractBeforeAfterRule$1.evaluate(AbstractBeforeAfterRule.java:46)
	at com.carrotsearch.randomizedtesting.rules.StatementAdapter.evaluate(StatementAdapter.java:36)
	at org.apache.lucene.util.TestRuleStoreClassName$1.evaluate(TestRuleStoreClassName.java:42)
	at com.carrotsearch.randomizedtesting.rules.NoShadowingOrOverridesOnMethodsRule$1.evaluate(NoShadowingOrOverridesOnMethodsRule.java:39)
	at com.carrotsearch.randomizedtesting.rules.NoShadowingOrOverridesOnMethodsRule$1.evaluate(NoShadowingOrOverridesOnMethodsRule.java:39)
	at com.carrotsearch.randomizedtesting.rules.StatementAdapter.evaluate(StatementAdapter.java:36)
	at com.carrotsearch.randomizedtesting.rules.StatementAdapter.evaluate(StatementAdapter.java:36)
	at com.carrotsearch.randomizedtesting.rules.StatementAdapter.evaluate(StatementAdapter.java:36)
	at org.apache.lucene.util.TestRuleAssertionsRequired$1.evaluate(TestRuleAssertionsRequired.java:54)
	at org.apache.lucene.util.TestRuleMarkFailure$1.evaluate(TestRuleMarkFailure.java:48)
	at org.apache.lucene.util.TestRuleIgnoreAfterMaxFailures$1.evaluate(TestRuleIgnoreAfterMaxFailures.java:65)
	at org.apache.lucene.util.TestRuleIgnoreTestSuites$1.evaluate(TestRuleIgnoreTestSuites.java:55)
	at com.carrotsearch.randomizedtesting.rules.StatementAdapter.evaluate(StatementAdapter.java:36)
	at com.carrotsearch.randomizedtesting.ThreadLeakControl$StatementRunner.run(ThreadLeakControl.java:365)
	at java.lang.Thread.run(Thread.java:745)
Caused by: org.apache.http.NoHttpResponseException: 127.0.0.1:33528 failed to respond
	at org.apache.http.impl.conn.DefaultHttpResponseParser.parseHead(DefaultHttpResponseParser.java:143)
	at org.apache.http.impl.conn.DefaultHttpResponseParser.parseHead(DefaultHttpResponseParser.java:57)
	at org.apache.http.impl.io.AbstractMessageParser.parse(AbstractMessageParser.java:261)
	at org.apache.http.impl.AbstractHttpClientConnection.receiveResponseHeader(AbstractHttpClientConnection.java:283)
	at org.apache.http.impl.conn.DefaultClientConnection.receiveResponseHeader(DefaultClientConnection.java:251)
	at org.apache.http.impl.conn.ManagedClientConnectionImpl.receiveResponseHeader(ManagedClientConnectionImpl.java:197)
	at org.apache.http.protocol.HttpRequestExecutor.doReceiveResponse(HttpRequestExecutor.java:272)
	at org.apache.http.protocol.HttpRequestExecutor.execute(HttpRequestExecutor.java:124)
	at org.apache.http.impl.client.DefaultRequestDirector.tryExecute(DefaultRequestDirector.java:685)
	at org.apache.http.impl.client.DefaultRequestDirector.execute(DefaultRequestDirector.java:487)
	at org.apache.http.impl.client.AbstractHttpClient.doExecute(AbstractHttpClient.java:882)
	at org.apache.http.impl.client.CloseableHttpClient.execute(CloseableHttpClient.java:82)
	at org.apache.http.impl.client.CloseableHttpClient.execute(CloseableHttpClient.java:107)
	at org.apache.http.impl.client.CloseableHttpClient.execute(CloseableHttpClient.java:55)
	at org.apache.solr.client.solrj.impl.HttpSolrClient.executeMethod(HttpSolrClient.java:462)
	... 48 more


FAILED:  org.apache.solr.cloud.RecoveryAfterSoftCommitTest.test

Error Message:
org.apache.http.NoHttpResponseException: 127.0.0.1:41489 failed to respond

Stack Trace:
org.apache.solr.client.solrj.SolrServerException: org.apache.http.NoHttpResponseException: 127.0.0.1:41489 failed to respond
	at __randomizedtesting.SeedInfo.seed([932E7C58AD80ADA2:1B7A4382037CC05A]:0)
	at org.apache.solr.client.solrj.impl.CloudSolrClient.requestWithRetryOnStaleState(CloudSolrClient.java:929)
	at org.apache.solr.client.solrj.impl.CloudSolrClient.request(CloudSolrClient.java:782)
	at org.apache.solr.client.solrj.SolrRequest.process(SolrRequest.java:135)
	at org.apache.solr.client.solrj.SolrClient.add(SolrClient.java:174)
	at org.apache.solr.client.solrj.SolrClient.add(SolrClient.java:139)
	at org.apache.solr.client.solrj.SolrClient.add(SolrClient.java:153)
	at org.apache.solr.cloud.RecoveryAfterSoftCommitTest.test(RecoveryAfterSoftCommitTest.java:88)
	at sun.reflect.NativeMethodAccessorImpl.invoke0(Native Method)
	at sun.reflect.NativeMethodAccessorImpl.invoke(NativeMethodAccessorImpl.java:57)
	at sun.reflect.DelegatingMethodAccessorImpl.invoke(DelegatingMethodAccessorImpl.java:43)
	at java.lang.reflect.Method.invoke(Method.java:606)
	at com.carrotsearch.randomizedtesting.RandomizedRunner.invoke(RandomizedRunner.java:1627)
	at com.carrotsearch.randomizedtesting.RandomizedRunner$6.evaluate(RandomizedRunner.java:836)
	at com.carrotsearch.randomizedtesting.RandomizedRunner$7.evaluate(RandomizedRunner.java:872)
	at com.carrotsearch.randomizedtesting.RandomizedRunner$8.evaluate(RandomizedRunner.java:886)
	at org.apache.solr.BaseDistributedSearchTestCase$ShardsRepeatRule$ShardsFixedStatement.callStatement(BaseDistributedSearchTestCase.java:960)
	at org.apache.solr.BaseDistributedSearchTestCase$ShardsRepeatRule$ShardsStatement.evaluate(BaseDistributedSearchTestCase.java:935)
	at com.carrotsearch.randomizedtesting.rules.SystemPropertiesRestoreRule$1.evaluate(SystemPropertiesRestoreRule.java:53)
	at org.apache.lucene.util.TestRuleSetupTeardownChained$1.evaluate(TestRuleSetupTeardownChained.java:50)
	at org.apache.lucene.util.AbstractBeforeAfterRule$1.evaluate(AbstractBeforeAfterRule.java:46)
	at org.apache.lucene.util.TestRuleThreadAndTestName$1.evaluate(TestRuleThreadAndTestName.java:49)
	at org.apache.lucene.util.TestRuleIgnoreAfterMaxFailures$1.evaluate(TestRuleIgnoreAfterMaxFailures.java:65)
	at org.apache.lucene.util.TestRuleMarkFailure$1.evaluate(TestRuleMarkFailure.java:48)
	at com.carrotsearch.randomizedtesting.rules.StatementAdapter.evaluate(StatementAdapter.java:36)
	at com.carrotsearch.randomizedtesting.ThreadLeakControl$StatementRunner.run(ThreadLeakControl.java:365)
	at com.carrotsearch.randomizedtesting.ThreadLeakControl.forkTimeoutingTask(ThreadLeakControl.java:798)
	at com.carrotsearch.randomizedtesting.ThreadLeakControl$3.evaluate(ThreadLeakControl.java:458)
	at com.carrotsearch.randomizedtesting.RandomizedRunner.runSingleTest(RandomizedRunner.java:845)
	at com.carrotsearch.randomizedtesting.RandomizedRunner$3.evaluate(RandomizedRunner.java:747)
	at com.carrotsearch.randomizedtesting.RandomizedRunner$4.evaluate(RandomizedRunner.java:781)
	at com.carrotsearch.randomizedtesting.RandomizedRunner$5.evaluate(RandomizedRunner.java:792)
	at com.carrotsearch.randomizedtesting.rules.StatementAdapter.evaluate(StatementAdapter.java:36)
	at com.carrotsearch.randomizedtesting.rules.SystemPropertiesRestoreRule$1.evaluate(SystemPropertiesRestoreRule.java:53)
	at org.apache.lucene.util.AbstractBeforeAfterRule$1.evaluate(AbstractBeforeAfterRule.java:46)
	at com.carrotsearch.randomizedtesting.rules.StatementAdapter.evaluate(StatementAdapter.java:36)
	at org.apache.lucene.util.TestRuleStoreClassName$1.evaluate(TestRuleStoreClassName.java:42)
	at com.carrotsearch.randomizedtesting.rules.NoShadowingOrOverridesOnMethodsRule$1.evaluate(NoShadowingOrOverridesOnMethodsRule.java:39)
	at com.carrotsearch.randomizedtesting.rules.NoShadowingOrOverridesOnMethodsRule$1.evaluate(NoShadowingOrOverridesOnMethodsRule.java:39)
	at com.carrotsearch.randomizedtesting.rules.StatementAdapter.evaluate(StatementAdapter.java:36)
	at com.carrotsearch.randomizedtesting.rules.StatementAdapter.evaluate(StatementAdapter.java:36)
	at com.carrotsearch.randomizedtesting.rules.StatementAdapter.evaluate(StatementAdapter.java:36)
	at org.apache.lucene.util.TestRuleAssertionsRequired$1.evaluate(TestRuleAssertionsRequired.java:54)
	at org.apache.lucene.util.TestRuleMarkFailure$1.evaluate(TestRuleMarkFailure.java:48)
	at org.apache.lucene.util.TestRuleIgnoreAfterMaxFailures$1.evaluate(TestRuleIgnoreAfterMaxFailures.java:65)
	at org.apache.lucene.util.TestRuleIgnoreTestSuites$1.evaluate(TestRuleIgnoreTestSuites.java:55)
	at com.carrotsearch.randomizedtesting.rules.StatementAdapter.evaluate(StatementAdapter.java:36)
	at com.carrotsearch.randomizedtesting.ThreadLeakControl$StatementRunner.run(ThreadLeakControl.java:365)
	at java.lang.Thread.run(Thread.java:745)
Caused by: org.apache.http.NoHttpResponseException: 127.0.0.1:41489 failed to respond
	at org.apache.http.impl.conn.DefaultHttpResponseParser.parseHead(DefaultHttpResponseParser.java:143)
	at org.apache.http.impl.conn.DefaultHttpResponseParser.parseHead(DefaultHttpResponseParser.java:57)
	at org.apache.http.impl.io.AbstractMessageParser.parse(AbstractMessageParser.java:261)
	at org.apache.http.impl.AbstractHttpClientConnection.receiveResponseHeader(AbstractHttpClientConnection.java:283)
	at org.apache.http.impl.conn.DefaultClientConnection.receiveResponseHeader(DefaultClientConnection.java:251)
	at org.apache.http.impl.conn.ManagedClientConnectionImpl.receiveResponseHeader(ManagedClientConnectionImpl.java:197)
	at org.apache.http.protocol.HttpRequestExecutor.doReceiveResponse(HttpRequestExecutor.java:272)
	at org.apache.http.protocol.HttpRequestExecutor.execute(HttpRequestExecutor.java:124)
	at org.apache.http.impl.client.DefaultRequestDirector.tryExecute(DefaultRequestDirector.java:685)
	at org.apache.http.impl.client.DefaultRequestDirector.execute(DefaultRequestDirector.java:487)
	at org.apache.http.impl.client.AbstractHttpClient.doExecute(AbstractHttpClient.java:882)
	at org.apache.http.impl.client.CloseableHttpClient.execute(CloseableHttpClient.java:82)
	at org.apache.http.impl.client.CloseableHttpClient.execute(CloseableHttpClient.java:107)
	at org.apache.http.impl.client.CloseableHttpClient.execute(CloseableHttpClient.java:55)
	at org.apache.solr.client.solrj.impl.HttpSolrClient.executeMethod(HttpSolrClient.java:462)
	at org.apache.solr.client.solrj.impl.HttpSolrClient.request(HttpSolrClient.java:233)
	at org.apache.solr.client.solrj.impl.HttpSolrClient.request(HttpSolrClient.java:225)
	at org.apache.solr.client.solrj.impl.LBHttpSolrClient.doRequest(LBHttpSolrClient.java:370)
	at org.apache.solr.client.solrj.impl.LBHttpSolrClient.request(LBHttpSolrClient.java:325)
	at org.apache.solr.client.solrj.impl.CloudSolrClient$2.call(CloudSolrClient.java:596)
	at org.apache.solr.client.solrj.impl.CloudSolrClient$2.call(CloudSolrClient.java:593)
	at java.util.concurrent.FutureTask.run(FutureTask.java:262)
	at java.util.concurrent.ThreadPoolExecutor.runWorker(ThreadPoolExecutor.java:1145)
	at java.util.concurrent.ThreadPoolExecutor$Worker.run(ThreadPoolExecutor.java:615)
	... 1 more


FAILED:  org.apache.solr.cloud.ReplicationFactorTest.test

Error Message:
org.apache.http.NoHttpResponseException: 127.0.0.1:24851 failed to respond

Stack Trace:
org.apache.solr.client.solrj.SolrServerException: org.apache.http.NoHttpResponseException: 127.0.0.1:24851 failed to respond
	at __randomizedtesting.SeedInfo.seed([932E7C58AD80ADA2:1B7A4382037CC05A]:0)
	at org.apache.solr.client.solrj.impl.CloudSolrClient.requestWithRetryOnStaleState(CloudSolrClient.java:929)
	at org.apache.solr.client.solrj.impl.CloudSolrClient.request(CloudSolrClient.java:782)
	at org.apache.solr.client.solrj.SolrClient.request(SolrClient.java:1220)
	at org.apache.solr.cloud.ReplicationFactorTest.sendDoc(ReplicationFactorTest.java:308)
	at org.apache.solr.cloud.ReplicationFactorTest.testRf3(ReplicationFactorTest.java:234)
	at org.apache.solr.cloud.ReplicationFactorTest.test(ReplicationFactorTest.java:113)
	at sun.reflect.NativeMethodAccessorImpl.invoke0(Native Method)
	at sun.reflect.NativeMethodAccessorImpl.invoke(NativeMethodAccessorImpl.java:57)
	at sun.reflect.DelegatingMethodAccessorImpl.invoke(DelegatingMethodAccessorImpl.java:43)
	at java.lang.reflect.Method.invoke(Method.java:606)
	at com.carrotsearch.randomizedtesting.RandomizedRunner.invoke(RandomizedRunner.java:1627)
	at com.carrotsearch.randomizedtesting.RandomizedRunner$6.evaluate(RandomizedRunner.java:836)
	at com.carrotsearch.randomizedtesting.RandomizedRunner$7.evaluate(RandomizedRunner.java:872)
	at com.carrotsearch.randomizedtesting.RandomizedRunner$8.evaluate(RandomizedRunner.java:886)
	at org.apache.solr.BaseDistributedSearchTestCase$ShardsRepeatRule$ShardsFixedStatement.callStatement(BaseDistributedSearchTestCase.java:960)
	at org.apache.solr.BaseDistributedSearchTestCase$ShardsRepeatRule$ShardsStatement.evaluate(BaseDistributedSearchTestCase.java:935)
	at com.carrotsearch.randomizedtesting.rules.SystemPropertiesRestoreRule$1.evaluate(SystemPropertiesRestoreRule.java:53)
	at org.apache.lucene.util.TestRuleSetupTeardownChained$1.evaluate(TestRuleSetupTeardownChained.java:50)
	at org.apache.lucene.util.AbstractBeforeAfterRule$1.evaluate(AbstractBeforeAfterRule.java:46)
	at org.apache.lucene.util.TestRuleThreadAndTestName$1.evaluate(TestRuleThreadAndTestName.java:49)
	at org.apache.lucene.util.TestRuleIgnoreAfterMaxFailures$1.evaluate(TestRuleIgnoreAfterMaxFailures.java:65)
	at org.apache.lucene.util.TestRuleMarkFailure$1.evaluate(TestRuleMarkFailure.java:48)
	at com.carrotsearch.randomizedtesting.rules.StatementAdapter.evaluate(StatementAdapter.java:36)
	at com.carrotsearch.randomizedtesting.ThreadLeakControl$StatementRunner.run(ThreadLeakControl.java:365)
	at com.carrotsearch.randomizedtesting.ThreadLeakControl.forkTimeoutingTask(ThreadLeakControl.java:798)
	at com.carrotsearch.randomizedtesting.ThreadLeakControl$3.evaluate(ThreadLeakControl.java:458)
	at com.carrotsearch.randomizedtesting.RandomizedRunner.runSingleTest(RandomizedRunner.java:845)
	at com.carrotsearch.randomizedtesting.RandomizedRunner$3.evaluate(RandomizedRunner.java:747)
	at com.carrotsearch.randomizedtesting.RandomizedRunner$4.evaluate(RandomizedRunner.java:781)
	at com.carrotsearch.randomizedtesting.RandomizedRunner$5.evaluate(RandomizedRunner.java:792)
	at com.carrotsearch.randomizedtesting.rules.StatementAdapter.evaluate(StatementAdapter.java:36)
	at com.carrotsearch.randomizedtesting.rules.SystemPropertiesRestoreRule$1.evaluate(SystemPropertiesRestoreRule.java:53)
	at org.apache.lucene.util.AbstractBeforeAfterRule$1.evaluate(AbstractBeforeAfterRule.java:46)
	at com.carrotsearch.randomizedtesting.rules.StatementAdapter.evaluate(StatementAdapter.java:36)
	at org.apache.lucene.util.TestRuleStoreClassName$1.evaluate(TestRuleStoreClassName.java:42)
	at com.carrotsearch.randomizedtesting.rules.NoShadowingOrOverridesOnMethodsRule$1.evaluate(NoShadowingOrOverridesOnMethodsRule.java:39)
	at com.carrotsearch.randomizedtesting.rules.NoShadowingOrOverridesOnMethodsRule$1.evaluate(NoShadowingOrOverridesOnMethodsRule.java:39)
	at com.carrotsearch.randomizedtesting.rules.StatementAdapter.evaluate(StatementAdapter.java:36)
	at com.carrotsearch.randomizedtesting.rules.StatementAdapter.evaluate(StatementAdapter.java:36)
	at com.carrotsearch.randomizedtesting.rules.StatementAdapter.evaluate(StatementAdapter.java:36)
	at org.apache.lucene.util.TestRuleAssertionsRequired$1.evaluate(TestRuleAssertionsRequired.java:54)
	at org.apache.lucene.util.TestRuleMarkFailure$1.evaluate(TestRuleMarkFailure.java:48)
	at org.apache.lucene.util.TestRuleIgnoreAfterMaxFailures$1.evaluate(TestRuleIgnoreAfterMaxFailures.java:65)
	at org.apache.lucene.util.TestRuleIgnoreTestSuites$1.evaluate(TestRuleIgnoreTestSuites.java:55)
	at com.carrotsearch.randomizedtesting.rules.StatementAdapter.evaluate(StatementAdapter.java:36)
	at com.carrotsearch.randomizedtesting.ThreadLeakControl$StatementRunner.run(ThreadLeakControl.java:365)
	at java.lang.Thread.run(Thread.java:745)
Caused by: org.apache.http.NoHttpResponseException: 127.0.0.1:24851 failed to respond
	at org.apache.http.impl.conn.DefaultHttpResponseParser.parseHead(DefaultHttpResponseParser.java:143)
	at org.apache.http.impl.conn.DefaultHttpResponseParser.parseHead(DefaultHttpResponseParser.java:57)
	at org.apache.http.impl.io.AbstractMessageParser.parse(AbstractMessageParser.java:261)
	at org.apache.http.impl.AbstractHttpClientConnection.receiveResponseHeader(AbstractHttpClientConnection.java:283)
	at org.apache.http.impl.conn.DefaultClientConnection.receiveResponseHeader(DefaultClientConnection.java:251)
	at org.apache.http.impl.conn.ManagedClientConnectionImpl.receiveResponseHeader(ManagedClientConnectionImpl.java:197)
	at org.apache.http.protocol.HttpRequestExecutor.doReceiveResponse(HttpRequestExecutor.java:272)
	at org.apache.http.protocol.HttpRequestExecutor.execute(HttpRequestExecutor.java:124)
	at org.apache.http.impl.client.DefaultRequestDirector.tryExecute(DefaultRequestDirector.java:685)
	at org.apache.http.impl.client.DefaultRequestDirector.execute(DefaultRequestDirector.java:487)
	at org.apache.http.impl.client.AbstractHttpClient.doExecute(AbstractHttpClient.java:882)
	at org.apache.http.impl.client.CloseableHttpClient.execute(CloseableHttpClient.java:82)
	at org.apache.http.impl.client.CloseableHttpClient.execute(CloseableHttpClient.java:107)
	at org.apache.http.impl.client.CloseableHttpClient.execute(CloseableHttpClient.java:55)
	at org.apache.solr.client.solrj.impl.HttpSolrClient.executeMethod(HttpSolrClient.java:462)
	at org.apache.solr.client.solrj.impl.HttpSolrClient.request(HttpSolrClient.java:233)
	at org.apache.solr.client.solrj.impl.HttpSolrClient.request(HttpSolrClient.java:225)
	at org.apache.solr.client.solrj.impl.LBHttpSolrClient.doRequest(LBHttpSolrClient.java:370)
	at org.apache.solr.client.solrj.impl.LBHttpSolrClient.request(LBHttpSolrClient.java:325)
	at org.apache.solr.client.solrj.impl.CloudSolrClient$2.call(CloudSolrClient.java:596)
	at org.apache.solr.client.solrj.impl.CloudSolrClient$2.call(CloudSolrClient.java:593)
	at java.util.concurrent.FutureTask.run(FutureTask.java:262)
	at java.util.concurrent.ThreadPoolExecutor.runWorker(ThreadPoolExecutor.java:1145)
	at java.util.concurrent.ThreadPoolExecutor$Worker.run(ThreadPoolExecutor.java:615)
	... 1 more




Build Log:
[...truncated 9365 lines...]
   [junit4] Suite: org.apache.solr.update.SoftAutoCommitTest
   [junit4]   2> Creating dataDir: /usr/home/jenkins/jenkins-slave/workspace/Lucene-Solr-Tests-5.x-Java7/solr/build/solr-core/test/J2/temp/solr.update.SoftAutoCommitTest 932E7C58AD80ADA2-001/init-core-data-001
   [junit4]   2> 116045 T295 oas.SolrTestCaseJ4.buildSSLConfig Randomized ssl (false) and clientAuth (false)
   [junit4]   2> 116047 T295 oas.SolrTestCaseJ4.initCore ####initCore
   [junit4]   2> 116048 T295 oasc.SolrResourceLoader.<init> new SolrResourceLoader for directory: '/usr/home/jenkins/jenkins-slave/workspace/Lucene-Solr-Tests-5.x-Java7/solr/core/src/test-files/solr/collection1/'
   [junit4]   2> 116049 T295 oasc.SolrResourceLoader.replaceClassLoader Adding 'file:/usr/home/jenkins/jenkins-slave/workspace/Lucene-Solr-Tests-5.x-Java7/solr/core/src/test-files/solr/collection1/lib/classes/' to classloader
   [junit4]   2> 116051 T295 oasc.SolrResourceLoader.replaceClassLoader Adding 'file:/usr/home/jenkins/jenkins-slave/workspace/Lucene-Solr-Tests-5.x-Java7/solr/core/src/test-files/solr/collection1/lib/README' to classloader
   [junit4]   2> 116053 T295 oasc.SolrResourceLoader.replaceClassLoader Adding 'file:/usr/home/jenkins/jenkins-slave/workspace/Lucene-Solr-Tests-5.x-Java7/solr/core/src/test-files/solr/collection1/lib/.svn/' to classloader
   [junit4]   2> 116312 T295 oasc.SolrConfig.refreshRequestParams current version of requestparams : -1
   [junit4]   2> 116351 T295 oasc.SolrConfig.<init> Using Lucene MatchVersion: 5.2.0
   [junit4]   2> 116422 T295 oasc.SolrConfig.<init> Loaded SolrConfig: solrconfig.xml
   [junit4]   2> 116424 T295 oass.IndexSchema.readSchema Reading Solr Schema from /usr/home/jenkins/jenkins-slave/workspace/Lucene-Solr-Tests-5.x-Java7/solr/core/src/test-files/solr/collection1/conf/schema.xml
   [junit4]   2> 116474 T295 oass.IndexSchema.readSchema [null] Schema name=test
   [junit4]   2> 117381 T295 oass.OpenExchangeRatesOrgProvider.init Initialized with rates=open-exchange-rates.json, refreshInterval=1440.
   [junit4]   2> 117441 T295 oass.IndexSchema.readSchema default search field in schema is text
   [junit4]   2> 117447 T295 oass.IndexSchema.readSchema unique key field: id
   [junit4]   2> 117481 T295 oass.FileExchangeRateProvider.reload Reloading exchange rates from file currency.xml
   [junit4]   2> 117492 T295 oass.FileExchangeRateProvider.reload Reloading exchange rates from file currency.xml
   [junit4]   2> 117503 T295 oass.OpenExchangeRatesOrgProvider.reload Reloading exchange rates from open-exchange-rates.json
   [junit4]   2> 117506 T295 oass.OpenExchangeRatesOrgProvider$OpenExchangeRates.<init> WARN Unknown key IMPORTANT NOTE
   [junit4]   2> 117507 T295 oass.OpenExchangeRatesOrgProvider$OpenExchangeRates.<init> WARN Expected key, got STRING
   [junit4]   2> 117507 T295 oass.OpenExchangeRatesOrgProvider.reload Reloading exchange rates from open-exchange-rates.json
   [junit4]   2> 117509 T295 oass.OpenExchangeRatesOrgProvider$OpenExchangeRates.<init> WARN Unknown key IMPORTANT NOTE
   [junit4]   2> 117510 T295 oass.OpenExchangeRatesOrgProvider$OpenExchangeRates.<init> WARN Expected key, got STRING
   [junit4]   2> 117510 T295 oasc.SolrResourceLoader.locateSolrHome JNDI not configured for solr (NoInitialContextEx)
   [junit4]   2> 117511 T295 oasc.SolrResourceLoader.locateSolrHome using system property solr.solr.home: /usr/home/jenkins/jenkins-slave/workspace/Lucene-Solr-Tests-5.x-Java7/solr/core/src/test-files/solr
   [junit4]   2> 117511 T295 oasc.SolrResourceLoader.<init> new SolrResourceLoader for directory: '/usr/home/jenkins/jenkins-slave/workspace/Lucene-Solr-Tests-5.x-Java7/solr/core/src/test-files/solr/'
   [junit4]   2> 117536 T295 oasc.CoreContainer.<init> New CoreContainer 393660134
   [junit4]   2> 117536 T295 oasc.CoreContainer.load Loading cores into CoreContainer [instanceDir=/usr/home/jenkins/jenkins-slave/workspace/Lucene-Solr-Tests-5.x-Java7/solr/core/src/test-files/solr/]
   [junit4]   2> 117537 T295 oasc.CoreContainer.load loading shared library: /usr/home/jenkins/jenkins-slave/workspace/Lucene-Solr-Tests-5.x-Java7/solr/core/src/test-files/solr/lib
   [junit4]   2> 117538 T295 oasc.SolrResourceLoader.addToClassLoader WARN Can't find (or read) directory to add to classloader: lib (resolved as: /usr/home/jenkins/jenkins-slave/workspace/Lucene-Solr-Tests-5.x-Java7/solr/core/src/test-files/solr/lib).
   [junit4]   2> 117555 T295 oashc.HttpShardHandlerFactory.getParameter Setting socketTimeout to: 600000
   [junit4]   2> 117556 T295 oashc.HttpShardHandlerFactory.getParameter Setting urlScheme to: null
   [junit4]   2> 117556 T295 oashc.HttpShardHandlerFactory.getParameter Setting connTimeout to: 60000
   [junit4]   2> 117556 T295 oashc.HttpShardHandlerFactory.getParameter Setting maxConnectionsPerHost to: 20
   [junit4]   2> 117557 T295 oashc.HttpShardHandlerFactory.getParameter Setting maxConnections to: 10000
   [junit4]   2> 117557 T295 oashc.HttpShardHandlerFactory.getParameter Setting corePoolSize to: 0
   [junit4]   2> 117557 T295 oashc.HttpShardHandlerFactory.getParameter Setting maximumPoolSize to: 2147483647
   [junit4]   2> 117557 T295 oashc.HttpShardHandlerFactory.getParameter Setting maxThreadIdleTime to: 5
   [junit4]   2> 117558 T295 oashc.HttpShardHandlerFactory.getParameter Setting sizeOfQueue to: -1
   [junit4]   2> 117558 T295 oashc.HttpShardHandlerFactory.getParameter Setting fairnessPolicy to: false
   [junit4]   2> 117558 T295 oashc.HttpShardHandlerFactory.getParameter Setting useRetries to: false
   [junit4]   2> 117567 T295 oasu.UpdateShardHandler.<init> Creating UpdateShardHandler HTTP client with params: socketTimeout=30000&connTimeout=30000&retry=true
   [junit4]   2> 117568 T295 oasl.LogWatcher.createWatcher SLF4J impl is org.slf4j.impl.Log4jLoggerFactory
   [junit4]   2> 117568 T295 oasl.LogWatcher.newRegisteredLogWatcher Registering Log Listener [Log4j (org.slf4j.impl.Log4jLoggerFactory)]
   [junit4]   2> 117568 T295 oasc.CoreContainer.load Node Name: testNode
   [junit4]   2> 117571 T295 oasc.CoreDescriptor.<init> CORE DESCRIPTOR: {collection=collection1, dataDir=/usr/home/jenkins/jenkins-slave/workspace/Lucene-Solr-Tests-5.x-Java7/solr/build/solr-core/test/J2/temp/solr.update.SoftAutoCommitTest 932E7C58AD80ADA2-001/init-core-data-001, transient=false, shard=shard1, absoluteInstDir=/usr/home/jenkins/jenkins-slave/workspace/Lucene-Solr-Tests-5.x-Java7/solr/core/src/test-files/solr/collection1/, name=collection1, loadOnStartup=true, instanceDir=collection1, config=solrconfig.xml, schema=schema.xml}
   [junit4]   2> 117572 T296 oasc.SolrResourceLoader.<init> new SolrResourceLoader for directory: '/usr/home/jenkins/jenkins-slave/workspace/Lucene-Solr-Tests-5.x-Java7/solr/core/src/test-files/solr/collection1/'
   [junit4]   2> 117574 T296 oasc.SolrResourceLoader.replaceClassLoader Adding 'file:/usr/home/jenkins/jenkins-slave/workspace/Lucene-Solr-Tests-5.x-Java7/solr/core/src/test-files/solr/collection1/lib/classes/' to classloader
   [junit4]   2> 117575 T296 oasc.SolrResourceLoader.replaceClassLoader Adding 'file:/usr/home/jenkins/jenkins-slave/workspace/Lucene-Solr-Tests-5.x-Java7/solr/core/src/test-files/solr/collection1/lib/README' to classloader
   [junit4]   2> 117575 T296 oasc.SolrResourceLoader.replaceClassLoader Adding 'file:/usr/home/jenkins/jenkins-slave/workspace/Lucene-Solr-Tests-5.x-Java7/solr/core/src/test-files/solr/collection1/lib/.svn/' to classloader
   [junit4]   2> 117755 T296 oasc.SolrConfig.refreshRequestParams current version of requestparams : -1
   [junit4]   2> 117794 T296 oasc.SolrConfig.<init> Using Lucene MatchVersion: 5.2.0
   [junit4]   2> 117906 T296 oasc.SolrConfig.<init> Loaded SolrConfig: solrconfig.xml
   [junit4]   2> 117910 T296 oass.IndexSchema.readSchema Reading Solr Schema from /usr/home/jenkins/jenkins-slave/workspace/Lucene-Solr-Tests-5.x-Java7/solr/core/src/test-files/solr/collection1/conf/schema.xml
   [junit4]   2> 117935 T296 oass.IndexSchema.readSchema [collection1] Schema name=test
   [junit4]   2> 118927 T296 oass.OpenExchangeRatesOrgProvider.init Initialized with rates=open-exchange-rates.json, refreshInterval=1440.
   [junit4]   2> 118946 T296 oass.IndexSchema.readSchema default search field in schema is text
   [junit4]   2> 118948 T296 oass.IndexSchema.readSchema unique key field: id
   [junit4]   2> 118966 T296 oass.FileExchangeRateProvider.reload Reloading exchange rates from file currency.xml
   [junit4]   2> 118971 T296 oass.FileExchangeRateProvider.reload Reloading exchange rates from file currency.xml
   [junit4]   2> 118974 T296 oass.OpenExchangeRatesOrgProvider.reload Reloading exchange rates from open-exchange-rates.json
   [junit4]   2> 118975 T296 oass.OpenExchangeRatesOrgProvider$OpenExchangeRates.<init> WARN Unknown key IMPORTANT NOTE
   [junit4]   2> 118975 T296 oass.OpenExchangeRatesOrgProvider$OpenExchangeRates.<init> WARN Expected key, got STRING
   [junit4]   2> 118976 T296 oass.OpenExchangeRatesOrgProvider.reload Reloading exchange rates from open-exchange-rates.json
   [junit4]   2> 118976 T296 oass.OpenExchangeRatesOrgProvider$OpenExchangeRates.<init> WARN Unknown key IMPORTANT NOTE
   [junit4]   2> 118977 T296 oass.OpenExchangeRatesOrgProvider$OpenExchangeRates.<init> WARN Expected key, got STRING
   [junit4]   2> 118977 T296 oasc.CoreContainer.create Creating SolrCore 'collection1' using configuration from instancedir /usr/home/jenkins/jenkins-slave/workspace/Lucene-Solr-Tests-5.x-Java7/solr/core/src/test-files/solr/collection1/
   [junit4]   2> 118977 T296 c:collection1 oasc.SolrCore.initDirectoryFactory org.apache.solr.core.MockDirectoryFactory
   [junit4]   2> 118978 T296 c:collection1 oasc.SolrCore.<init> [collection1] Opening new SolrCore at /usr/home/jenkins/jenkins-slave/workspace/Lucene-Solr-Tests-5.x-Java7/solr/core/src/test-files/solr/collection1/, dataDir=/usr/home/jenkins/jenkins-slave/workspace/Lucene-Solr-Tests-5.x-Java7/solr/build/solr-core/test/J2/temp/solr.update.SoftAutoCommitTest 932E7C58AD80ADA2-001/init-core-data-001/
   [junit4]   2> 118978 T296 c:collection1 oasc.JmxMonitoredMap.<init> JMX monitoring is enabled. Adding Solr mbeans to JMX Server: com.sun.jmx.mbeanserver.JmxMBeanServer@75749e15
   [junit4]   2> 118979 T296 c:collection1 oasc.CachingDirectoryFactory.get return new directory for /usr/home/jenkins/jenkins-slave/workspace/Lucene-Solr-Tests-5.x-Java7/solr/build/solr-core/test/J2/temp/solr.update.SoftAutoCommitTest 932E7C58AD80ADA2-001/init-core-data-001
   [junit4]   2> 118980 T296 c:collection1 oasc.SolrCore.getNewIndexDir New index directory detected: old=null new=/usr/home/jenkins/jenkins-slave/workspace/Lucene-Solr-Tests-5.x-Java7/solr/build/solr-core/test/J2/temp/solr.update.SoftAutoCommitTest 932E7C58AD80ADA2-001/init-core-data-001/index/
   [junit4]   2> 118980 T296 c:collection1 oasc.SolrCore.initIndex WARN [collection1] Solr index directory '/usr/home/jenkins/jenkins-slave/workspace/Lucene-Solr-Tests-5.x-Java7/solr/build/solr-core/test/J2/temp/solr.update.SoftAutoCommitTest 932E7C58AD80ADA2-001/init-core-data-001/index' doesn't exist. Creating new index...
   [junit4]   2> 118981 T296 c:collection1 oasc.CachingDirectoryFactory.get return new directory for /usr/home/jenkins/jenkins-slave/workspace/Lucene-Solr-Tests-5.x-Java7/solr/build/solr-core/test/J2/temp/solr.update.SoftAutoCommitTest 932E7C58AD80ADA2-001/init-core-data-001/index
   [junit4]   2> 118981 T296 c:collection1 oasu.RandomMergePolicy.<init> RandomMergePolicy wrapping class org.apache.lucene.index.LogDocMergePolicy: [LogDocMergePolicy: minMergeSize=1000, mergeFactor=38, maxMergeSize=9223372036854775807, maxMergeSizeForForcedMerge=9223372036854775807, calibrateSizeByDeletes=true, maxMergeDocs=2147483647, maxCFSSegmentSizeMB=8.796093022207999E12, noCFSRatio=0.635920085406242]
   [junit4]   2> 118982 T296 c:collection1 oasc.SolrDeletionPolicy.onCommit SolrDeletionPolicy.onCommit: commits: num=1
   [junit4]   2> 		commit{dir=MockDirectoryWrapper(RAMDirectory@3808195b lockFactory=org.apache.lucene.store.SingleInstanceLockFactory@1bb8c21a),segFN=segments_1,generation=1}
   [junit4]   2> 118983 T296 c:collection1 oasc.SolrDeletionPolicy.updateCommits newest commit generation = 1
   [junit4]   2> 118992 T296 c:collection1 oasup.UpdateRequestProcessorChain.init creating updateRequestProcessorChain "dedupe"
   [junit4]   2> 118993 T296 c:collection1 oasup.UpdateRequestProcessorChain.init inserting DistributedUpdateProcessorFactory into updateRequestProcessorChain "dedupe"
   [junit4]   2> 118993 T296 c:collection1 oasup.UpdateRequestProcessorChain.init creating updateRequestProcessorChain "dedupe-allfields"
   [junit4]   2> 118994 T296 c:collection1 oasup.UpdateRequestProcessorChain.init inserting DistributedUpdateProcessorFactory into updateRequestProcessorChain "dedupe-allfields"
   [junit4]   2> 118994 T296 c:collection1 oasup.UpdateRequestProcessorChain.init creating updateRequestProcessorChain "stored_sig"
   [junit4]   2> 118994 T296 c:collection1 oasup.UpdateRequestProcessorChain.init inserting DistributedUpdateProcessorFactory into updateRequestProcessorChain "stored_sig"
   [junit4]   2> 118995 T296 c:collection1 oasup.UpdateRequestProcessorChain.init creating updateRequestProcessorChain "uniq-fields"
   [junit4]   2> 118995 T296 c:collection1 oasup.UpdateRequestProcessorChain.init inserting DistributedUpdateProcessorFactory into updateRequestProcessorChain "uniq-fields"
   [junit4]   2> 118995 T296 c:collection1 oasup.UpdateRequestProcessorChain.init creating updateRequestProcessorChain "distrib-dup-test-chain-explicit"
   [junit4]   2> 118996 T296 c:collection1 oasup.UpdateRequestProcessorChain.init creating updateRequestProcessorChain "distrib-dup-test-chain-implicit"
   [junit4]   2> 118997 T296 c:collection1 oasup.UpdateRequestProcessorChain.init inserting DistributedUpdateProcessorFactory into updateRequestProcessorChain "distrib-dup-test-chain-implicit"
   [junit4]   2> 118997 T296 c:collection1 oasc.SolrCore.loadUpdateProcessorChains no updateRequestProcessorChain defined as default, creating implicit default
   [junit4]   2> 119025 T296 c:collection1 oashl.XMLLoader.init xsltCacheLifetimeSeconds=60
   [junit4]   2> 119028 T296 c:collection1 oashl.XMLLoader.init xsltCacheLifetimeSeconds=60
   [junit4]   2> 119031 T296 c:collection1 oashl.XMLLoader.init xsltCacheLifetimeSeconds=60
   [junit4]   2> 119034 T296 c:collection1 oashl.XMLLoader.init xsltCacheLifetimeSeconds=60
   [junit4]   2> 119044 T296 c:collection1 oasc.PluginBag.createPlugin requestHandler : 'lazy' created with startup=lazy 
   [junit4]   2> 119050 T296 c:collection1 oasc.RequestHandlers.initHandlersFromConfig Registered paths: mltrh,spellCheckCompRH_Direct,standard,/admin/mbeans,/admin/system,/replication,lazy,/update/csv,/update/json,/admin/logging,/debug/dump,/search-facet-invariants,/admin/plugins,/get,/admin/ping,spellCheckWithWordbreak,/admin/segments,spellCheckCompRH1,/admin/file,/mlt,/admin/properties,spellCheckCompRH,/search-facet-def,/admin/threads,tvrh,dismax,/update,spellCheckWithWordbreak_Direct,/schema,/config,defaults,/update/json/docs,mock,/terms,/admin/luke
   [junit4]   2> 119052 T296 c:collection1 oasc.SolrCore.initDeprecatedSupport WARN solrconfig.xml uses deprecated <admin/gettableFiles>, Please update your config to use the ShowFileRequestHandler.
   [junit4]   2> 119055 T296 c:collection1 oasc.SolrCore.initStatsCache Using default statsCache cache: org.apache.solr.search.stats.LocalStatsCache
   [junit4]   2> 119059 T296 c:collection1 oasu.UpdateHandler.<init> Using UpdateLog implementation: org.apache.solr.update.UpdateLog
   [junit4]   2> 119060 T296 c:collection1 oasu.UpdateLog.init Initializing UpdateLog: dataDir= defaultSyncLevel=FLUSH numRecordsToKeep=100 maxNumLogsToKeep=10
   [junit4]   2> 119061 T296 c:collection1 oasu.CommitTracker.<init> Hard AutoCommit: disabled
   [junit4]   2> 119061 T296 c:collection1 oasu.CommitTracker.<init> Soft AutoCommit: disabled
   [junit4]   2> 119062 T296 c:collection1 oasu.RandomMergePolicy.<init> RandomMergePolicy wrapping class org.apache.lucene.index.MockRandomMergePolicy: org.apache.lucene.index.MockRandomMergePolicy@2d7292af
   [junit4]   2> 119063 T296 c:collection1 oasc.SolrDeletionPolicy.onInit SolrDeletionPolicy.onInit: commits: num=1
   [junit4]   2> 		commit{dir=MockDirectoryWrapper(RAMDirectory@3808195b lockFactory=org.apache.lucene.store.SingleInstanceLockFactory@1bb8c21a),segFN=segments_1,generation=1}
   [junit4]   2> 119063 T296 c:collection1 oasc.SolrDeletionPolicy.updateCommits newest commit generation = 1
   [junit4]   2> 119064 T296 c:collection1 oass.SolrIndexSearcher.<init> Opening Searcher@443f7782[collection1] main
   [junit4]   2> 119065 T296 c:collection1 oasr.RestManager.init Initializing RestManager with initArgs: {storageIO=org.apache.solr.rest.ManagedResourceStorage$InMemoryStorageIO}
   [junit4]   2> 119067 T296 c:collection1 oasr.ManagedResourceStorage.load Reading _rest_managed.json using InMemoryStorage
   [junit4]   2> 119067 T296 c:collection1 oasr.RestManager.init Initializing 0 registered ManagedResources
   [junit4]   2> 119067 T296 c:collection1 oashc.SpellCheckComponent.inform Initializing spell checkers
   [junit4]   2> 119131 T296 c:collection1 oass.DirectSolrSpellChecker.init init: {name=direct,classname=DirectSolrSpellChecker,field=lowerfilt,minQueryLength=3}
   [junit4]   2> 119251 T296 c:collection1 oash.ReplicationHandler.inform Commits will be reserved for  10000
   [junit4]   2> 119253 T297 c:collection1 oashc.SpellCheckComponent$SpellCheckerListener.newSearcher Loading spell index for spellchecker: default
   [junit4]   2> 119255 T297 c:collection1 oashc.SpellCheckComponent$SpellCheckerListener.newSearcher Loading spell index for spellchecker: direct
   [junit4]   2> 119255 T297 c:collection1 oashc.SpellCheckComponent$SpellCheckerListener.newSearcher Loading spell index for spellchecker: wordbreak
   [junit4]   2> 119255 T296 c:collection1 oasc.CoreContainer.registerCore registering core: collection1
   [junit4]   2> 119255 T297 c:collection1 oashc.SpellCheckComponent$SpellCheckerListener.newSearcher Loading spell index for spellchecker: multipleFields
   [junit4]   2> 119258 T297 c:collection1 oashc.SpellCheckComponent$SpellCheckerListener.newSearcher Loading spell index for spellchecker: jarowinkler
   [junit4]   2> 119260 T297 c:collection1 oashc.SpellCheckComponent$SpellCheckerListener.newSearcher Loading spell index for spellchecker: external
   [junit4]   2> 119262 T297 c:collection1 oashc.SpellCheckComponent$SpellCheckerListener.newSearcher Loading spell index for spellchecker: freq
   [junit4]   2> 119262 T295 oas.SolrTestCaseJ4.initCore ####initCore end
   [junit4]   2> 119264 T297 c:collection1 oashc.SpellCheckComponent$SpellCheckerListener.newSearcher Loading spell index for spellchecker: fqcn
   [junit4]   2> 119265 T297 c:collection1 oashc.SpellCheckComponent$SpellCheckerListener.newSearcher Loading spell index for spellchecker: perDict
   [junit4]   2> 119268 T297 c:collection1 oasc.SolrCore.registerSearcher [collection1] Registered new searcher Searcher@443f7782[collection1] main{ExitableDirectoryReader(UninvertingDirectoryReader())}
   [junit4]   2> 119270 T295 oas.SolrTestCaseJ4.setUp ###Starting testSoftAndHardCommitMaxTimeRapidAdds
   [junit4]   2> 119271 T295 oasc.SolrResourceLoader.<init> new SolrResourceLoader for directory: '/usr/home/jenkins/jenkins-slave/workspace/Lucene-Solr-Tests-5.x-Java7/solr/core/src/test-files/solr/collection1/'
   [junit4]   2> 119276 T295 oasc.SolrResourceLoader.replaceClassLoader Adding 'file:/usr/home/jenkins/jenkins-slave/workspace/Lucene-Solr-Tests-5.x-Java7/solr/core/src/test-files/solr/collection1/lib/classes/' to classloader
   [junit4]   2> 119278 T295 oasc.SolrResourceLoader.replaceClassLoader Adding 'file:/usr/home/jenkins/jenkins-slave/workspace/Lucene-Solr-Tests-5.x-Java7/solr/core/src/test-files/solr/collection1/lib/README' to classloader
   [junit4]   2> 119280 T295 oasc.SolrResourceLoader.replaceClassLoader Adding 'file:/usr/home/jenkins/jenkins-slave/workspace/Lucene-Solr-Tests-5.x-Java7/solr/core/src/test-files/solr/collection1/lib/.svn/' to classloader
   [junit4]   2> 119687 T295 oasc.SolrConfig.refreshRequestParams current version of requestparams : -1
   [junit4]   2> 119763 T295 oasc.SolrConfig.<init> Using Lucene MatchVersion: 5.2.0
   [junit4]   2> 119891 T295 oasc.SolrConfig.<init> Loaded SolrConfig: solrconfig.xml
   [junit4]   2> 119893 T295 oass.IndexSchema.readSchema Reading Solr Schema from /usr/home/jenkins/jenkins-slave/workspace/Lucene-Solr-Tests-5.x-Java7/solr/core/src/test-files/solr/collection1/conf/schema.xml
   [junit4]   2> 119911 T295 oass.IndexSchema.readSchema [collection1] Schema name=test
   [junit4]   2> 165494 T295 oass.OpenExchangeRatesOrgProvider.init Initialized with rates=open-exchange-rates.json, refreshInterval=1440.
   [junit4]   2> 165535 T295 oass.IndexSchema.readSchema default search field in schema is text
   [junit4]   2> 165539 T295 oass.IndexSchema.readSchema unique key field: id
   [junit4]   2> 165563 T295 oass.FileExchangeRateProvider.reload Reloading exchange rates from file currency.xml
   [junit4]   2> 165568 T295 oass.FileExchangeRateProvider.reload Reloading exchange rates from file currency.xml
   [junit4]   2> 165573 T295 oass.OpenExchangeRatesOrgProvider.reload Reloading exchange rates from open-exchange-rates.json
   [junit4]   2> 165575 T295 oass.OpenExchangeRatesOrgProvider$OpenExchangeRates.<init> WARN Unknown key IMPORTANT NOTE
   [junit4]   2> 165575 T295 oass.OpenExchangeRatesOrgProvider$OpenExchangeRates.<init> WARN Expected key, got STRING
   [junit4]   2> 165576 T295 oass.OpenExchangeRatesOrgProvider.reload Reloading exchange rates from open-exchange-rates.json
   [junit4]   2> 165577 T295 oass.OpenExchangeRatesOrgProvider$OpenExchangeRates.<init> WARN Unknown key IMPORTANT NOTE
   [junit4]   2> 165577 T295 oass.OpenExchangeRatesOrgProvider$OpenExchangeRates.<init> WARN Expected key, got STRING
   [junit4]   2> 165577 T295 oasc.CoreContainer.reload Reloading SolrCore 'collection1' using configuration from instancedir /usr/home/jenkins/jenkins-slave/workspace/Lucene-Solr-Tests-5.x-Java7/solr/core/src/test-files/solr/collection1/
   [junit4]   2> 165578 T295 c:collection1 oasc.SolrCore.<init> [collection1] Opening new SolrCore at /usr/home/jenkins/jenkins-slave/workspace/Lucene-Solr-Tests-5.x-Java7/solr/core/src/test-files/solr/collection1/, dataDir=/usr/home/jenkins/jenkins-slave/workspace/Lucene-Solr-Tests-5.x-Java7/solr/build/solr-core/test/J2/temp/solr.update.SoftAutoCommitTest 932E7C58AD80ADA2-001/init-core-data-001/
   [junit4]   2> 165579 T295 c:collection1 oasc.JmxMonitoredMap.<init> JMX monitoring is enabled. Adding Solr mbeans to JMX Server: com.sun.jmx.mbeanserver.JmxMBeanServer@75749e15
   [junit4]   2> 165580 T295 c:collection1 oasc.SolrCore.getNewIndexDir New index directory detected: old=null new=/usr/home/jenkins/jenkins-slave/workspace/Lucene-Solr-Tests-5.x-Java7/solr/build/solr-core/test/J2/temp/solr.update.SoftAutoCommitTest 932E7C58AD80ADA2-001/init-core-data-001/index/
   [junit4]   2> 165592 T295 c:collection1 oasup.UpdateRequestProcessorChain.init creating updateRequestProcessorChain "dedupe"
   [junit4]   2> 165593 T295 c:collection1 oasup.UpdateRequestProcessorChain.init inserting DistributedUpdateProcessorFactory into updateRequestProcessorChain "dedupe"
   [junit4]   2> 165593 T295 c:collection1 oasup.UpdateRequestProcessorChain.init creating updateRequestProcessorChain "dedupe-allfields"
   [junit4]   2> 165594 T295 c:collection1 oasup.UpdateRequestProcessorChain.init inserting DistributedUpdateProcessorFactory into updateRequestProcessorChain "dedupe-allfields"
   [junit4]   2> 165594 T295 c:collection1 oasup.UpdateRequestProcessorChain.init creating updateRequestProcessorChain "stored_sig"
   [junit4]   2> 165595 T295 c:collection1 oasup.UpdateRequestProcessorChain.init inserting DistributedUpdateProcessorFactory into updateRequestProcessorChain "stored_sig"
   [junit4]   2> 165595 T295 c:collection1 oasup.UpdateRequestProcessorChain.init creating updateRequestProcessorChain "uniq-fields"
   [junit4]   2> 165596 T295 c:collection1 oasup.UpdateRequestProcessorChain.init inserting DistributedUpdateProcessorFactory into updateRequestProcessorChain "uniq-fields"
   [junit4]   2> 165596 T295 c:collection1 oasup.UpdateRequestProcessorChain.init creating updateRequestProcessorChain "distrib-dup-test-chain-explicit"
   [junit4]   2> 165597 T295 c:collection1 oasup.UpdateRequestProcessorChain.init creating updateRequestProcessorChain "distrib-dup-test-chain-implicit"
   [junit4]   2> 165598 T295 c:collection1 oasup.UpdateRequestProcessorChain.init inserting DistributedUpdateProcessorFactory into updateRequestProcessorChain "distrib-dup-test-chain-implicit"
   [junit4]   2> 165598 T295 c:collection1 oasc.SolrCore.loadUpdateProcessorChains no updateRequestProcessorChain defined as default, creating implicit default
   [junit4]   2> 165621 T295 c:collection1 oashl.XMLLoader.init xsltCacheLifetimeSeconds=60
   [junit4]   2> 165624 T295 c:collection1 oashl.XMLLoader.init xsltCacheLifetimeSeconds=60
   [junit4]   2> 165626 T295 c:collection1 oashl.XMLLoader.init xsltCacheLifetimeSeconds=60
   [junit4]   2> 165629 T295 c:collection1 oashl.XMLLoader.init xsltCacheLifetimeSeconds=60
   [junit4]   2> 165644 T295 c:collection1 oasc.PluginBag.createPlugin requestHandler : 'lazy' created with startup=lazy 
   [junit4]   2> 165652 T295 c:collection1 oasc.RequestHandlers.initHandlersFromConfig Registered paths: mltrh,spellCheckCompRH_Direct,standard,/admin/mbeans,/admin/system,/replication,lazy,/update/csv,/update/json,/admin/logging,/debug/dump,/search-facet-invariants,/admin/plugins,/get,/admin/ping,spellCheckWithWordbreak,/admin/segments,spellCheckCompRH1,/admin/file,/mlt,/admin/properties,spellCheckCompRH,/search-facet-def,/admin/threads,tvrh,dismax,/update,spellCheckWithWordbreak_Direct,/schema,/config,defaults,/update/json/docs,mock,/terms,/admin/luke
   [junit4]   2> 165654 T295 c:collection1 oasc.SolrCore.initDeprecatedSupport WARN solrconfig.xml uses deprecated <admin/gettableFiles>, Please update your config to use the ShowFileRequestHandler.
   [junit4]   2> 165656 T295 c:collection1 oasc.SolrCore.initStatsCache Using default statsCache cache: org.apache.solr.search.stats.LocalStatsCache
   [junit4]   2> 165663 T295 c:collection1 oasu.CommitTracker.<init> Hard AutoCommit: disabled
   [junit4]   2> 165664 T295 c:collection1 oasu.CommitTracker.<init> Soft AutoCommit: disabled
   [junit4]   2> 165665 T295 c:collection1 oass.SolrIndexSearcher.<init> Opening Searcher@a2b14bd[collection1] main
   [junit4]   2> 165666 T295 c:collection1 oasr.RestManager.init Initializing RestManager with initArgs: {storageIO=org.apache.solr.rest.ManagedResourceStorage$InMemoryStorageIO}
   [junit4]   2> 165666 T295 c:collection1 oasr.ManagedResourceStorage.load Reading _rest_managed.json using InMemoryStorage
   [junit4]   2> 165667 T295 c:collection1 oasr.RestManager.init Initializing 0 registered ManagedResources
   [junit4]   2> 165667 T295 c:collection1 oashc.SpellCheckComponent.inform Initializing spell checkers
   [junit4]   2> 165670 T295 c:collection1 oass.DirectSolrSpellChecker.init init: {name=direct,classname=DirectSolrSpellChecker,field=lowerfilt,minQueryLength=3}
   [junit4]   2> 165682 T295 c:collection1 oash.ReplicationHandler.inform Commits will be reserved for  10000
   [junit4]   2> 165683 T299 c:collection1 oashc.SpellCheckComponent$SpellCheckerListener.newSearcher Loading spell index for spellchecker: default
   [junit4]   2> 165684 T299 c:collection1 oashc.SpellCheckComponent$SpellCheckerListener.newSearcher Loading spell index for spellchecker: direct
   [junit4]   2> 165684 T299 c:collection1 oashc.SpellCheckComponent$SpellCheckerListener.newSearcher Loading spell index for spellchecker: wordbreak
   [junit4]   2> 165685 T299 c:collection1 oashc.SpellCheckComponent$SpellCheckerListener.newSearcher Loading spell index for spellchecker: multipleFields
   [junit4]   2> 165685 T299 c:collection1 oashc.SpellCheckComponent$SpellCheckerListener.newSearcher Loading spell index for spellchecker: jarowinkler
   [junit4]   2> 165686 T295 c:collection1 oasu.DefaultSolrCoreState.newIndexWriter Creating new IndexWriter...
   [junit4]   2> 165686 T295 c:collection1 oasu.DefaultSolrCoreState.newIndexWriter Waiting until IndexWriter is unused... core=collection1
   [junit4]   2> 165686 T299 c:collection1 oashc.SpellCheckComponent$SpellCheckerListener.newSearcher Loading spell index for spellchecker: external
   [junit4]   2> 165687 T295 c:collection1 oasu.DefaultSolrCoreState.newIndexWriter Closing old IndexWriter... core=collection1
   [junit4]   2> 165687 T299 c:collection1 oashc.SpellCheckComponent$SpellCheckerListener.newSearcher Loading spell index for spellchecker: freq
   [junit4]   2> 165688 T295 c:collection1 oasu.RandomMergePolicy.<init> RandomMergePolicy wrapping class org.apache.lucene.index.TieredMergePolicy: [TieredMergePolicy: maxMergeAtOnce=10, maxMergeAtOnceExplicit=44, maxMergedSegmentMB=18.26953125, floorSegmentMB=1.3505859375, forceMergeDeletesPctAllowed=24.319748176353148, segmentsPerTier=10.0, maxCFSSegmentSizeMB=8.796093022207999E12, noCFSRatio=0.7853453377607684
   [junit4]   2> 165688 T299 c:collection1 oashc.SpellCheckComponent$SpellCheckerListener.newSearcher Loading spell index for spellchecker: fqcn
   [junit4]   2> 165689 T295 c:collection1 oasc.SolrDeletionPolicy.onInit SolrDeletionPolicy.onInit: commits: num=1
   [junit4]   2> 		commit{dir=MockDirectoryWrapper(RAMDirectory@3808195b lockFactory=org.apache.lucene.store.SingleInstanceLockFactory@1bb8c21a),segFN=segments_1,generation=1}
   [junit4]   2> 165690 T299 c:collection1 oashc.SpellCheckComponent$SpellCheckerListener.newSearcher Loading spell index for spellchecker: perDict
   [junit4]   2> 165690 T295 c:collection1 oasc.SolrDeletionPolicy.updateCommits newest commit generation = 1
   [junit4]   2> 165691 T295 c:collection1 oasu.DefaultSolrCoreState.newIndexWriter New IndexWriter is ready to be used.
   [junit4]   2> 165692 T299 c:collection1 oasc.SolrCore.registerSearcher [collection1] Registered new searcher Searcher@a2b14bd[collection1] main{ExitableDirectoryReader(UninvertingDirectoryReader())}
   [junit4]   2> 165693 T295 c:collection1 oass.SolrIndexSearcher.<init> Opening Searcher@13b7dd80[collection1] main
   [junit4]   2> 165693 T295 c:collection1 oasc.CoreContainer.registerCore replacing core: collection1
   [junit4]   2> 165694 T295 c:collection1 oasc.SolrCore.close [collection1]  CLOSING SolrCore org.apache.solr.core.SolrCore@6f2248c7
   [junit4]   2> 165694 T295 c:collection1 oasu.DirectUpdateHandler2.close closing DirectUpdateHandler2{commits=0,autocommits=0,soft autocommits=0,optimizes=0,rollbacks=0,expungeDeletes=0,docsPending=0,adds=0,deletesById=0,deletesByQuery=0,errors=0,cumulative_adds=0,cumulative_deletesById=0,cumulative_deletesByQuery=0,cumulative_errors=0,transaction_logs_total_size=0,transaction_logs_total_number=0}
   [junit4]   2> 165695 T299 c:collection1 oasc.SolrCore.registerSearcher [collection1] Registered new searcher Searcher@13b7dd80[collection1] main{ExitableDirectoryReader(UninvertingDirectoryReader())}
   [junit4]   2> 165695 T295 c:collection1 oasc.SolrCore.closeSearcher [collection1] Closing main searcher on request.
   [junit4]   2> ASYNC  NEW_CORE C26 name=collection1 org.apache.solr.core.SolrCore@69cea63e
   [junit4]   2> 165782 T295 c:collection1 C26 oasup.LogUpdateProcessor.finish [collection1] webapp=null path=null params={} {add=[5000 (1497655808439091200)]} 0 68
   [junit4]   2> ASYNC  NEW_CORE C27 name=collection1 org.apache.solr.core.SolrCore@69cea63e
   [junit4]   2> 165795 T295 c:collection1 C27 oasup.LogUpdateProcessor.finish [collection1] webapp=null path=null params={} {add=[5001 (1497655808522977280)]} 0 1
   [junit4]   2> 165799 T295 c:collection1 C27 oasup.LogUpdateProcessor.finish [collection1] webapp=null path=null params={} {add=[5002 (1497655808527171584)]} 0 1
   [junit4]   2> 165802 T295 c:collection1 C27 oasup.LogUpdateProcessor.finish [collection1] webapp=null path=null params={} {add=[5003 (1497655808530317312)]} 0 1
   [junit4]   2> 165806 T295 c:collection1 C27 oasup.LogUpdateProcessor.finish [collection1] webapp=null path=null params={} {add=[5004 (1497655808534511616)]} 0 1
   [junit4]   2> 165808 T295 c:collection1 oas.SolrTestCaseJ4.tearDown ###Ending testSoftAndHardCommitMaxTimeRapidAdds
   [junit4]   2> 165815 T295 c:collection1 oas.SolrTestCaseJ4.setUp ###Starting testSoftAndHardCommitMaxTimeMixedAdds
   [junit4]   2> 165815 T295 c:collection1 oasc.SolrResourceLoader.<init> new SolrResourceLoader for directory: '/usr/home/jenkins/jenkins-slave/workspace/Lucene-Solr-Tests-5.x-Java7/solr/core/src/test-files/solr/collection1/'
   [junit4]   2> 165817 T295 c:collection1 oasc.SolrResourceLoader.replaceClassLoader Adding 'file:/usr/home/jenkins/jenkins-slave/workspace/Lucene-Solr-Tests-5.x-Java7/solr/core/src/test-files/solr/collection1/lib/classes/' to classloader
   [junit4]   2> 165818 T295 c:collection1 oasc.SolrResourceLoader.replaceClassLoader Adding 'file:/usr/home/jenkins/jenkins-slave/workspace/Lucene-Solr-Tests-5.x-Java7/solr/core/src/test-files/solr/collection1/lib/README' to classloader
   [junit4]   2> 165819 T295 c:collection1 oasc.SolrResourceLoader.replaceClassLoader Adding 'file:/usr/home/jenkins/jenkins-slave/workspace/Lucene-Solr-Tests-5.x-Java7/solr/core/src/test-files/solr/collection1/lib/.svn/' to classloader
   [junit4]   2> 165952 T295 c:collection1 oasc.SolrConfig.refreshRequestParams current version of requestparams : -1
   [junit4]   2> 165991 T295 c:collection1 oasc.SolrConfig.<init> Using Lucene MatchVersion: 5.2.0
   [junit4]   2> 166068 T295 c:collection1 oasc.SolrConfig.<init> Loaded SolrConfig: solrconfig.xml
   [junit4]   2> 166069 T295 c:collection1 oass.IndexSchema.readSchema Reading Solr Schema from /usr/home/jenkins/jenkins-slave/workspace/Lucene-Solr-Tests-5.x-Java7/solr/core/src/test-files/solr/collection1/conf/schema.xml
   [junit4]   2> 166085 T295 c:collection1 oass.IndexSchema.readSchema [collection1] Schema name=test
   [junit4]   2> 166283 T301 c:collection1 oasu.DirectUpdateHandler2.commit start commit{,optimize=false,openSearcher=true,waitSearcher=true,expungeDeletes=false,softCommit=true,prepareCommit=false}
   [junit4]   2> 166587 T301 c:collection1 oass.SolrIndexSearcher.<init> Opening Searcher@35e0327e[collection1] main
   [junit4]   2> 166589 T301 c:collection1 oasu.DirectUpdateHandler2.commit end_commit_flush
   [junit4]   2> 166592 T299 c:collection1 oasc.SolrCore.registerSearcher [collection1] Registered new searcher Searcher@35e0327e[collection1] main{ExitableDirectoryReader(UninvertingDirectoryReader(Uninverting(_0(5.2.0):C5)))}
   [junit4]   2> 166733 T295 c:collection1 oass.OpenExchangeRatesOrgProvider.init Initialized with rates=open-exchange-rates.json, refreshInterval=1440.
   [junit4]   2> 166812 T295 c:collection1 oass.IndexSchema.readSchema default search field in schema is text
   [junit4]   2> 166817 T295 c:collection1 oass.IndexSchema.readSchema unique key field: id
   [junit4]   2> 166843 T295 c:collection1 oass.FileExchangeRateProvider.reload Reloading exchange rates from file currency.xml
   [junit4]   2> 166863 T295 c:collection1 oass.FileExchangeRateProvider.reload Reloading exchange rates from file currency.xml
   [junit4]   2> 166874 T295 c:collection1 oass.OpenExchangeRatesOrgProvider.reload Reloading exchange rates from open-exchange-rates.json
   [junit4]   2> 166876 T295 c:collection1 oass.OpenExchangeRatesOrgProvider$OpenExchangeRates.<init> WARN Unknown key IMPORTANT NOTE
   [junit4]   2> 166877 T295 c:collection1 oass.OpenExchangeRatesOrgProvider$OpenExchangeRates.<init> WARN Expected key, got STRING
   [junit4]   2> 166877 T295 c:collection1 oass.OpenExchangeRatesOrgProvider.reload Reloading exchange rates from open-exchange-rates.json
   [junit4]   2> 166879 T295 c:collection1 oass.OpenExchangeRatesOrgProvider$OpenExchangeRates.<init> WARN Unknown key IMPORTANT NOTE
   [junit4]   2> 166880 T295 c:col

[...truncated too long message...]

TestServer$ZKServerMain.runFromConfig WARN Watch limit violations: 
   [junit4]   2> 	Maximum concurrent create/delete watches above limit:
   [junit4]   2> 	
   [junit4]   2> 		4	/solr/clusterstate.json
   [junit4]   2> 		4	/solr/aliases.json
   [junit4]   2> 		3	/solr/configs/conf1
   [junit4]   2> 		2	/solr/collections/collection1/state.json
   [junit4]   2> 	
   [junit4]   2> 	Maximum concurrent children watches above limit:
   [junit4]   2> 	
   [junit4]   2> 		4	/solr/live_nodes
   [junit4]   2> 		3	/solr/overseer/queue
   [junit4]   2> 		3	/solr/overseer/collection-queue-work
   [junit4]   2> 	
   [junit4]   2> 1643454 T3785 C:control_collection S:shard1 c:collection1 oasc.SocketProxy.close WARN Closing 6 connections to: http://127.0.0.1:41489/
   [junit4]   2> 1643454 T3785 C:control_collection S:shard1 c:collection1 oasc.SocketProxy.close WARN Closing 0 connections to: http://127.0.0.1:41493/
   [junit4]   2> 1643454 T3785 C:control_collection S:shard1 c:collection1 oasc.SocketProxy.close WARN Closing 0 connections to: http://127.0.0.1:41483/
   [junit4]   2> NOTE: reproduce with: ant test  -Dtestcase=RecoveryAfterSoftCommitTest -Dtests.method=test -Dtests.seed=932E7C58AD80ADA2 -Dtests.multiplier=2 -Dtests.slow=true -Dtests.locale=in_ID -Dtests.timezone=America/Louisville -Dtests.asserts=true -Dtests.file.encoding=US-ASCII
   [junit4] ERROR   69.6s J0 | RecoveryAfterSoftCommitTest.test <<<
   [junit4]    > Throwable #1: org.apache.solr.client.solrj.SolrServerException: org.apache.http.NoHttpResponseException: 127.0.0.1:41489 failed to respond
   [junit4]    > 	at __randomizedtesting.SeedInfo.seed([932E7C58AD80ADA2:1B7A4382037CC05A]:0)
   [junit4]    > 	at org.apache.solr.client.solrj.impl.CloudSolrClient.requestWithRetryOnStaleState(CloudSolrClient.java:929)
   [junit4]    > 	at org.apache.solr.client.solrj.impl.CloudSolrClient.request(CloudSolrClient.java:782)
   [junit4]    > 	at org.apache.solr.client.solrj.SolrRequest.process(SolrRequest.java:135)
   [junit4]    > 	at org.apache.solr.client.solrj.SolrClient.add(SolrClient.java:174)
   [junit4]    > 	at org.apache.solr.client.solrj.SolrClient.add(SolrClient.java:139)
   [junit4]    > 	at org.apache.solr.client.solrj.SolrClient.add(SolrClient.java:153)
   [junit4]    > 	at org.apache.solr.cloud.RecoveryAfterSoftCommitTest.test(RecoveryAfterSoftCommitTest.java:88)
   [junit4]    > 	at org.apache.solr.BaseDistributedSearchTestCase$ShardsRepeatRule$ShardsFixedStatement.callStatement(BaseDistributedSearchTestCase.java:960)
   [junit4]    > 	at org.apache.solr.BaseDistributedSearchTestCase$ShardsRepeatRule$ShardsStatement.evaluate(BaseDistributedSearchTestCase.java:935)
   [junit4]    > 	at java.lang.Thread.run(Thread.java:745)
   [junit4]    > Caused by: org.apache.http.NoHttpResponseException: 127.0.0.1:41489 failed to respond
   [junit4]    > 	at org.apache.http.impl.conn.DefaultHttpResponseParser.parseHead(DefaultHttpResponseParser.java:143)
   [junit4]    > 	at org.apache.http.impl.conn.DefaultHttpResponseParser.parseHead(DefaultHttpResponseParser.java:57)
   [junit4]    > 	at org.apache.http.impl.io.AbstractMessageParser.parse(AbstractMessageParser.java:261)
   [junit4]    > 	at org.apache.http.impl.AbstractHttpClientConnection.receiveResponseHeader(AbstractHttpClientConnection.java:283)
   [junit4]    > 	at org.apache.http.impl.conn.DefaultClientConnection.receiveResponseHeader(DefaultClientConnection.java:251)
   [junit4]    > 	at org.apache.http.impl.conn.ManagedClientConnectionImpl.receiveResponseHeader(ManagedClientConnectionImpl.java:197)
   [junit4]    > 	at org.apache.http.protocol.HttpRequestExecutor.doReceiveResponse(HttpRequestExecutor.java:272)
   [junit4]    > 	at org.apache.http.protocol.HttpRequestExecutor.execute(HttpRequestExecutor.java:124)
   [junit4]    > 	at org.apache.http.impl.client.DefaultRequestDirector.tryExecute(DefaultRequestDirector.java:685)
   [junit4]    > 	at org.apache.http.impl.client.DefaultRequestDirector.execute(DefaultRequestDirector.java:487)
   [junit4]    > 	at org.apache.http.impl.client.AbstractHttpClient.doExecute(AbstractHttpClient.java:882)
   [junit4]    > 	at org.apache.http.impl.client.CloseableHttpClient.execute(CloseableHttpClient.java:82)
   [junit4]    > 	at org.apache.http.impl.client.CloseableHttpClient.execute(CloseableHttpClient.java:107)
   [junit4]    > 	at org.apache.http.impl.client.CloseableHttpClient.execute(CloseableHttpClient.java:55)
   [junit4]    > 	at org.apache.solr.client.solrj.impl.HttpSolrClient.executeMethod(HttpSolrClient.java:462)
   [junit4]    > 	at org.apache.solr.client.solrj.impl.HttpSolrClient.request(HttpSolrClient.java:233)
   [junit4]    > 	at org.apache.solr.client.solrj.impl.HttpSolrClient.request(HttpSolrClient.java:225)
   [junit4]    > 	at org.apache.solr.client.solrj.impl.LBHttpSolrClient.doRequest(LBHttpSolrClient.java:370)
   [junit4]    > 	at org.apache.solr.client.solrj.impl.LBHttpSolrClient.request(LBHttpSolrClient.java:325)
   [junit4]    > 	at org.apache.solr.client.solrj.impl.CloudSolrClient$2.call(CloudSolrClient.java:596)
   [junit4]    > 	at org.apache.solr.client.solrj.impl.CloudSolrClient$2.call(CloudSolrClient.java:593)
   [junit4]    > 	at java.util.concurrent.FutureTask.run(FutureTask.java:262)
   [junit4]    > 	at java.util.concurrent.ThreadPoolExecutor.runWorker(ThreadPoolExecutor.java:1145)
   [junit4]    > 	at java.util.concurrent.ThreadPoolExecutor$Worker.run(ThreadPoolExecutor.java:615)
   [junit4]    > 	... 1 more
   [junit4]   2> 1643476 T3785 C:control_collection S:shard1 c:collection1 oas.SolrTestCaseJ4.deleteCore ###deleteCore
   [junit4]   2> NOTE: leaving temporary files on disk at: /usr/home/jenkins/jenkins-slave/workspace/Lucene-Solr-Tests-5.x-Java7/solr/build/solr-core/test/J0/temp/solr.cloud.RecoveryAfterSoftCommitTest 932E7C58AD80ADA2-001
   [junit4]   2> 69616 T3784 ccr.ThreadLeakControl.checkThreadLeaks WARNING Will linger awaiting termination of 1 leaked thread(s).
   [junit4]   2> NOTE: test params are: codec=Asserting(Lucene50): {timestamp=PostingsFormat(name=Memory doPackFST= true), multiDefault=PostingsFormat(name=Memory doPackFST= false), a_t=PostingsFormat(name=Memory doPackFST= true), id=Lucene50(blocksize=128), intDefault=PostingsFormat(name=Memory doPackFST= true), range_facet_l=PostingsFormat(name=Memory doPackFST= true), _version_=PostingsFormat(name=Memory doPackFST= true), text=PostingsFormat(name=LuceneVarGapFixedInterval)}, docValues:{timestamp=DocValuesFormat(name=Direct)}, sim=DefaultSimilarity, locale=in_ID, timezone=America/Louisville
   [junit4]   2> NOTE: FreeBSD 9.1-RELEASE-p3 amd64/Oracle Corporation 1.7.0_65 (64-bit)/cpus=16,threads=1,free=185225304,total=304087040
   [junit4]   2> NOTE: All tests run in this JVM: [DateMathParserTest, OverriddenZkACLAndCredentialsProvidersTest, TestGroupingSearch, TestRandomMergePolicy, TestSort, TestDocBasedVersionConstraints, UniqFieldsUpdateProcessorFactoryTest, TestBadConfig, TestObjectReleaseTracker, AutoCommitTest, TestSearchPerf, PluginInfoTest, TestManagedResourceStorage, TestFastOutputStream, FieldMutatingUpdateProcessorTest, NumericFieldsTest, TestStandardQParsers, DistributedFacetPivotLongTailTest, IndexBasedSpellCheckerTest, TestSolrJ, DistributedQueryElevationComponentTest, CursorPagingTest, TestCursorMarkWithoutUniqueKey, TestFieldSortValues, ZkSolrClientTest, SpatialRPTFieldTypeTest, DOMUtilTest, TestStressUserVersions, SliceStateTest, LeaderElectionTest, DeleteLastCustomShardedReplicaTest, SuggestComponentTest, TestQueryTypes, TestFreeTextSuggestions, DirectUpdateHandlerTest, SpellCheckComponentTest, ExternalCollectionsTest, ChangedSchemaMergeTest, TestCharFilters, DeleteReplicaTest, SimpleMLTQParserTest, PolyFieldTest, TestPostingsSolrHighlighter, TestSolrXml, FacetPivotSmallTest, ResponseHeaderTest, TestFieldTypeCollectionResource, AnalysisErrorHandlingTest, TestSolrCoreProperties, TestImplicitCoreProperties, TestExactStatsCache, SimpleCollectionCreateDeleteTest, MultiThreadedOCPTest, TestFileDictionaryLookup, BasicFunctionalityTest, TestMaxScoreQueryParser, TestPivotHelperCode, ResponseLogComponentTest, HttpPartitionTest, TestReplicationHandler, UnloadDistributedZkTest, DistribDocExpirationUpdateProcessorTest, RecoveryAfterSoftCommitTest]
   [junit4] Completed on J0 in 69.89s, 1 test, 1 error <<< FAILURES!

[...truncated 692 lines...]
BUILD FAILED
/usr/home/jenkins/jenkins-slave/workspace/Lucene-Solr-Tests-5.x-Java7/build.xml:529: The following error occurred while executing this line:
/usr/home/jenkins/jenkins-slave/workspace/Lucene-Solr-Tests-5.x-Java7/build.xml:477: The following error occurred while executing this line:
/usr/home/jenkins/jenkins-slave/workspace/Lucene-Solr-Tests-5.x-Java7/build.xml:61: The following error occurred while executing this line:
/usr/home/jenkins/jenkins-slave/workspace/Lucene-Solr-Tests-5.x-Java7/extra-targets.xml:39: The following error occurred while executing this line:
/usr/home/jenkins/jenkins-slave/workspace/Lucene-Solr-Tests-5.x-Java7/solr/build.xml:191: The following error occurred while executing this line:
/usr/home/jenkins/jenkins-slave/workspace/Lucene-Solr-Tests-5.x-Java7/solr/common-build.xml:509: The following error occurred while executing this line:
/usr/home/jenkins/jenkins-slave/workspace/Lucene-Solr-Tests-5.x-Java7/lucene/common-build.xml:1370: The following error occurred while executing this line:
/usr/home/jenkins/jenkins-slave/workspace/Lucene-Solr-Tests-5.x-Java7/lucene/common-build.xml:976: There were test failures: 478 suites, 1902 tests, 2 suite-level errors, 4 errors, 1 failure, 61 ignored (21 assumptions)

Total time: 55 minutes 17 seconds
Build step 'Invoke Ant' marked build as failure
Archiving artifacts
Sending artifact delta relative to Lucene-Solr-Tests-5.x-Java7 #2431
Archived 5 artifacts
Archive block size is 32768
Received 0 blocks and 217510061 bytes
Compression is 0.0%
Took 42 sec
Recording test results
Email was triggered for: Failure
Sending email for trigger: Failure



Mime
View raw message