lucene-dev mailing list archives

Site index · List index
Message view « Date » · « Thread »
Top « Date » · « Thread »
From Apache Jenkins Server <jenk...@builds.apache.org>
Subject [JENKINS] Lucene-Solr-Tests-5.x-Java7 - Build # 2911 - Still Failing
Date Wed, 08 Apr 2015 13:23:05 GMT
Build: https://builds.apache.org/job/Lucene-Solr-Tests-5.x-Java7/2911/

1 tests failed.
FAILED:  org.apache.solr.cloud.TestRebalanceLeaders.test

Error Message:
No live SolrServers available to handle this request:[http://127.0.0.1:20802/zg, http://127.0.0.1:20781/zg, http://127.0.0.1:20767/zg, http://127.0.0.1:20792/zg, http://127.0.0.1:20743/zg]

Stack Trace:
org.apache.solr.client.solrj.SolrServerException: No live SolrServers available to handle this request:[http://127.0.0.1:20802/zg, http://127.0.0.1:20781/zg, http://127.0.0.1:20767/zg, http://127.0.0.1:20792/zg, http://127.0.0.1:20743/zg]
	at __randomizedtesting.SeedInfo.seed([ED4E1CF455B33B43:651A232EFB4F56BB]:0)
	at org.apache.solr.client.solrj.impl.LBHttpSolrClient.request(LBHttpSolrClient.java:349)
	at org.apache.solr.client.solrj.impl.CloudSolrClient.sendRequest(CloudSolrClient.java:1067)
	at org.apache.solr.client.solrj.impl.CloudSolrClient.requestWithRetryOnStaleState(CloudSolrClient.java:839)
	at org.apache.solr.client.solrj.impl.CloudSolrClient.request(CloudSolrClient.java:782)
	at org.apache.solr.client.solrj.SolrClient.request(SolrClient.java:1220)
	at org.apache.solr.cloud.TestRebalanceLeaders.issueCommands(TestRebalanceLeaders.java:281)
	at org.apache.solr.cloud.TestRebalanceLeaders.rebalanceLeaderTest(TestRebalanceLeaders.java:108)
	at org.apache.solr.cloud.TestRebalanceLeaders.test(TestRebalanceLeaders.java:74)
	at sun.reflect.NativeMethodAccessorImpl.invoke0(Native Method)
	at sun.reflect.NativeMethodAccessorImpl.invoke(NativeMethodAccessorImpl.java:57)
	at sun.reflect.DelegatingMethodAccessorImpl.invoke(DelegatingMethodAccessorImpl.java:43)
	at java.lang.reflect.Method.invoke(Method.java:606)
	at com.carrotsearch.randomizedtesting.RandomizedRunner.invoke(RandomizedRunner.java:1627)
	at com.carrotsearch.randomizedtesting.RandomizedRunner$6.evaluate(RandomizedRunner.java:836)
	at com.carrotsearch.randomizedtesting.RandomizedRunner$7.evaluate(RandomizedRunner.java:872)
	at com.carrotsearch.randomizedtesting.RandomizedRunner$8.evaluate(RandomizedRunner.java:886)
	at org.apache.solr.BaseDistributedSearchTestCase$ShardsRepeatRule$ShardsFixedStatement.callStatement(BaseDistributedSearchTestCase.java:960)
	at org.apache.solr.BaseDistributedSearchTestCase$ShardsRepeatRule$ShardsStatement.evaluate(BaseDistributedSearchTestCase.java:935)
	at com.carrotsearch.randomizedtesting.rules.SystemPropertiesRestoreRule$1.evaluate(SystemPropertiesRestoreRule.java:53)
	at org.apache.lucene.util.TestRuleSetupTeardownChained$1.evaluate(TestRuleSetupTeardownChained.java:50)
	at org.apache.lucene.util.AbstractBeforeAfterRule$1.evaluate(AbstractBeforeAfterRule.java:46)
	at org.apache.lucene.util.TestRuleThreadAndTestName$1.evaluate(TestRuleThreadAndTestName.java:49)
	at org.apache.lucene.util.TestRuleIgnoreAfterMaxFailures$1.evaluate(TestRuleIgnoreAfterMaxFailures.java:65)
	at org.apache.lucene.util.TestRuleMarkFailure$1.evaluate(TestRuleMarkFailure.java:48)
	at com.carrotsearch.randomizedtesting.rules.StatementAdapter.evaluate(StatementAdapter.java:36)
	at com.carrotsearch.randomizedtesting.ThreadLeakControl$StatementRunner.run(ThreadLeakControl.java:365)
	at com.carrotsearch.randomizedtesting.ThreadLeakControl.forkTimeoutingTask(ThreadLeakControl.java:798)
	at com.carrotsearch.randomizedtesting.ThreadLeakControl$3.evaluate(ThreadLeakControl.java:458)
	at com.carrotsearch.randomizedtesting.RandomizedRunner.runSingleTest(RandomizedRunner.java:845)
	at com.carrotsearch.randomizedtesting.RandomizedRunner$3.evaluate(RandomizedRunner.java:747)
	at com.carrotsearch.randomizedtesting.RandomizedRunner$4.evaluate(RandomizedRunner.java:781)
	at com.carrotsearch.randomizedtesting.RandomizedRunner$5.evaluate(RandomizedRunner.java:792)
	at com.carrotsearch.randomizedtesting.rules.StatementAdapter.evaluate(StatementAdapter.java:36)
	at com.carrotsearch.randomizedtesting.rules.SystemPropertiesRestoreRule$1.evaluate(SystemPropertiesRestoreRule.java:53)
	at org.apache.lucene.util.AbstractBeforeAfterRule$1.evaluate(AbstractBeforeAfterRule.java:46)
	at com.carrotsearch.randomizedtesting.rules.StatementAdapter.evaluate(StatementAdapter.java:36)
	at org.apache.lucene.util.TestRuleStoreClassName$1.evaluate(TestRuleStoreClassName.java:42)
	at com.carrotsearch.randomizedtesting.rules.NoShadowingOrOverridesOnMethodsRule$1.evaluate(NoShadowingOrOverridesOnMethodsRule.java:39)
	at com.carrotsearch.randomizedtesting.rules.NoShadowingOrOverridesOnMethodsRule$1.evaluate(NoShadowingOrOverridesOnMethodsRule.java:39)
	at com.carrotsearch.randomizedtesting.rules.StatementAdapter.evaluate(StatementAdapter.java:36)
	at com.carrotsearch.randomizedtesting.rules.StatementAdapter.evaluate(StatementAdapter.java:36)
	at com.carrotsearch.randomizedtesting.rules.StatementAdapter.evaluate(StatementAdapter.java:36)
	at org.apache.lucene.util.TestRuleAssertionsRequired$1.evaluate(TestRuleAssertionsRequired.java:54)
	at org.apache.lucene.util.TestRuleMarkFailure$1.evaluate(TestRuleMarkFailure.java:48)
	at org.apache.lucene.util.TestRuleIgnoreAfterMaxFailures$1.evaluate(TestRuleIgnoreAfterMaxFailures.java:65)
	at org.apache.lucene.util.TestRuleIgnoreTestSuites$1.evaluate(TestRuleIgnoreTestSuites.java:55)
	at com.carrotsearch.randomizedtesting.rules.StatementAdapter.evaluate(StatementAdapter.java:36)
	at com.carrotsearch.randomizedtesting.ThreadLeakControl$StatementRunner.run(ThreadLeakControl.java:365)
	at java.lang.Thread.run(Thread.java:745)
Caused by: org.apache.solr.client.solrj.impl.HttpSolrClient$RemoteSolrException: Error from server at http://127.0.0.1:20767/zg: Expected mime type application/octet-stream but got text/html. <html>
<head>
<meta http-equiv="Content-Type" content="text/html;charset=ISO-8859-1"/>
<title>Error 500 {trace=java.lang.AssertionError
	at org.apache.solr.common.util.ByteUtils.UTF8toUTF16(ByteUtils.java:36)
	at org.apache.solr.common.util.ByteUtils.UTF8toUTF16(ByteUtils.java:64)
	at org.apache.solr.common.cloud.ZkStateReader.fromJSON(ZkStateReader.java:137)
	at org.apache.solr.common.cloud.ZkNodeProps.load(ZkNodeProps.java:92)
	at org.apache.solr.cloud.DistributedQueue.containsTaskWithRequestId(DistributedQueue.java:127)
	at org.apache.solr.handler.admin.CollectionsHandler.overseerCollectionQueueContains(CollectionsHandler.java:647)
	at org.apache.solr.handler.admin.CollectionsHandler.handleResponse(CollectionsHandler.java:669)
	at org.apache.solr.handler.admin.CollectionsHandler.handleResponse(CollectionsHandler.java:652)
	at org.apache.solr.handler.admin.CollectionsHandler.rejoinElection(CollectionsHandler.java:447)
	at org.apache.solr.handler.admin.CollectionsHandler.insurePreferredIsLeader(CollectionsHandler.java:362)
	at org.apache.solr.handler.admin.CollectionsHandler.handleBalanceLeaders(CollectionsHandler.java:269)
	at org.apache.solr.handler.admin.CollectionsHandler.handleRequestBody(CollectionsHandler.java:235)
	at org.apache.solr.handler.RequestHandlerBase.handleRequest(RequestHandlerBase.java:143)
	at org.apache.solr.servlet.SolrDispatchFilter.handleAdminRequest(SolrDispatchFilter.java:782)
	at org.apache.solr.servlet.SolrDispatchFilter.doFilter(SolrDispatchFilter.java:282)
	at org.apache.solr.servlet.SolrDispatchFilter.doFilter(SolrDispatchFilter.java:220)
	at org.eclipse.jetty.servlet.ServletHandler$CachedChain.doFilter(ServletHandler.java:1419)
	at org.apache.solr.client.solrj.embedded.JettySolrRunner$DebugFilter.doFilter(JettySolrRunner.java:102)
	at org.eclipse.jetty.servlet.ServletHandler$CachedChain.doFilter(ServletHandler.java:1419)
	at org.eclipse.jetty.servlet.ServletHandler.doHandle(ServletHandler.java:455)
	at org.eclipse.jetty.server.session.SessionHandler.doHandle(SessionHandler.java:229)
	at org.eclipse.jetty.server.handler.ScopedHandler.handle(ScopedHandler.java:137)
	at org.eclipse.jetty.server.handler.GzipHandler.handle(GzipHandler.java:301)
	at org.eclipse.jetty.server.handler.ContextHandler.doHandle(ContextHandler.java:1077)
	at org.eclipse.jetty.servlet.ServletHandler.doScope(ServletHandler.java:384)
	at org.eclipse.jetty.server.session.SessionHandler.doScope(SessionHandler.java:193)
	at org.eclipse.jetty.server.handler.ContextHandler.doScope(ContextHandler.java:1009)
	at org.eclipse.jetty.server.handler.ScopedHandler.handle(ScopedHandler.java:135)
	at org.eclipse.jetty.server.handler.HandlerWrapper.handle(HandlerWrapper.java:116)
	at org.eclipse.jetty.server.Server.handle(Server.java:368)
	at org.eclipse.jetty.server.AbstractHttpConnection.handleRequest(AbstractHttpConnection.java:489)
	at org.eclipse.jetty.server.BlockingHttpConnection.handleRequest(BlockingHttpConnection.java:53)
	at org.eclipse.jetty.server.AbstractHttpConnection.headerComplete(AbstractHttpConnection.java:942)
	at org.eclipse.jetty.server.AbstractHttpConnection$RequestHandler.headerComplete(AbstractHttpConnection.java:1004)
	at org.eclipse.jetty.http.HttpParser.parseNext(HttpParser.java:640)
	at org.eclipse.jetty.http.HttpParser.parseAvailable(HttpParser.java:235)
	at org.eclipse.jetty.server.BlockingHttpConnection.handle(BlockingHttpConnection.java:72)
	at org.eclipse.jetty.server.bio.SocketConnector$ConnectorEndPoint.run(SocketConnector.java:264)
	at org.eclipse.jetty.util.thread.QueuedThreadPool.runJob(QueuedThreadPool.java:608)
	at org.eclipse.jetty.util.thread.QueuedThreadPool$3.run(QueuedThreadPool.java:543)
	at java.lang.Thread.run(Thread.java:745)
,code=500}</title>
</head>
<body>
<h2>HTTP ERROR: 500</h2>
<p>Problem accessing /zg/admin/collections. Reason:
<pre>    {trace=java.lang.AssertionError
	at org.apache.solr.common.util.ByteUtils.UTF8toUTF16(ByteUtils.java:36)
	at org.apache.solr.common.util.ByteUtils.UTF8toUTF16(ByteUtils.java:64)
	at org.apache.solr.common.cloud.ZkStateReader.fromJSON(ZkStateReader.java:137)
	at org.apache.solr.common.cloud.ZkNodeProps.load(ZkNodeProps.java:92)
	at org.apache.solr.cloud.DistributedQueue.containsTaskWithRequestId(DistributedQueue.java:127)
	at org.apache.solr.handler.admin.CollectionsHandler.overseerCollectionQueueContains(CollectionsHandler.java:647)
	at org.apache.solr.handler.admin.CollectionsHandler.handleResponse(CollectionsHandler.java:669)
	at org.apache.solr.handler.admin.CollectionsHandler.handleResponse(CollectionsHandler.java:652)
	at org.apache.solr.handler.admin.CollectionsHandler.rejoinElection(CollectionsHandler.java:447)
	at org.apache.solr.handler.admin.CollectionsHandler.insurePreferredIsLeader(CollectionsHandler.java:362)
	at org.apache.solr.handler.admin.CollectionsHandler.handleBalanceLeaders(CollectionsHandler.java:269)
	at org.apache.solr.handler.admin.CollectionsHandler.handleRequestBody(CollectionsHandler.java:235)
	at org.apache.solr.handler.RequestHandlerBase.handleRequest(RequestHandlerBase.java:143)
	at org.apache.solr.servlet.SolrDispatchFilter.handleAdminRequest(SolrDispatchFilter.java:782)
	at org.apache.solr.servlet.SolrDispatchFilter.doFilter(SolrDispatchFilter.java:282)
	at org.apache.solr.servlet.SolrDispatchFilter.doFilter(SolrDispatchFilter.java:220)
	at org.eclipse.jetty.servlet.ServletHandler$CachedChain.doFilter(ServletHandler.java:1419)
	at org.apache.solr.client.solrj.embedded.JettySolrRunner$DebugFilter.doFilter(JettySolrRunner.java:102)
	at org.eclipse.jetty.servlet.ServletHandler$CachedChain.doFilter(ServletHandler.java:1419)
	at org.eclipse.jetty.servlet.ServletHandler.doHandle(ServletHandler.java:455)
	at org.eclipse.jetty.server.session.SessionHandler.doHandle(SessionHandler.java:229)
	at org.eclipse.jetty.server.handler.ScopedHandler.handle(ScopedHandler.java:137)
	at org.eclipse.jetty.server.handler.GzipHandler.handle(GzipHandler.java:301)
	at org.eclipse.jetty.server.handler.ContextHandler.doHandle(ContextHandler.java:1077)
	at org.eclipse.jetty.servlet.ServletHandler.doScope(ServletHandler.java:384)
	at org.eclipse.jetty.server.session.SessionHandler.doScope(SessionHandler.java:193)
	at org.eclipse.jetty.server.handler.ContextHandler.doScope(ContextHandler.java:1009)
	at org.eclipse.jetty.server.handler.ScopedHandler.handle(ScopedHandler.java:135)
	at org.eclipse.jetty.server.handler.HandlerWrapper.handle(HandlerWrapper.java:116)
	at org.eclipse.jetty.server.Server.handle(Server.java:368)
	at org.eclipse.jetty.server.AbstractHttpConnection.handleRequest(AbstractHttpConnection.java:489)
	at org.eclipse.jetty.server.BlockingHttpConnection.handleRequest(BlockingHttpConnection.java:53)
	at org.eclipse.jetty.server.AbstractHttpConnection.headerComplete(AbstractHttpConnection.java:942)
	at org.eclipse.jetty.server.AbstractHttpConnection$RequestHandler.headerComplete(AbstractHttpConnection.java:1004)
	at org.eclipse.jetty.http.HttpParser.parseNext(HttpParser.java:640)
	at org.eclipse.jetty.http.HttpParser.parseAvailable(HttpParser.java:235)
	at org.eclipse.jetty.server.BlockingHttpConnection.handle(BlockingHttpConnection.java:72)
	at org.eclipse.jetty.server.bio.SocketConnector$ConnectorEndPoint.run(SocketConnector.java:264)
	at org.eclipse.jetty.util.thread.QueuedThreadPool.runJob(QueuedThreadPool.java:608)
	at org.eclipse.jetty.util.thread.QueuedThreadPool$3.run(QueuedThreadPool.java:543)
	at java.lang.Thread.run(Thread.java:745)
,code=500}</pre></p>
<hr /><i><small>Powered by Jetty://</small></i>
                                                
                                                
                                                
                                                
                                                
                                                
                                                
                                                
                                                
                                                
                                                
                                                
                                                
                                                
                                                
                                                
                                                
                                                
                                                
                                                
</body>
</html>

	at org.apache.solr.client.solrj.impl.HttpSolrClient.executeMethod(HttpSolrClient.java:525)
	at org.apache.solr.client.solrj.impl.HttpSolrClient.request(HttpSolrClient.java:233)
	at org.apache.solr.client.solrj.impl.HttpSolrClient.request(HttpSolrClient.java:225)
	at org.apache.solr.client.solrj.impl.LBHttpSolrClient.doRequest(LBHttpSolrClient.java:370)
	at org.apache.solr.client.solrj.impl.LBHttpSolrClient.request(LBHttpSolrClient.java:338)
	... 48 more




Build Log:
[...truncated 10082 lines...]
   [junit4] Suite: org.apache.solr.cloud.TestRebalanceLeaders
   [junit4]   2> Creating dataDir: /usr/home/jenkins/jenkins-slave/workspace/Lucene-Solr-Tests-5.x-Java7/solr/build/solr-core/test/J2/temp/solr.cloud.TestRebalanceLeaders ED4E1CF455B33B43-001/init-core-data-001
   [junit4]   2> 1491198 T5962 oas.SolrTestCaseJ4.buildSSLConfig Randomized ssl (false) and clientAuth (false)
   [junit4]   2> 1491198 T5962 oas.BaseDistributedSearchTestCase.initHostContext Setting hostContext system property: /zg/
   [junit4]   2> 1491203 T5962 oasc.ZkTestServer.run STARTING ZK TEST SERVER
   [junit4]   1> client port:0.0.0.0/0.0.0.0:0
   [junit4]   2> 1491204 T5963 oasc.ZkTestServer$ZKServerMain.runFromConfig Starting server
   [junit4]   2> 1491304 T5962 oasc.ZkTestServer.run start zk server on port:20738
   [junit4]   2> 1491305 T5962 oascc.SolrZkClient.createZkCredentialsToAddAutomatically Using default ZkCredentialsProvider
   [junit4]   2> 1491306 T5962 oascc.ConnectionManager.waitForConnected Waiting for client to connect to ZooKeeper
   [junit4]   2> 1491309 T5970 oascc.ConnectionManager.process Watcher org.apache.solr.common.cloud.ConnectionManager@40885ca name:ZooKeeperConnection Watcher:127.0.0.1:20738 got event WatchedEvent state:SyncConnected type:None path:null path:null type:None
   [junit4]   2> 1491309 T5962 oascc.ConnectionManager.waitForConnected Client is connected to ZooKeeper
   [junit4]   2> 1491310 T5962 oascc.SolrZkClient.createZkACLProvider Using default ZkACLProvider
   [junit4]   2> 1491310 T5962 oascc.SolrZkClient.makePath makePath: /solr
   [junit4]   2> 1491312 T5962 oascc.SolrZkClient.createZkCredentialsToAddAutomatically Using default ZkCredentialsProvider
   [junit4]   2> 1491313 T5962 oascc.ConnectionManager.waitForConnected Waiting for client to connect to ZooKeeper
   [junit4]   2> 1491315 T5973 oascc.ConnectionManager.process Watcher org.apache.solr.common.cloud.ConnectionManager@7c823094 name:ZooKeeperConnection Watcher:127.0.0.1:20738/solr got event WatchedEvent state:SyncConnected type:None path:null path:null type:None
   [junit4]   2> 1491315 T5962 oascc.ConnectionManager.waitForConnected Client is connected to ZooKeeper
   [junit4]   2> 1491315 T5962 oascc.SolrZkClient.createZkACLProvider Using default ZkACLProvider
   [junit4]   2> 1491316 T5962 oascc.SolrZkClient.makePath makePath: /collections/collection1
   [junit4]   2> 1491318 T5962 oascc.SolrZkClient.makePath makePath: /collections/collection1/shards
   [junit4]   2> 1491319 T5962 oascc.SolrZkClient.makePath makePath: /collections/control_collection
   [junit4]   2> 1491320 T5962 oascc.SolrZkClient.makePath makePath: /collections/control_collection/shards
   [junit4]   2> 1491322 T5962 oasc.AbstractZkTestCase.putConfig put /usr/home/jenkins/jenkins-slave/workspace/Lucene-Solr-Tests-5.x-Java7/solr/core/src/test-files/solr/collection1/conf/solrconfig-tlog.xml to /configs/conf1/solrconfig.xml
   [junit4]   2> 1491322 T5962 oascc.SolrZkClient.makePath makePath: /configs/conf1/solrconfig.xml
   [junit4]   2> 1491325 T5962 oasc.AbstractZkTestCase.putConfig put /usr/home/jenkins/jenkins-slave/workspace/Lucene-Solr-Tests-5.x-Java7/solr/core/src/test-files/solr/collection1/conf/schema15.xml to /configs/conf1/schema.xml
   [junit4]   2> 1491325 T5962 oascc.SolrZkClient.makePath makePath: /configs/conf1/schema.xml
   [junit4]   2> 1491427 T5962 oasc.AbstractZkTestCase.putConfig put /usr/home/jenkins/jenkins-slave/workspace/Lucene-Solr-Tests-5.x-Java7/solr/core/src/test-files/solr/collection1/conf/solrconfig.snippet.randomindexconfig.xml to /configs/conf1/solrconfig.snippet.randomindexconfig.xml
   [junit4]   2> 1491427 T5962 oascc.SolrZkClient.makePath makePath: /configs/conf1/solrconfig.snippet.randomindexconfig.xml
   [junit4]   2> 1491429 T5962 oasc.AbstractZkTestCase.putConfig put /usr/home/jenkins/jenkins-slave/workspace/Lucene-Solr-Tests-5.x-Java7/solr/core/src/test-files/solr/collection1/conf/stopwords.txt to /configs/conf1/stopwords.txt
   [junit4]   2> 1491430 T5962 oascc.SolrZkClient.makePath makePath: /configs/conf1/stopwords.txt
   [junit4]   2> 1491431 T5962 oasc.AbstractZkTestCase.putConfig put /usr/home/jenkins/jenkins-slave/workspace/Lucene-Solr-Tests-5.x-Java7/solr/core/src/test-files/solr/collection1/conf/protwords.txt to /configs/conf1/protwords.txt
   [junit4]   2> 1491432 T5962 oascc.SolrZkClient.makePath makePath: /configs/conf1/protwords.txt
   [junit4]   2> 1491433 T5962 oasc.AbstractZkTestCase.putConfig put /usr/home/jenkins/jenkins-slave/workspace/Lucene-Solr-Tests-5.x-Java7/solr/core/src/test-files/solr/collection1/conf/currency.xml to /configs/conf1/currency.xml
   [junit4]   2> 1491434 T5962 oascc.SolrZkClient.makePath makePath: /configs/conf1/currency.xml
   [junit4]   2> 1491436 T5962 oasc.AbstractZkTestCase.putConfig put /usr/home/jenkins/jenkins-slave/workspace/Lucene-Solr-Tests-5.x-Java7/solr/core/src/test-files/solr/collection1/conf/enumsConfig.xml to /configs/conf1/enumsConfig.xml
   [junit4]   2> 1491436 T5962 oascc.SolrZkClient.makePath makePath: /configs/conf1/enumsConfig.xml
   [junit4]   2> 1491438 T5962 oasc.AbstractZkTestCase.putConfig put /usr/home/jenkins/jenkins-slave/workspace/Lucene-Solr-Tests-5.x-Java7/solr/core/src/test-files/solr/collection1/conf/open-exchange-rates.json to /configs/conf1/open-exchange-rates.json
   [junit4]   2> 1491438 T5962 oascc.SolrZkClient.makePath makePath: /configs/conf1/open-exchange-rates.json
   [junit4]   2> 1491440 T5962 oasc.AbstractZkTestCase.putConfig put /usr/home/jenkins/jenkins-slave/workspace/Lucene-Solr-Tests-5.x-Java7/solr/core/src/test-files/solr/collection1/conf/mapping-ISOLatin1Accent.txt to /configs/conf1/mapping-ISOLatin1Accent.txt
   [junit4]   2> 1491441 T5962 oascc.SolrZkClient.makePath makePath: /configs/conf1/mapping-ISOLatin1Accent.txt
   [junit4]   2> 1491442 T5962 oasc.AbstractZkTestCase.putConfig put /usr/home/jenkins/jenkins-slave/workspace/Lucene-Solr-Tests-5.x-Java7/solr/core/src/test-files/solr/collection1/conf/old_synonyms.txt to /configs/conf1/old_synonyms.txt
   [junit4]   2> 1491443 T5962 oascc.SolrZkClient.makePath makePath: /configs/conf1/old_synonyms.txt
   [junit4]   2> 1491444 T5962 oasc.AbstractZkTestCase.putConfig put /usr/home/jenkins/jenkins-slave/workspace/Lucene-Solr-Tests-5.x-Java7/solr/core/src/test-files/solr/collection1/conf/synonyms.txt to /configs/conf1/synonyms.txt
   [junit4]   2> 1491445 T5962 oascc.SolrZkClient.makePath makePath: /configs/conf1/synonyms.txt
   [junit4]   2> 1493135 T5962 oas.SolrTestCaseJ4.writeCoreProperties Writing core.properties file to /usr/home/jenkins/jenkins-slave/workspace/Lucene-Solr-Tests-5.x-Java7/solr/build/solr-core/test/J2/temp/solr.cloud.TestRebalanceLeaders ED4E1CF455B33B43-001/control-001/cores/collection1
   [junit4]   2> 1493140 T5962 oejs.Server.doStart jetty-8.1.10.v20130312
   [junit4]   2> 1493145 T5962 oejs.AbstractConnector.doStart Started SocketConnector@127.0.0.1:20743
   [junit4]   2> 1493145 T5962 oascse.JettySolrRunner$1.lifeCycleStarted Jetty properties: {hostContext=/zg, hostPort=20743, solr.data.dir=/usr/home/jenkins/jenkins-slave/workspace/Lucene-Solr-Tests-5.x-Java7/solr/build/solr-core/test/J2/temp/solr.cloud.TestRebalanceLeaders ED4E1CF455B33B43-001/tempDir-001/control/data, coreRootDirectory=/usr/home/jenkins/jenkins-slave/workspace/Lucene-Solr-Tests-5.x-Java7/solr/build/solr-core/test/J2/temp/solr.cloud.TestRebalanceLeaders ED4E1CF455B33B43-001/control-001/cores}
   [junit4]   2> 1493146 T5962 oass.SolrDispatchFilter.init SolrDispatchFilter.init()sun.misc.Launcher$AppClassLoader@631d75b9
   [junit4]   2> 1493146 T5962 oasc.SolrResourceLoader.<init> new SolrResourceLoader for directory: '/usr/home/jenkins/jenkins-slave/workspace/Lucene-Solr-Tests-5.x-Java7/solr/build/solr-core/test/J2/temp/solr.cloud.TestRebalanceLeaders ED4E1CF455B33B43-001/control-001/'
   [junit4]   2> 1493205 T5962 oasc.SolrXmlConfig.fromFile Loading container configuration from /usr/home/jenkins/jenkins-slave/workspace/Lucene-Solr-Tests-5.x-Java7/solr/build/solr-core/test/J2/temp/solr.cloud.TestRebalanceLeaders ED4E1CF455B33B43-001/control-001/solr.xml
   [junit4]   2> 1493272 T5962 oasc.CorePropertiesLocator.<init> Config-defined core root directory: /usr/home/jenkins/jenkins-slave/workspace/Lucene-Solr-Tests-5.x-Java7/solr/build/solr-core/test/J2/temp/solr.cloud.TestRebalanceLeaders ED4E1CF455B33B43-001/control-001/cores
   [junit4]   2> 1493273 T5962 oasc.CoreContainer.<init> New CoreContainer 671212554
   [junit4]   2> 1493273 T5962 oasc.CoreContainer.load Loading cores into CoreContainer [instanceDir=/usr/home/jenkins/jenkins-slave/workspace/Lucene-Solr-Tests-5.x-Java7/solr/build/solr-core/test/J2/temp/solr.cloud.TestRebalanceLeaders ED4E1CF455B33B43-001/control-001/]
   [junit4]   2> 1493273 T5962 oasc.CoreContainer.load loading shared library: /usr/home/jenkins/jenkins-slave/workspace/Lucene-Solr-Tests-5.x-Java7/solr/build/solr-core/test/J2/temp/solr.cloud.TestRebalanceLeaders ED4E1CF455B33B43-001/control-001/lib
   [junit4]   2> 1493274 T5962 oasc.SolrResourceLoader.addToClassLoader WARN Can't find (or read) directory to add to classloader: lib (resolved as: /usr/home/jenkins/jenkins-slave/workspace/Lucene-Solr-Tests-5.x-Java7/solr/build/solr-core/test/J2/temp/solr.cloud.TestRebalanceLeaders ED4E1CF455B33B43-001/control-001/lib).
   [junit4]   2> 1493283 T5962 oashc.HttpShardHandlerFactory.getParameter Setting socketTimeout to: 90000
   [junit4]   2> 1493284 T5962 oashc.HttpShardHandlerFactory.getParameter Setting urlScheme to: 
   [junit4]   2> 1493284 T5962 oashc.HttpShardHandlerFactory.getParameter Setting connTimeout to: 15000
   [junit4]   2> 1493284 T5962 oashc.HttpShardHandlerFactory.getParameter Setting maxConnectionsPerHost to: 20
   [junit4]   2> 1493284 T5962 oashc.HttpShardHandlerFactory.getParameter Setting maxConnections to: 10000
   [junit4]   2> 1493285 T5962 oashc.HttpShardHandlerFactory.getParameter Setting corePoolSize to: 0
   [junit4]   2> 1493285 T5962 oashc.HttpShardHandlerFactory.getParameter Setting maximumPoolSize to: 2147483647
   [junit4]   2> 1493285 T5962 oashc.HttpShardHandlerFactory.getParameter Setting maxThreadIdleTime to: 5
   [junit4]   2> 1493285 T5962 oashc.HttpShardHandlerFactory.getParameter Setting sizeOfQueue to: -1
   [junit4]   2> 1493285 T5962 oashc.HttpShardHandlerFactory.getParameter Setting fairnessPolicy to: false
   [junit4]   2> 1493286 T5962 oashc.HttpShardHandlerFactory.getParameter Setting useRetries to: false
   [junit4]   2> 1493293 T5962 oasu.UpdateShardHandler.<init> Creating UpdateShardHandler HTTP client with params: socketTimeout=340000&connTimeout=45000&retry=true
   [junit4]   2> 1493294 T5962 oasl.LogWatcher.createWatcher SLF4J impl is org.slf4j.impl.Log4jLoggerFactory
   [junit4]   2> 1493294 T5962 oasl.LogWatcher.newRegisteredLogWatcher Registering Log Listener [Log4j (org.slf4j.impl.Log4jLoggerFactory)]
   [junit4]   2> 1493295 T5962 oasc.CoreContainer.load Node Name: 127.0.0.1
   [junit4]   2> 1493295 T5962 oasc.ZkContainer.initZooKeeper Zookeeper client=127.0.0.1:20738/solr
   [junit4]   2> 1493295 T5962 oasc.ZkController.checkChrootPath zkHost includes chroot
   [junit4]   2> 1493295 T5962 oascc.SolrZkClient.createZkCredentialsToAddAutomatically Using default ZkCredentialsProvider
   [junit4]   2> 1493296 T5962 oascc.ConnectionManager.waitForConnected Waiting for client to connect to ZooKeeper
   [junit4]   2> 1493297 T5985 oascc.ConnectionManager.process Watcher org.apache.solr.common.cloud.ConnectionManager@3e33214f name:ZooKeeperConnection Watcher:127.0.0.1:20738 got event WatchedEvent state:SyncConnected type:None path:null path:null type:None
   [junit4]   2> 1493298 T5962 oascc.ConnectionManager.waitForConnected Client is connected to ZooKeeper
   [junit4]   2> 1493299 T5962 oascc.SolrZkClient.createZkACLProvider Using default ZkACLProvider
   [junit4]   2> 1493301 T5962 oascc.ConnectionManager.waitForConnected Waiting for client to connect to ZooKeeper
   [junit4]   2> 1493302 T5988 oascc.ConnectionManager.process Watcher org.apache.solr.common.cloud.ConnectionManager@6718d986 name:ZooKeeperConnection Watcher:127.0.0.1:20738/solr got event WatchedEvent state:SyncConnected type:None path:null path:null type:None
   [junit4]   2> 1493302 T5962 oascc.ConnectionManager.waitForConnected Client is connected to ZooKeeper
   [junit4]   2> 1493303 T5962 oascc.SolrZkClient.makePath makePath: /overseer/queue
   [junit4]   2> 1493304 T5962 oascc.SolrZkClient.makePath makePath: /overseer/collection-queue-work
   [junit4]   2> 1493305 T5962 oascc.SolrZkClient.makePath makePath: /overseer/collection-map-running
   [junit4]   2> 1493307 T5962 oascc.SolrZkClient.makePath makePath: /overseer/collection-map-completed
   [junit4]   2> 1493308 T5962 oascc.SolrZkClient.makePath makePath: /overseer/collection-map-failure
   [junit4]   2> 1493309 T5962 oascc.SolrZkClient.makePath makePath: /live_nodes
   [junit4]   2> 1493310 T5962 oascc.SolrZkClient.makePath makePath: /aliases.json
   [junit4]   2> 1493311 T5962 oascc.SolrZkClient.makePath makePath: /clusterstate.json
   [junit4]   2> 1493312 T5962 oasc.ZkController.createEphemeralLiveNode Register node as live in ZooKeeper:/live_nodes/127.0.0.1:20743_zg
   [junit4]   2> 1493312 T5962 oascc.SolrZkClient.makePath makePath: /live_nodes/127.0.0.1:20743_zg
   [junit4]   2> 1493313 T5962 oascc.SolrZkClient.makePath makePath: /overseer_elect
   [junit4]   2> 1493314 T5962 oascc.SolrZkClient.makePath makePath: /overseer_elect/election
   [junit4]   2> 1493315 T5962 oasc.Overseer.close Overseer (id=null) closing
   [junit4]   2> 1493316 T5962 oasc.OverseerElectionContext.runLeaderProcess I am going to be the leader 127.0.0.1:20743_zg
   [junit4]   2> 1493316 T5962 oascc.SolrZkClient.makePath makePath: /overseer_elect/leader
   [junit4]   2> 1493317 T5962 oasc.Overseer.start Overseer (id=93617987373367299-127.0.0.1:20743_zg-n_0000000000) starting
   [junit4]   2> 1493318 T5962 oascc.SolrZkClient.makePath makePath: /overseer/queue-work
   [junit4]   2> 1493322 T5962 oasc.OverseerAutoReplicaFailoverThread.<init> Starting OverseerAutoReplicaFailoverThread autoReplicaFailoverWorkLoopDelay=10000 autoReplicaFailoverWaitAfterExpiration=30000 autoReplicaFailoverBadNodeExpiration=60000
   [junit4]   2> 1493323 T5990 oasc.OverseerCollectionProcessor.run Process current queue of collection creations
   [junit4]   2> 1493323 T5962 oascc.ZkStateReader.createClusterStateWatchersAndUpdate Updating cluster state from ZooKeeper... 
   [junit4]   2> 1493323 T5989 oasc.Overseer$ClusterStateUpdater.run Starting to work on the main queue
   [junit4]   2> 1493326 T5962 oasc.CorePropertiesLocator.discover Looking for core definitions underneath /usr/home/jenkins/jenkins-slave/workspace/Lucene-Solr-Tests-5.x-Java7/solr/build/solr-core/test/J2/temp/solr.cloud.TestRebalanceLeaders ED4E1CF455B33B43-001/control-001/cores
   [junit4]   2> 1493328 T5962 oasc.CoreDescriptor.<init> CORE DESCRIPTOR: {name=collection1, dataDir=data/, shard=, config=solrconfig.xml, instanceDir=/usr/home/jenkins/jenkins-slave/workspace/Lucene-Solr-Tests-5.x-Java7/solr/build/solr-core/test/J2/temp/solr.cloud.TestRebalanceLeaders ED4E1CF455B33B43-001/control-001/cores/collection1, loadOnStartup=true, schema=schema.xml, transient=false, collection=control_collection, coreNodeName=, absoluteInstDir=/usr/home/jenkins/jenkins-slave/workspace/Lucene-Solr-Tests-5.x-Java7/solr/build/solr-core/test/J2/temp/solr.cloud.TestRebalanceLeaders ED4E1CF455B33B43-001/control-001/cores/collection1/}
   [junit4]   2> 1493329 T5962 oasc.CorePropertiesLocator.discoverUnder Found core collection1 in /usr/home/jenkins/jenkins-slave/workspace/Lucene-Solr-Tests-5.x-Java7/solr/build/solr-core/test/J2/temp/solr.cloud.TestRebalanceLeaders ED4E1CF455B33B43-001/control-001/cores/collection1/
   [junit4]   2> 1493329 T5962 oasc.CorePropertiesLocator.discover Found 1 core definitions
   [junit4]   2> 1493330 T5992 C:control_collection c:collection1 oasc.ZkController.publish publishing core=collection1 state=down collection=control_collection
   [junit4]   2> 1493330 T5992 C:control_collection c:collection1 oasc.ZkController.publish numShards not found on descriptor - reading it from system property
   [junit4]   2> 1493330 T5988 oasc.DistributedQueue$LatchWatcher.process NodeChildrenChanged fired on path /overseer/queue state SyncConnected
   [junit4]   2> 1493330 T5992 C:control_collection c:collection1 oasc.ZkController.waitForCoreNodeName look for our core node name
   [junit4]   2> 1493331 T5989 oasc.Overseer$ClusterStateUpdater.run processMessage: queueSize: 1, message = {
   [junit4]   2> 	  "roles":null,
   [junit4]   2> 	  "base_url":"http://127.0.0.1:20743/zg",
   [junit4]   2> 	  "collection":"control_collection",
   [junit4]   2> 	  "node_name":"127.0.0.1:20743_zg",
   [junit4]   2> 	  "core":"collection1",
   [junit4]   2> 	  "state":"down",
   [junit4]   2> 	  "numShards":"1",
   [junit4]   2> 	  "shard":null,
   [junit4]   2> 	  "operation":"state"} current state version: 0
   [junit4]   2> 1493331 T5989 oasco.ReplicaMutator.updateState Update state numShards=1 message={
   [junit4]   2> 	  "roles":null,
   [junit4]   2> 	  "base_url":"http://127.0.0.1:20743/zg",
   [junit4]   2> 	  "collection":"control_collection",
   [junit4]   2> 	  "node_name":"127.0.0.1:20743_zg",
   [junit4]   2> 	  "core":"collection1",
   [junit4]   2> 	  "state":"down",
   [junit4]   2> 	  "numShards":"1",
   [junit4]   2> 	  "shard":null,
   [junit4]   2> 	  "operation":"state"}
   [junit4]   2> 1493332 T5989 oasco.ClusterStateMutator.createCollection building a new cName: control_collection
   [junit4]   2> 1493332 T5989 oasco.ReplicaMutator.updateState Assigning new node to shard shard=shard1
   [junit4]   2> 1493333 T5988 oascc.ZkStateReader$2.process A cluster state change: WatchedEvent state:SyncConnected type:NodeDataChanged path:/clusterstate.json, has occurred - updating... (live nodes size: 1)
   [junit4]   2> 1494331 T5992 C:control_collection c:collection1 oasc.ZkController.waitForShardId waiting to find shard id in clusterstate for collection1
   [junit4]   2> 1494332 T5992 C:control_collection c:collection1 oasc.ZkController.createCollectionZkNode Check for collection zkNode:control_collection
   [junit4]   2> 1494332 T5992 C:control_collection c:collection1 oasc.ZkController.createCollectionZkNode Collection zkNode exists
   [junit4]   2> 1494332 T5992 C:control_collection c:collection1 oascc.ZkStateReader.readConfigName Load collection config from:/collections/control_collection
   [junit4]   2> 1494333 T5992 C:control_collection c:collection1 oascc.ZkStateReader.readConfigName path=/collections/control_collection configName=conf1 specified config exists in ZooKeeper
   [junit4]   2> 1494333 T5992 C:control_collection c:collection1 oasc.SolrResourceLoader.<init> new SolrResourceLoader for directory: '/usr/home/jenkins/jenkins-slave/workspace/Lucene-Solr-Tests-5.x-Java7/solr/build/solr-core/test/J2/temp/solr.cloud.TestRebalanceLeaders ED4E1CF455B33B43-001/control-001/cores/collection1/'
   [junit4]   2> 1494346 T5992 C:control_collection c:collection1 oasc.ZkController.watchZKConfDir watch zkdir /configs/conf1
   [junit4]   2> 1494348 T5992 C:control_collection c:collection1 oasc.Config.<init> loaded config solrconfig.xml with version 0 
   [junit4]   2> 1494355 T5992 C:control_collection c:collection1 oasc.SolrConfig.refreshRequestParams current version of requestparams : -1
   [junit4]   2> 1494370 T5992 C:control_collection c:collection1 oasc.SolrConfig.<init> Using Lucene MatchVersion: 5.2.0
   [junit4]   2> 1494439 T5992 C:control_collection c:collection1 oasc.SolrConfig.<init> Loaded SolrConfig: solrconfig.xml
   [junit4]   2> 1494540 T5992 C:control_collection c:collection1 oass.IndexSchema.readSchema Reading Solr Schema from /configs/conf1/schema.xml
   [junit4]   2> 1494549 T5992 C:control_collection c:collection1 oass.IndexSchema.readSchema [collection1] Schema name=test
   [junit4]   2> 1494886 T5992 C:control_collection c:collection1 oass.IndexSchema.readSchema default search field in schema is text
   [junit4]   2> 1494888 T5992 C:control_collection c:collection1 oass.IndexSchema.readSchema unique key field: id
   [junit4]   2> 1494890 T5992 C:control_collection c:collection1 oass.FileExchangeRateProvider.reload Reloading exchange rates from file currency.xml
   [junit4]   2> 1494893 T5992 C:control_collection c:collection1 oass.FileExchangeRateProvider.reload Reloading exchange rates from file currency.xml
   [junit4]   2> 1494905 T5992 C:control_collection c:collection1 oasc.CoreContainer.create Creating SolrCore 'collection1' using configuration from collection control_collection
   [junit4]   2> 1494906 T5992 C:control_collection c:collection1 oasc.SolrCore.initDirectoryFactory org.apache.solr.core.MockDirectoryFactory
   [junit4]   2> 1494906 T5992 C:control_collection c:collection1 oasc.SolrCore.<init> [collection1] Opening new SolrCore at /usr/home/jenkins/jenkins-slave/workspace/Lucene-Solr-Tests-5.x-Java7/solr/build/solr-core/test/J2/temp/solr.cloud.TestRebalanceLeaders ED4E1CF455B33B43-001/control-001/cores/collection1/, dataDir=/usr/home/jenkins/jenkins-slave/workspace/Lucene-Solr-Tests-5.x-Java7/solr/build/solr-core/test/J2/temp/solr.cloud.TestRebalanceLeaders ED4E1CF455B33B43-001/control-001/cores/collection1/data/
   [junit4]   2> 1494906 T5992 C:control_collection c:collection1 oasc.JmxMonitoredMap.<init> JMX monitoring is enabled. Adding Solr mbeans to JMX Server: com.sun.jmx.mbeanserver.JmxMBeanServer@4bc15184
   [junit4]   2> 1494907 T5992 C:control_collection c:collection1 oasc.CachingDirectoryFactory.get return new directory for /usr/home/jenkins/jenkins-slave/workspace/Lucene-Solr-Tests-5.x-Java7/solr/build/solr-core/test/J2/temp/solr.cloud.TestRebalanceLeaders ED4E1CF455B33B43-001/control-001/cores/collection1/data
   [junit4]   2> 1494907 T5992 C:control_collection c:collection1 oasc.SolrCore.getNewIndexDir New index directory detected: old=null new=/usr/home/jenkins/jenkins-slave/workspace/Lucene-Solr-Tests-5.x-Java7/solr/build/solr-core/test/J2/temp/solr.cloud.TestRebalanceLeaders ED4E1CF455B33B43-001/control-001/cores/collection1/data/index/
   [junit4]   2> 1494907 T5992 C:control_collection c:collection1 oasc.SolrCore.initIndex WARN [collection1] Solr index directory '/usr/home/jenkins/jenkins-slave/workspace/Lucene-Solr-Tests-5.x-Java7/solr/build/solr-core/test/J2/temp/solr.cloud.TestRebalanceLeaders ED4E1CF455B33B43-001/control-001/cores/collection1/data/index' doesn't exist. Creating new index...
   [junit4]   2> 1494907 T5992 C:control_collection c:collection1 oasc.CachingDirectoryFactory.get return new directory for /usr/home/jenkins/jenkins-slave/workspace/Lucene-Solr-Tests-5.x-Java7/solr/build/solr-core/test/J2/temp/solr.cloud.TestRebalanceLeaders ED4E1CF455B33B43-001/control-001/cores/collection1/data/index
   [junit4]   2> 1494908 T5992 C:control_collection c:collection1 oasu.RandomMergePolicy.<init> RandomMergePolicy wrapping class org.apache.lucene.index.TieredMergePolicy: [TieredMergePolicy: maxMergeAtOnce=26, maxMergeAtOnceExplicit=48, maxMergedSegmentMB=96.4521484375, floorSegmentMB=1.4296875, forceMergeDeletesPctAllowed=18.51724424491889, segmentsPerTier=41.0, maxCFSSegmentSizeMB=8.796093022207999E12, noCFSRatio=0.0
   [junit4]   2> 1494908 T5992 C:control_collection c:collection1 oasc.SolrDeletionPolicy.onCommit SolrDeletionPolicy.onCommit: commits: num=1
   [junit4]   2> 		commit{dir=MockDirectoryWrapper(RAMDirectory@4e06e62a lockFactory=org.apache.lucene.store.SingleInstanceLockFactory@26f0f76b),segFN=segments_1,generation=1}
   [junit4]   2> 1494909 T5992 C:control_collection c:collection1 oasc.SolrDeletionPolicy.updateCommits newest commit generation = 1
   [junit4]   2> 1494912 T5992 C:control_collection c:collection1 oasup.UpdateRequestProcessorChain.init creating updateRequestProcessorChain "nodistrib"
   [junit4]   2> 1494913 T5992 C:control_collection c:collection1 oasup.UpdateRequestProcessorChain.init creating updateRequestProcessorChain "dedupe"
   [junit4]   2> 1494913 T5992 C:control_collection c:collection1 oasup.UpdateRequestProcessorChain.init inserting DistributedUpdateProcessorFactory into updateRequestProcessorChain "dedupe"
   [junit4]   2> 1494913 T5992 C:control_collection c:collection1 oasup.UpdateRequestProcessorChain.init creating updateRequestProcessorChain "stored_sig"
   [junit4]   2> 1494913 T5992 C:control_collection c:collection1 oasup.UpdateRequestProcessorChain.init inserting DistributedUpdateProcessorFactory into updateRequestProcessorChain "stored_sig"
   [junit4]   2> 1494913 T5992 C:control_collection c:collection1 oasup.UpdateRequestProcessorChain.init creating updateRequestProcessorChain "distrib-dup-test-chain-explicit"
   [junit4]   2> 1494914 T5992 C:control_collection c:collection1 oasup.UpdateRequestProcessorChain.init creating updateRequestProcessorChain "distrib-dup-test-chain-implicit"
   [junit4]   2> 1494914 T5992 C:control_collection c:collection1 oasup.UpdateRequestProcessorChain.init inserting DistributedUpdateProcessorFactory into updateRequestProcessorChain "distrib-dup-test-chain-implicit"
   [junit4]   2> 1494914 T5992 C:control_collection c:collection1 oasc.SolrCore.loadUpdateProcessorChains no updateRequestProcessorChain defined as default, creating implicit default
   [junit4]   2> 1494926 T5992 C:control_collection c:collection1 oashl.XMLLoader.init xsltCacheLifetimeSeconds=60
   [junit4]   2> 1494928 T5992 C:control_collection c:collection1 oashl.XMLLoader.init xsltCacheLifetimeSeconds=60
   [junit4]   2> 1494929 T5992 C:control_collection c:collection1 oashl.XMLLoader.init xsltCacheLifetimeSeconds=60
   [junit4]   2> 1494930 T5992 C:control_collection c:collection1 oashl.XMLLoader.init xsltCacheLifetimeSeconds=60
   [junit4]   2> 1494934 T5992 C:control_collection c:collection1 oasc.RequestHandlers.initHandlersFromConfig Registered paths: /update/json,/admin/plugins,/update/json/docs,/update/csv,/admin/ping,/config,/admin/luke,/admin/system,/admin/threads,/schema,/admin/file,/update,/admin/mbeans,/admin/logging,standard,/admin/segments,/replication,/get,/admin/properties
   [junit4]   2> 1494935 T5992 C:control_collection c:collection1 oasc.SolrCore.initStatsCache Using default statsCache cache: org.apache.solr.search.stats.LocalStatsCache
   [junit4]   2> 1494936 T5992 C:control_collection c:collection1 oasu.UpdateHandler.<init> Using UpdateLog implementation: org.apache.solr.update.UpdateLog
   [junit4]   2> 1494936 T5992 C:control_collection c:collection1 oasu.UpdateLog.init Initializing UpdateLog: dataDir= defaultSyncLevel=FLUSH numRecordsToKeep=100 maxNumLogsToKeep=10
   [junit4]   2> 1494937 T5992 C:control_collection c:collection1 oasu.CommitTracker.<init> Hard AutoCommit: disabled
   [junit4]   2> 1494937 T5992 C:control_collection c:collection1 oasu.CommitTracker.<init> Soft AutoCommit: disabled
   [junit4]   2> 1494938 T5992 C:control_collection c:collection1 oasu.RandomMergePolicy.<init> RandomMergePolicy wrapping class org.apache.lucene.index.LogDocMergePolicy: [LogDocMergePolicy: minMergeSize=1000, mergeFactor=15, maxMergeSize=9223372036854775807, maxMergeSizeForForcedMerge=9223372036854775807, calibrateSizeByDeletes=true, maxMergeDocs=2147483647, maxCFSSegmentSizeMB=8.796093022207999E12, noCFSRatio=1.0]
   [junit4]   2> 1494938 T5992 C:control_collection c:collection1 oasc.SolrDeletionPolicy.onInit SolrDeletionPolicy.onInit: commits: num=1
   [junit4]   2> 		commit{dir=MockDirectoryWrapper(RAMDirectory@4e06e62a lockFactory=org.apache.lucene.store.SingleInstanceLockFactory@26f0f76b),segFN=segments_1,generation=1}
   [junit4]   2> 1494938 T5992 C:control_collection c:collection1 oasc.SolrDeletionPolicy.updateCommits newest commit generation = 1
   [junit4]   2> 1494939 T5992 C:control_collection c:collection1 oass.SolrIndexSearcher.<init> Opening Searcher@1268aa85[collection1] main
   [junit4]   2> 1494939 T5992 C:control_collection c:collection1 oascc.ZkStateReader.readConfigName Load collection config from:/collections/control_collection
   [junit4]   2> 1494940 T5992 C:control_collection c:collection1 oascc.ZkStateReader.readConfigName path=/collections/control_collection configName=conf1 specified config exists in ZooKeeper
   [junit4]   2> 1494940 T5992 C:control_collection c:collection1 oasr.ManagedResourceStorage.newStorageIO Setting up ZooKeeper-based storage for the RestManager with znodeBase: /configs/conf1
   [junit4]   2> 1494940 T5992 C:control_collection c:collection1 oasr.ManagedResourceStorage$ZooKeeperStorageIO.configure Configured ZooKeeperStorageIO with znodeBase: /configs/conf1
   [junit4]   2> 1494940 T5992 C:control_collection c:collection1 oasr.RestManager.init Initializing RestManager with initArgs: {}
   [junit4]   2> 1494940 T5992 C:control_collection c:collection1 oasr.ManagedResourceStorage.load Reading _rest_managed.json using ZooKeeperStorageIO:path=/configs/conf1
   [junit4]   2> 1494941 T5992 C:control_collection c:collection1 oasr.ManagedResourceStorage$ZooKeeperStorageIO.openInputStream No data found for znode /configs/conf1/_rest_managed.json
   [junit4]   2> 1494941 T5992 C:control_collection c:collection1 oasr.ManagedResourceStorage.load Loaded null at path _rest_managed.json using ZooKeeperStorageIO:path=/configs/conf1
   [junit4]   2> 1494941 T5992 C:control_collection c:collection1 oasr.RestManager.init Initializing 0 registered ManagedResources
   [junit4]   2> 1494941 T5992 C:control_collection c:collection1 oash.ReplicationHandler.inform Commits will be reserved for  10000
   [junit4]   2> 1494942 T5993 C:control_collection c:collection1 oasc.SolrCore.registerSearcher [collection1] Registered new searcher Searcher@1268aa85[collection1] main{ExitableDirectoryReader(UninvertingDirectoryReader())}
   [junit4]   2> 1494943 T5992 C:control_collection c:collection1 oasc.CoreContainer.registerCore registering core: collection1
   [junit4]   2> 1494943 T5996 C:control_collection S:shard1 oasc.ZkController.register Register replica - core:collection1 address:http://127.0.0.1:20743/zg collection:control_collection shard:shard1
   [junit4]   2> 1494944 T5962 oass.SolrDispatchFilter.init user.dir=/usr/home/jenkins/jenkins-slave/workspace/Lucene-Solr-Tests-5.x-Java7/solr/build/solr-core/test/J2
   [junit4]   2> 1494944 T5962 oass.SolrDispatchFilter.init SolrDispatchFilter.init() done
   [junit4]   2> 1494944 T5996 C:control_collection S:shard1 oascc.SolrZkClient.makePath makePath: /collections/control_collection/leader_elect/shard1/election
   [junit4]   2> 1494946 T5962 oascc.SolrZkClient.createZkCredentialsToAddAutomatically Using default ZkCredentialsProvider
   [junit4]   2> 1494947 T5962 oascc.ConnectionManager.waitForConnected Waiting for client to connect to ZooKeeper
   [junit4]   2> 1494948 T5996 C:control_collection S:shard1 oasc.ShardLeaderElectionContext.runLeaderProcess Running the leader process for shard shard1
   [junit4]   2> 1494948 T5999 oascc.ConnectionManager.process Watcher org.apache.solr.common.cloud.ConnectionManager@7a1acfd1 name:ZooKeeperConnection Watcher:127.0.0.1:20738/solr got event WatchedEvent state:SyncConnected type:None path:null path:null type:None
   [junit4]   2> 1494949 T5962 oascc.ConnectionManager.waitForConnected Client is connected to ZooKeeper
   [junit4]   2> 1494949 T5962 oascc.SolrZkClient.createZkACLProvider Using default ZkACLProvider
   [junit4]   2> 1494950 T5962 oascc.ZkStateReader.createClusterStateWatchersAndUpdate Updating cluster state from ZooKeeper... 
   [junit4]   2> 1494950 T5996 C:control_collection S:shard1 oasc.ShardLeaderElectionContext.waitForReplicasToComeUp Enough replicas found to continue.
   [junit4]   2> 1494950 T5996 C:control_collection S:shard1 oasc.ShardLeaderElectionContext.runLeaderProcess I may be the new leader - try and sync
   [junit4]   2> 1494950 T5988 oasc.DistributedQueue$LatchWatcher.process NodeChildrenChanged fired on path /overseer/queue state SyncConnected
   [junit4]   2> ASYNC  NEW_CORE C2726 name=collection1 org.apache.solr.core.SolrCore@46237e29 url=http://127.0.0.1:20743/zg/collection1 node=127.0.0.1:20743_zg C2726_STATE=coll:control_collection core:collection1 props:{base_url=http://127.0.0.1:20743/zg, node_name=127.0.0.1:20743_zg, core=collection1, state=down}
   [junit4]   2> 1494950 T5996 C:control_collection S:shard1 C2726 P20743 oasc.SyncStrategy.sync Sync replicas to http://127.0.0.1:20743/zg/collection1/
   [junit4]   2> 1494951 T5996 C:control_collection S:shard1 C2726 P20743 oasc.SyncStrategy.syncReplicas Sync Success - now sync replicas to me
   [junit4]   2> 1494951 T5996 C:control_collection S:shard1 C2726 P20743 oasc.SyncStrategy.syncToMe http://127.0.0.1:20743/zg/collection1/ has no replicas
   [junit4]   2> 1494951 T5989 oasc.Overseer$ClusterStateUpdater.run processMessage: queueSize: 1, message = {
   [junit4]   2> 	  "operation":"leader",
   [junit4]   2> 	  "shard":"shard1",
   [junit4]   2> 	  "collection":"control_collection"} current state version: 1
   [junit4]   2> 1494951 T5996 C:control_collection S:shard1 oasc.ShardLeaderElectionContext.runLeaderProcess I am the new leader: http://127.0.0.1:20743/zg/collection1/ shard1
   [junit4]   2> 1494952 T5962 oasc.ChaosMonkey.monkeyLog monkey: init - expire sessions:false cause connection loss:false
   [junit4]   2> 1494952 T5996 C:control_collection S:shard1 oascc.SolrZkClient.makePath makePath: /collections/control_collection/leaders/shard1
   [junit4]   2> 1494952 T5962 oasc.AbstractFullDistribZkTestBase.createJettys Creating collection1 with stateFormat=2
   [junit4]   2> 1494952 T5999 oascc.ZkStateReader$2.process A cluster state change: WatchedEvent state:SyncConnected type:NodeDataChanged path:/clusterstate.json, has occurred - updating... (live nodes size: 1)
   [junit4]   2> 1494952 T5962 oascc.SolrZkClient.createZkCredentialsToAddAutomatically Using default ZkCredentialsProvider
   [junit4]   2> 1494952 T5988 oascc.ZkStateReader$2.process A cluster state change: WatchedEvent state:SyncConnected type:NodeDataChanged path:/clusterstate.json, has occurred - updating... (live nodes size: 1)
   [junit4]   2> 1494954 T5962 oascc.ConnectionManager.waitForConnected Waiting for client to connect to ZooKeeper
   [junit4]   2> 1494956 T6002 oascc.ConnectionManager.process Watcher org.apache.solr.common.cloud.ConnectionManager@4cf39acf name:ZooKeeperConnection Watcher:127.0.0.1:20738/solr got event WatchedEvent state:SyncConnected type:None path:null path:null type:None
   [junit4]   2> 1494956 T5962 oascc.ConnectionManager.waitForConnected Client is connected to ZooKeeper
   [junit4]   2> 1494956 T5962 oascc.SolrZkClient.createZkACLProvider Using default ZkACLProvider
   [junit4]   2> 1494957 T5988 oasc.DistributedQueue$LatchWatcher.process NodeChildrenChanged fired on path /overseer/queue state SyncConnected
   [junit4]   2> 1494958 T5989 oasc.Overseer$ClusterStateUpdater.run processMessage: queueSize: 1, message = {
   [junit4]   2> 	  "operation":"leader",
   [junit4]   2> 	  "shard":"shard1",
   [junit4]   2> 	  "collection":"control_collection",
   [junit4]   2> 	  "base_url":"http://127.0.0.1:20743/zg",
   [junit4]   2> 	  "core":"collection1",
   [junit4]   2> 	  "state":"active"} current state version: 2
   [junit4]   2> 1494960 T5989 oasc.Overseer$ClusterStateUpdater.run processMessage: queueSize: 1, message = {
   [junit4]   2> 	  "operation":"create",
   [junit4]   2> 	  "name":"collection1",
   [junit4]   2> 	  "numShards":"4",
   [junit4]   2> 	  "stateFormat":"2"} current state version: 2
   [junit4]   2> 1494960 T5989 oasco.ClusterStateMutator.createCollection building a new cName: collection1
   [junit4]   2> 1494961 T5999 oascc.ZkStateReader$2.process A cluster state change: WatchedEvent state:SyncConnected type:NodeDataChanged path:/clusterstate.json, has occurred - updating... (live nodes size: 1)
   [junit4]   2> 1494961 T5988 oascc.ZkStateReader$2.process A cluster state change: WatchedEvent state:SyncConnected type:NodeDataChanged path:/clusterstate.json, has occurred - updating... (live nodes size: 1)
   [junit4]   2> 1494963 T5988 oasc.DistributedQueue$LatchWatcher.process NodeChildrenChanged fired on path /overseer/queue state SyncConnected
   [junit4]   2> 1494963 T5989 oasco.ZkStateWriter.writePendingUpdates going to create_collection /collections/collection1/state.json
   [junit4]   2> 1494964 T5999 oascc.ZkStateReader$2.process A cluster state change: WatchedEvent state:SyncConnected type:NodeDataChanged path:/clusterstate.json, has occurred - updating... (live nodes size: 1)
   [junit4]   2> 1494964 T5988 oascc.ZkStateReader$2.process A cluster state change: WatchedEvent state:SyncConnected type:NodeDataChanged path:/clusterstate.json, has occurred - updating... (live nodes size: 1)
   [junit4]   2> 1495008 T5996 C:control_collection S:shard1 oasc.ZkController.register We are http://127.0.0.1:20743/zg/collection1/ and leader is http://127.0.0.1:20743/zg/collection1/
   [junit4]   2> 1495009 T5996 C:control_collection S:shard1 oasc.ZkController.register No LogReplay needed for core=collection1 baseURL=http://127.0.0.1:20743/zg
   [junit4]   2> 1495009 T5996 C:control_collection S:shard1 oasc.ZkController.checkRecovery I am the leader, no recovery necessary
   [junit4]   2> 1495009 T5996 C:control_collection S:shard1 c:collection1 oasc.ZkController.publish publishing core=collection1 state=active collection=control_collection
   [junit4]   2> 1495009 T5996 C:control_collection S:shard1 c:collection1 oasc.ZkController.publish numShards not found on descriptor - reading it from system property
   [junit4]   2> 1495011 T5988 oasc.DistributedQueue$LatchWatcher.process NodeChildrenChanged fired on path /overseer/queue state SyncConnected
   [junit4]   2> 1495011 T5989 oasc.Overseer$ClusterStateUpdater.run processMessage: queueSize: 1, message = {
   [junit4]   2> 	  "core_node_name":"core_node1",
   [junit4]   2> 	  "roles":null,
   [junit4]   2> 	  "base_url":"http://127.0.0.1:20743/zg",
   [junit4]   2> 	  "collection":"control_collection",
   [junit4]   2> 	  "node_name":"127.0.0.1:20743_zg",
   [junit4]   2> 	  "core":"collection1",
   [junit4]   2> 	  "state":"active",
   [junit4]   2> 	  "numShards":"4",
   [junit4]   2> 	  "shard":"shard1",
   [junit4]   2> 	  "operation":"state"} current state version: 4
   [junit4]   2> 1495012 T5989 oasco.ReplicaMutator.updateState Update state numShards=4 message={
   [junit4]   2> 	  "core_node_name":"core_node1",
   [junit4]   2> 	  "roles":null,
   [junit4]   2> 	  "base_url":"http://127.0.0.1:20743/zg",
   [junit4]   2> 	  "collection":"control_collection",
   [junit4]   2> 	  "node_name":"127.0.0.1:20743_zg",
   [junit4]   2> 	  "core":"collection1",
   [junit4]   2> 	  "state":"active",
   [junit4]   2> 	  "numShards":"4",
   [junit4]   2> 	  "shard":"shard1",
   [junit4]   2> 	  "operation":"state"}
   [junit4]   2> 1495115 T5988 oascc.ZkStateReader$2.process A cluster state change: WatchedEvent state:SyncConnected type:NodeDataChanged path:/clusterstate.json, has occurred - updating... (live nodes size: 1)
   [junit4]   2> 1495115 T5999 oascc.ZkStateReader$2.process A cluster state change: WatchedEvent state:SyncConnected type:NodeDataChanged path:/clusterstate.json, has occurred - updating... (live nodes size: 1)
   [junit4]   2> 1496198 T5962 oas.SolrTestCaseJ4.writeCoreProperties Writing core.properties file to /usr/home/jenkins/jenkins-slave/workspace/Lucene-Solr-Tests-5.x-Java7/solr/build/solr-core/test/J2/temp/solr.cloud.TestRebalanceLeaders ED4E1CF455B33B43-001/shard-1-001/cores/collection1
   [junit4]   2> 1496200 T5962 oasc.AbstractFullDistribZkTestBase.createJettys create jetty 1 in directory /usr/home/jenkins/jenkins-slave/workspace/Lucene-Solr-Tests-5.x-Java7/solr/build/solr-core/test/J2/temp/solr.cloud.TestRebalanceLeaders ED4E1CF455B33B43-001/shard-1-001
   [junit4]   2> 1496201 T5962 oejs.Server.doStart jetty-8.1.10.v20130312
   [junit4]   2> 1496203 T5962 oejs.AbstractConnector.doStart Started SocketConnector@127.0.0.1:20767
   [junit4]   2> 1496204 T5962 oascse.JettySolrRunner$1.lifeCycleStarted Jetty properties: {hostPort=20767, solr.data.dir=/usr/home/jenkins/jenkins-slave/workspace/Lucene-Solr-Tests-5.x-Java7/solr/build/solr-core/test/J2/temp/solr.cloud.TestRebalanceLeaders ED4E1CF455B33B43-001/tempDir-001/jetty1, coreRootDirectory=/usr/home/jenkins/jenkins-slave/workspace/Lucene-Solr-Tests-5.x-Java7/solr/build/solr-core/test/J2/../../../../../../../../../../../usr/home/jenkins/jenkins-slave/workspace/Lucene-Solr-Tests-5.x-Java7/solr/build/solr-core/test/J2/temp/solr.cloud.TestRebalanceLeaders ED4E1CF455B33B43-001/shard-1-001/cores, hostContext=/zg, solrconfig=solrconfig.xml}
   [junit4]   2> 1496204 T5962 oass.SolrDispatchFilter.init SolrDispatchFilter.init()sun.misc.Launcher$AppClassLoader@631d75b9
   [junit4]   2> 1496205 T5962 oasc.SolrResourceLoader.<init> new SolrResourceLoader for directory: '/usr/home/jenkins/jenkins-slave/workspace/Lucene-Solr-Tests-5.x-Java7/solr/build/solr-core/test/J2/../../../../../../../../../../../usr/home/jenkins/jenkins-slave/workspace/Lucene-Solr-Tests-5.x-Java7/solr/build/solr-core/test/J2/temp/solr.cloud.TestRebalanceLeaders ED4E1CF455B33B43-001/shard-1-001/'
   [junit4]   2> 1496236 T5962 oasc.SolrXmlConfig.fromFile Loading container configuration from /usr/home/jenkins/jenkins-slave/workspace/Lucene-Solr-Tests-5.x-Java7/solr/build/solr-core/test/J2/../../../../../../../../../../../usr/home/jenkins/jenkins-slave/workspace/Lucene-Solr-Tests-5.x-Java7/solr/build/solr-core/test/J2/temp/solr.cloud.TestRebalanceLeaders ED4E1CF455B33B43-001/shard-1-001/solr.xml
   [junit4]   2> 1496273 T5962 oasc.CorePropertiesLocator.<init> Config-defined core root directory: /usr/home/jenkins/jenkins-slave/workspace/Lucene-Solr-Tests-5.x-Java7/solr/build/solr-core/test/J2/../../../../../../../../../../../usr/home/jenkins/jenkins-slave/workspace/Lucene-Solr-Tests-5.x-Java7/solr/build/solr-core/test/J2/temp/solr.cloud.TestRebalanceLeaders ED4E1CF455B33B43-001/shard-1-001/cores
   [junit4]   2> 1496274 T5962 oasc.CoreContainer.<init> New CoreContainer 211441626
   [junit4]   2> 1496274 T5962 oasc.CoreContainer.load Loading cores into CoreContainer [instanceDir=/usr/home/jenkins/jenkins-slave/workspace/Lucene-Solr-Tests-5.x-Java7/solr/build/solr-core/test/J2/../../../../../../../../../../../usr/home/jenkins/jenkins-slave/workspace/Lucene-Solr-Tests-5.x-Java7/solr/build/solr-core/test/J2/temp/solr.cloud.TestRebalanceLeaders ED4E1CF455B33B43-001/shard-1-001/]
   [junit4]   2> 1496274 T5962 oasc.CoreContainer.load loading shared library: /usr/home/jenkins/jenkins-slave/workspace/Lucene-Solr-Tests-5.x-Java7/solr/build/solr-core/test/J2/../../../../../../../../../../../usr/home/jenkins/jenkins-slave/workspace/Lucene-Solr-Tests-5.x-Java7/solr/build/solr-core/test/J2/temp/solr.cloud.TestRebalanceLeaders ED4E1CF455B33B43-001/shard-1-001/lib
   [junit4]   2> 1496275 T5962 oasc.SolrResourceLoader.addToClassLoader WARN Can't find (or read) directory to add to classloader: lib (resolved as: /usr/home/jenkins/jenkins-slave/workspace/Lucene-Solr-Tests-5.x-Java7/solr/build/solr-core/test/J2/../../../../../../../../../../../usr/home/jenkins/jenkins-slave/workspace/Lucene-Solr-Tests-5.x-Java7/solr/build/solr-core/test/J2/temp/solr.cloud.TestRebalanceLeaders ED4E1CF455B33B43-001/shard-1-001/lib).
   [junit4]   2> 1496284 T5962 oashc.HttpShardHandlerFactory.getParameter Setting socketTimeout to: 90000
   [junit4]   2> 1496285 T5962 oashc.HttpShardHandlerFactory.getParameter Setting urlScheme to: 
   [junit4]   2> 1496285 T5962 oashc.HttpShardHandlerFactory.getParameter Setting connTimeout to: 15000
   [junit4]   2> 1496285 T5962 oashc.HttpShardHandlerFactory.getParameter Setting maxConnectionsPerHost to: 20
   [junit4]   2> 1496285 T5962 oashc.HttpShardHandlerFactory.getParameter Setting maxConnections to: 10000
   [junit4]   2> 1496286 T5962 oashc.HttpShardHandlerFactory.getParameter Setting corePoolSize to: 0
   [junit4]   2> 1496286 T5962 oashc.HttpShardHandlerFactory.getParameter Setting maximumPoolSize to: 2147483647
   [junit4]   2> 1496286 T5962 oashc.HttpShardHandlerFactory.getParameter Setting maxThreadIdleTime to: 5
   [junit4]   2> 1496286 T5962 oashc.HttpShardHandlerFactory.getParameter Setting sizeOfQueue to: -1
   [junit4]   2> 1496286 T5962 oashc.HttpShardHandlerFactory.getParameter Setting fairnessPolicy to: false
   [junit4]   2> 1496287 T5962 oashc.HttpShardHandlerFactory.getParameter Setting useRetries to: false
   [junit4]   2> 1496291 T5962 oasu.UpdateShardHandler.<init> Creating UpdateShardHandler HTTP client with params: socketTimeout=340000&connTimeout=45000&retry=true
   [junit4]   2> 1496292 T5962 oasl.LogWatcher.createWatcher SLF4J impl is org.slf4j.impl.Log4jLoggerFactory
   [junit4]   2> 1496293 T5962 oasl.LogWatcher.newRegisteredLogWatcher Registering Log Listener [Log4j (org.slf4j.impl.Log4jLoggerFactory)]
   [junit4]   2> 1496293 T5962 oasc.CoreContainer.load Node Name: 127.0.0.1
   [junit4]   2> 1496293 T5962 oasc.ZkContainer.initZooKeeper Zookeeper client=127.0.0.1:20738/solr
   [junit4]   2> 1496293 T5962 oasc.ZkController.checkChrootPath zkHost includes chroot
   [junit4]   2> 1496293 T5962 oascc.SolrZkClient.createZkCredentialsToAddAutomatically Using default ZkCredentialsProvider
   [junit4]   2> 1496294 T5962 oascc.ConnectionManager.waitForConnected Waiting for client to connect to ZooKeeper
   [junit4]   2> 1496296 T6014 oascc.ConnectionManager.process Watcher org.apache.solr.common.cloud.ConnectionManager@179bb877 name:ZooKeeperConnection Watcher:127.0.0.1:20738 got event WatchedEvent state:SyncConnected type:None path:null path:null type:None
   [junit4]   2> 1496297 T5962 oascc.ConnectionManager.waitForConnected Client is connected to ZooKeeper
   [junit4]   2> 1496297 T5962 oascc.SolrZkClient.createZkACLProvider Using default ZkACLProvider
   [junit4]   2> 1496299 T5962 oascc.ConnectionManager.waitForConnected Waiting for client to connect to ZooKeeper
   [junit4]   2> 1496300 T6017 oascc.ConnectionManager.process Watcher org.apache.solr.common.cloud.ConnectionManager@9c04ef6 name:ZooKeeperConnection Watcher:127.0.0.1:20738/solr got event WatchedEvent state:SyncConnected type:None path:null path:null type:None
   [junit4]   2> 1496300 T5962 oascc.ConnectionManager.waitForConnected Client is connected to ZooKeeper
   [junit4]   2> 1496303 T5962 oascc.ZkStateReader.createClusterStateWatchersAndUpdate Updating cluster state from ZooKeeper... 
   [junit4]   2> 1497307 T5962 oasc.ZkController.createEphemeralLiveNode Register node as live in ZooKeeper:/live_nodes/127.0.0.1:20767_zg
   [junit4]   2> 1497308 T5962 oascc.SolrZkClient.makePath makePath: /live_nodes/127.0.0.1:20767_zg
   [junit4]   2> 1497312 T5962 oasc.Overseer.close Overseer (id=null) closing
   [junit4]   2> 1497314 T5962 oasc.CorePropertiesLocator.discover Looking for core definitions underneath /usr/home/jenkins/jenkins-slave/workspace/Lucene-Solr-Tests-5.x-Java7/solr/build/solr-core/test/J2/../../../../../../../../../../../usr/home/jenkins/jenkins-slave/workspace/Lucene-Solr-Tests-5.x-Java7/solr/build/solr-core/test/J2/temp/solr.cloud.TestRebalanceLeaders ED4E1CF455B33B43-001/shard-1-001/cores
   [junit4]   2> 1497319 T5962 oasc.CoreDescriptor.<init> CORE DESCRIPTOR: {schema=schema.xml, loadOnStartup=true, transient=false, instanceDir=/usr/home/jenkins/jenkins-slave/workspace/Lucene-Solr-Tests-5.x-Java7/solr/build/solr-core/test/J2/../../../../../../../../../../../usr/home/jenkins/jenkins-slave/workspace/Lucene-Solr-Tests-5.x-Java7/solr/build/solr-core/test/J2/temp/solr.cloud.TestRebalanceLeaders ED4E1CF455B33B43-001/shard-1-001/cores/collection1, dataDir=data/, shard=, coreNodeName=, collection=collection1, name=collection1, absoluteInstDir=/usr/home/jenkins/jenkins-slave/workspace/Lucene-Solr-Tests-5.x-Java7/solr/build/solr-core/test/J2/../../../../../../../../../../../usr/home/jenkins/jenkins-slave/workspace/Lucene-Solr-Tests-5.x-Java7/solr/build/solr-core/test/J2/temp/solr.cloud.TestRebalanceLeaders ED4E1CF455B33B43-001/shard-1-001/cores/collection1/, config=solrconfig.xml}
   [junit4]   2> 1497319 T5962 oasc.CorePropertiesLocator.discoverUnder Found core collection1 in /usr/home/jenkins/jenkins-slave/workspace/Lucene-Solr-Tests-5.x-Java7/solr/build/solr-core/test/J2/../../../../../../../../../../../usr/home/jenkins/jenkins-slave/workspace/Lucene-Solr-Tests-5.x-Java7/solr/build/solr-core/test/J2/temp/solr.cloud.TestRebalanceLeaders ED4E1CF455B33B43-001/shard-1-001/cores/collection1/
   [junit4]   2> 1497319 T5962 oasc.CorePropertiesLocator.discover Found 1 core definitions
   [junit4]   2> 1497321 T6018 C:collection1 c:collection1 oasc.ZkController.publish publishing core=collection1 state=down collection=collection1
   [junit4]   2> 1497321 T6018 C:collection1 c:collection1 oasc.ZkController.publish numShards not found on descriptor - reading it from system property
   [junit4]   2> 1497323 T5988 oasc.DistributedQueue$LatchWatcher.process NodeChildrenChanged fired on path /overseer/queue state SyncConnected
   [junit4]   2> 1497323 T6018 C:collection1 c:collection1 oasc.ZkController.preRegister Registering watch for external collection collection1
   [junit4]   2> 1497323 T6018 C:collection1 c:collection1 oascc.ZkStateReader.addZkWatch addZkWatch collection1
   [junit4]   2> 1497324 T5989 oasc.Overseer$ClusterStateUpdater.run processMessage: queueSize: 1, message = {
   [junit4]   2> 	  "roles":null,
   [junit4]   2> 	  "base_url":"http://127.0.0.1:20767/zg",
   [junit4]   2> 	  "collection":"collection1",
   [junit4]   2> 	  "node_name":"127.0.0.1:20767_zg",
   [junit4]   2> 	  "core":"collection1",
   [junit4]   2> 	  "state":"down",
   [junit4]   2> 	  "numShards":"4",
   [junit4]   2> 	  "shard":null,
   [junit4]   2> 	  "operation":"state"} current state version: 5
   [junit4]   2> 1497324 T6018 C:collection1 c:collection1 oascc.ZkStateReader.addZkWatch Updating collection state at /collections/collection1/state.json from ZooKeeper... 
   [junit4]   2> 1497324 T5989 oasco.ReplicaMutator.updateState Update state numShards=4 message={
   [junit4]   2> 	  "roles":null,
   [junit4]   2> 	  "base_url":"http://127.0.0.1:20767/zg",
   [junit4]   2> 	  "collection":"collection1",
   [junit4]   2> 	  "node_name":"127.0.0.1:20767_zg",
   [junit4]   2> 	  "core":"collection1",
   [junit4]   2> 	  "state":"down",
   [junit4]   2> 	  "numShards":"4",
   [junit4]   2> 	  "shard":null,
   [junit4]   2> 	  "operation":"state"}
   [junit4]   2> 1497324 T5989 oasco.ReplicaMutator.updateState Collection already exists with numShards=4
   [junit4]   2> 1497325 T5989 oasco.ReplicaMutator.updateState Assigning new node to shard shard=shard2
   [junit4]   2> 1497325 T6018 C:collection1 c:collection1 oascc.ZkStateReader.updateWatchedCollection Updating data for collection1 to ver 0 
   [junit4]   2> 1497325 T6018 C:collection1 c:collection1 oasc.ZkController.waitForCoreNodeName look for our core node name
   [junit4]   2> 1497326 T5989 oasco.ZkStateWriter.writePendingUpdates going to update_collection /collections/collection1/state.json version: 0
   [junit4]   2> 1497326 T6017 oascc.ZkStateReader$7.process A cluster state change: WatchedEvent state:SyncConnected type:NodeDataChanged path:/collections/collection1/state.json for collection collection1 has occurred - updating... (live nodes size: 2)
   [junit4]   2> 1497327 T6017 oascc.ZkStateReader.updateWatchedCollection Updating data for collection1 to ver 1 
   [junit4]   2> 1498325 T6018 C:collection1 c:collection1 oasc.ZkController.waitForShardId waiting to find shard id in clusterstate for collection1
   [junit4]   2> 1498326 T6018 C:collection1 c:collection1 oasc.ZkController.createCollectionZkNode Check for collection zkNode:collection1
   [junit4]   2> 1498326 T6018 C:collection1 c:collection1 oasc.ZkController.createCollectionZkNode Collection zkNode exists
   [junit4]   2> 1498326 T6018 C:collection1 c:collection1 oascc.ZkStateReader.readConfigName Load collection config from:/collections/collection1
   [junit4]   2> 1498327 T6018 C:collection1 c:collection1 oascc.ZkStateReader.readConfigName path=/collections/collection1 configName=conf1 specified config exists in ZooKeeper
   [junit4]   2> 1498327 T6018 C:collection1 c:collection1 oasc.SolrResourceLoader.<init> new SolrResourceLoader for directory: '/usr/home/jenkins/jenkins-slave/workspace/Lucene-Solr-Tests-5.x-Java7/solr/build/solr-core/test/J2/../../../../../../../../../../../usr/home/jenkins/jenkins-slave/workspace/Lucene-Solr-Tests-5.x-Java7/solr/build/solr-core/test/J2/temp/solr.cloud.TestRebalanceLeaders ED4E1CF455B33B43-001/shard-1-001/cores/collection1/'
   [junit4]   2> 1498340 T6018 C:collection1 c:collection1 oasc.ZkController.watchZKConfDir watch zkdir /configs/conf1
   [junit4]   2> 1498342 T6018 C:collection1 c:collection1 oasc.Config.<init> loaded config solrconfig.xml with version 0 
   [junit4]   2> 1498349 T6018 C:collection1 c:collection1 oasc.SolrConfig.refreshRequestParams current version of requestparams : -1
   [junit4]   2> 1498364 T6018 C:collection1 c:collection1 oasc.SolrConfig.<init> Using Lucene MatchVersion: 5.2.0
   [junit4]   2> 1498399 T6018 C:collection1 c:collection1 oasc.SolrConfig.<init> Loaded SolrConfig: solrconfig.xml
   [junit4]   2> 1498500 T6018 C:collection1 c:collection1 oass.IndexSchema.readSchema Reading Solr Schema from /configs/conf1/schema.xml
   [junit4]   2> 1498508 T6018 C:collection1 c:collection1 oass.IndexSchema.readSchema [collection1] Schema name=test
   [junit4]   2> 1498770 T6018 C:collection1 c:collection1 oass.IndexSchema.readSchema default search field in schema is text
   [junit4]   2> 1498771 T6018 C:collection1 c:collection1 oass.IndexSchema.readSchema unique key field: id
   [junit4]   2> 1498773 T6018 C:collection1 c:collection1 oass.FileExchangeRateProvider.reload Reloading exchange rates from file currency.xml
   [junit4]   2> 1498776 T6018 C:collection1 c:collection1 oass.FileExchangeRateProvider.reload Reloading exchange rates from file currency.xml
   [junit4]   2> 1498788 T6018 C:collection1 c:collection1 oasc.CoreContainer.create Creating SolrCore 'collection1' using configuration from collection collection1
   [junit4]   2> 1498789 T6018 C:collection1 c:collection1 oasc.SolrCore.initDirectoryFactory org.apache.solr.core.MockDirectoryFactory
   [junit4]   2> 1498789 T6018 C:collection1 c:collection1 oasc.SolrCore.<init> [collection1] Opening new SolrCore at /usr/home/jenkins/jenkins-slave/workspace/Lucene-Solr-Tests-5.x-Java7/solr/build/solr-core/test/J2/../../../../../../../../../../../usr/home/jenkins/jenkins-slave/workspace/Lucene-Solr-Tests-5.x-Java7/solr/build/solr-core/test/J2/temp/solr.cloud.TestRebalanceLeaders ED4E1CF455B33B43-001/shard-1-001/cores/collection1/, dataDir=/usr/home/jenkins/jenkins-slave/workspace/Lucene-Solr-Tests-5.x-Java7/solr/build/solr-core/test/J2/../../../../../../../../../../../usr/home/jenkins/jenkins-slave/workspace/Lucene-Solr-Tests-5.x-Java7/solr/build/solr-core/test/J2/temp/solr.cloud.TestRebalanceLeaders ED4E1CF455B33B43-001/shard-1-001/cores/collection1/data/
   [junit4]   2> 1498789 T6018 C:collection1 c:collection1 oasc.JmxMonitoredMap.<init> JMX monitoring is enabled. Adding Solr mbeans to JMX Server: com.sun.jmx.mbeanserver.JmxMBeanServer@4bc15184
   [junit4]   2> 1498790 T6018 C:collection1 c:collection1 oasc.CachingDirectoryFactory.get return new directory for /usr/home/jenkins/jenkins-slave/workspace/Lucene-Solr-Tests-5.x-Java7/solr/build/solr-core/test/J2/../../../../../../../../../../../usr/home/jenkins/jenkins-slave/workspace/Lucene-Solr-Tests-5.x-Java7/solr/build/solr-core/test/J2/temp/solr.cloud.TestRebalanceLeaders ED4E1CF455B33B43-001/shard-1-001/cores/collection1/data
   [junit4]   2> 1498791 T6018 C:collection1 c:collection1 oasc.SolrCore.getNewIndexDir New index directory detected: old=null new=/usr/home/jenkins/jenkins-slave/workspace/Lucene-Solr-Tests-5.x-Java7/solr/build/solr-core/test/J2/../../../../../../../../../../../usr/home/jenkins/jenkins-slave/workspace/Lucene-Solr-Tests-5.x-Java7/solr/build/solr-core/test/J2/temp/solr.cloud.TestRebalanceLeaders ED4E1CF455B33B43-001/shard-1-001/cores/collection1/data/index/
   [junit4]   2> 1498791 T6018 C:collection1 c:collection1 oasc.SolrCore.initIndex WARN [collection1] Solr index directory '/usr/home/jenkins/jenkins-slave/workspace/Lucene-Solr-Tests-5.x-Java7/solr/build/solr-core/test/J2/../../../../../../../../../../../usr/home/jenkins/jenkins-slave/workspace/Lucene-Solr-Tests-5.x-Java7/solr/build/solr-core/test/J2/temp/solr.cloud.TestRebalanceLeaders ED4E1CF455B33B43-001/shard-1-001/cores/collection1/data/index' doesn't exist. Creating new index...
   [junit4]   2> 1498791 T6018 C:collection1 c:collection1 oasc.CachingDirectoryFactory.get return new directory for /usr/home/jenkins/jenkins-slave/workspace/Lucene-Solr-Tests-5.x-Java7/solr/build/solr-core/test/J2/../../../../../../../../../../../usr/home/jenkins/jenkins-slave/workspace/Lucene-Solr-Tests-5.x-Java7/solr/build/solr-core/test/J2/temp/solr.cloud.TestRebalanceLeaders ED4E1CF455B33B43-001/shard-1-001/cores/collection1/data/index
   [junit4]   2> 1498792 T6018 C:collection1 c:collection1 oasu.RandomMergePolicy.<init> RandomMergePolicy wrapping class org.apache.lucene.index.TieredMergePolicy: [TieredMergePolicy: maxMergeAtOnce=26, maxMergeAtOnceExplicit=48, maxMergedSegmentMB=96.4521484375, floorSegmentMB=1.4296875, forceMergeDeletesPctAllowed=18.51724424491889, segmentsPerTier=41.0, maxCFSSegmentSizeMB=8.796093022207999E12, noCFSRatio=0.0
   [junit4]   2> 1498793 T6018 C:collection1 c:collection1 oasc.SolrDeletionPolicy.onCommit SolrDeletionPolicy.onCommit: commits: num=1
   [junit4]   2> 		commit{dir=MockDirectoryWrapper(RAMDirectory@47337b54 lockFactory=org.apache.lucene.store.SingleInstanceLockFactory@4e5ec51),segFN=segments_1,generation=1}
   [junit4]   2> 1498793 T6018 C:collection1 c:collection1 oasc.SolrDeletionPolicy.updateCommits newest commit generation = 1
   [junit4]   2> 1498800 T6018 C:collection1 c:collection1 oasup.UpdateRequestProcessorChain.init creating updateRequestProcessorChain "nodistrib"
   [junit4]   2> 1498800 T6018 C:collection1 c:collection1 oasup.UpdateRequestProcessorChain.init creating updateRequestProcessorChain "dedupe"
   [junit4]   2> 1498801 T6018 C:collection1 c:collection1 oasup.UpdateRequestProcessorChain.init inserting DistributedUpdateProcessorFactory into updateRequestProcessorChain "dedupe"
   [junit4]   2> 1498801 T6018 C:collection1 c:collection1 oasup.UpdateRequestProcessorChain.init creating updateRequestProcessorChain "stored_sig"
   [junit4]   2> 1498801 T6018 C:collection1 c:collection1 oasup.UpdateRequestProcessorChain.init inserting DistributedUpdateProcessorFactory into updateRequestProcessorChain "stored_sig"
   [junit4]   2> 1498802 T6018 C:collection1 c:collection1 oasup.UpdateRequestProcessorChain.init creating updateRequestProcessorChain "distrib-dup-test-chain-explicit"
   [junit4]   2> 1498802 T6018 C:collection1 c:collection1 oasup.UpdateRequestProcessorChain.init creating updateRequestProcessorChain "distrib-dup-test-chain-implicit"
   [junit4]   2> 1498802 T6018 C:collection1 c:collection1 oasup.UpdateRequestProcessorChain.init inserting DistributedUpdateProcessorFactory into updateRequestProcessorChain "distrib-dup-test-chain-implicit"
   [junit4]   2> 1498803 T6018 C:collection1 c:collection1 oasc.SolrCore.loadUpdateProcessorChains no updateRequestProcessorChain defined as default, creating implicit default
   [junit4]   2> 1498822 T6018 C:collection1 c:collection1 oashl.XMLLoader.init xsltCacheLifetimeSeconds=60
   [junit4]   2> 1498825 T6018 C:collection1 c:collection1 oashl.XMLLoader.init xsltCacheLifetimeSeconds=60
   [junit4]   2> 1498827 T6018 C:collection1 c:collection1 oashl.XMLLoader.init xsltCacheLifetimeSeconds=60
   [junit4]   2> 1498830 T6018 C:collection1 c:collection1 oashl.XMLLoader.init xsltCacheLifetimeSeconds=60
   [junit4]   2> 1498837 T6018 C:collection1 c:collection1 oasc.RequestHandlers.initHandlersFromConfig Registered paths: /update/json,/admin/plugins,/update/json/docs,/update/csv,/admin/ping,/config,/admin/luke,/admin/system,/admin/threads,/schema,/admin/file,/update,/admin/mbeans,/admin/logging,standard,/admin/segments,/replication,/get,/admin/properties
   [junit4]   2> 1498839 T6018 C:collection1 c:collection1 oasc.SolrCore.initStatsCache Using default statsCache cache: org.apache.solr.search.stats.LocalStatsCache
   [junit4]   2> 1498841 T6018 C:collection1 c:collection1 oasu.UpdateHandler.<init> Using UpdateLog implementation: org.apache.solr.update.UpdateLog
   [junit4]   2> 1498841 T6018 C:collection1 c:collection1 oasu.UpdateLog.init Initializing UpdateLog: dataDir= defaultSyncLevel=FLUSH numRecordsToKeep=100 maxNumLogsToKeep=10
   [junit4]   2> 1498843 T6018 C:collection1 c:collection1 oasu.CommitTracker.<init> Hard AutoCommit: disabled
   [junit4]   2> 1498843 T6018 C:collection1 c:collection1 oasu.CommitTracker.<init> Soft AutoCommit: disabled
   [junit4]   2> 1498844 T6018 C:collection1 c:collection1 oasu.RandomMergePolicy.<init> RandomMergePolicy wrapping class org.apache.lucene.index.LogDocMergePolicy: [LogDocMergePolicy: minMergeSize=1000, mergeFactor=15, maxMergeSize=9223372036854775807, maxMergeSizeForForcedMerge=9223372036854775807, calibrateSizeByDeletes=true, maxMergeDocs=2147483647, maxCFSSegmentSizeMB=8.796093022207999E12, noCFSRatio=1.0]
   [junit4]   2> 1498845 T6018 C:collection1 c:collection1 oasc.SolrDeletionPolicy.onInit SolrDeletionPolicy.onInit: commits: num=1
   [junit4]   2> 		commit{dir=MockDirectoryWrapper(RAMDirectory@47337b54 lockFactory=org.apache.lucene.store.SingleInstanceLockFactory@4e5ec51),segFN=segments_1,generation=1}
   [junit4]   2> 1498845 T6018 C:collection1 c:collection1 oasc.SolrDeletionPolicy.updateCommits newest commit generation = 1
   [junit4]   2> 1498845 T6018 C:collection1 c:collection1 oass.SolrIndexSearcher.<init> Opening Searcher@49167439[collection1] main
   [junit4]   2> 1498846 T6018 C:collection1 c:collection1 oascc.ZkStateReader.readConfigName Load collection config from:/collections/collection1
   [junit4]   2> 1498846 T6018 C:collection1 c:collection1 oascc.ZkStateReader.readConfigName path=/collections/collection1 configName=conf1 specified config exists in ZooKeeper
   [junit4]   2> 1498846 T6018 C:collection1 c:collection1 oasr.ManagedResourceStorage.newStorageIO Setting up ZooKeeper-based storage for the RestManager with znodeBase: /configs/conf1
   [junit4]   2> 1498847 T6018 C:collection1 c:collection1 oasr.ManagedResourceStorage$ZooKeeperStorageIO.configure Configured ZooKeeperStorageIO with znodeBase: /configs/conf1
   [junit4]   2> 1498847 T6018 C:collection1 c:collection1 oasr.RestManager.init Initializing RestManager with initArgs: {}
   [junit4]   2> 1498847 T6018 C:collection1 c:collection1 oasr.ManagedResourceStorage.load Reading _rest_managed.json using ZooKeeperStorageIO:path=/configs/conf1
   [junit4]   2> 1498847 T6018 C:collection1 c:collection1 oasr.ManagedResourceStorage$ZooKeeperStorageIO.openInputStream No data found for znode /configs/conf1/_rest_managed.json
   [junit4]   2> 1498848 T6018 C:collection1 c:collection1 oasr.ManagedResourceStorage.load Loaded null at path _rest_managed.json using ZooKeeperStorageIO:path=/configs/conf1
   [junit4]   2> 1498848 T6018 C:collection1 c:collection1 oasr.RestManager.init Initializing 0 registered ManagedResources
   [junit4]   2> 1498848 T6018 C:collection1 c:collection1 oash.ReplicationHandler.inform Commits will be reserved for  10000
   [junit4]   2> 1498849 T6019 C:collection1 c:collection1 oasc.SolrCore.registerSearcher [collection1] Registered new searcher Searcher@49167439[collection1] main{ExitableDirectoryReader(UninvertingDirectoryReader())}
   [junit4]   2> 1498849 T6018 C:collection1 c:collection1 oasc.CoreContainer.registerCore registering core: collection1
   [junit4]   2> 1498850 T6022 C:collection1 S:shard2 oasc.ZkController.register Register replica - core:collection1 address:http://127.0.0.1:20767/zg collection:collection1 shard:shard2
   [junit4]   2> 1498850 T5962 oass.SolrDispatchFilter.init user.dir=/usr/home/jenkins/jenkins-slave/workspace/Lucene-Solr-Tests-5.x-Java7/solr/build/solr-core/test/J2
   [junit4]   2> 1498851 T5962 oass.SolrDispatchFilter.init SolrDispatchFilter.init() done
   [junit4]   2> 1498851 T6022 C:collection1 S:shard2 oascc.SolrZkClient.makePath makePath: /collections/collection1/leader_elect/shard2/election
   [junit4]   2> 1498854 T6022 C:collection1 S:shard2 oasc.ShardLeaderElectionContext.runLeaderProcess Running the leader process for shard shard2
   [junit4]   2> 1498855 T5988 oasc.DistributedQueue$LatchWatcher.process NodeChildrenChanged fired on path /overseer/queue state SyncConnected
   [junit4]   2> 1498855 T6022 C:collection1 S:shard2 oasc.ShardLeaderElectionContext.waitForReplicasToComeUp Enough replicas found to continue.
   [junit4]   2> 1498856 T6022 C:collection1 S:shard2 oasc.ShardLeaderElectionContext.runLeaderProcess I may be the new leader - try and sync
   [junit4]   2> ASYNC  NEW_CORE C2727 name=collection1 org.apache.solr.core.SolrCore@2d6de342 url=http://127.0.0.1:20767/zg/collection1 node=127.0.0.1:20767_zg C2727_STATE=coll:collection1 core:collection1 props:{base_url=http://127.0.0.1:20767/zg, node_name=127.0.0.1:20767_zg, core=collection1, state=down}
   [junit4]   2> 1498856 T6022 C:collection1 S:shard2 C2727 P20767 oasc.SyncStrategy.sync Sync replicas to http://127.0.0.1:20767/zg/collection1/
   [junit4]   2> 1498856 T5989 oasc.Overseer$ClusterStateUpdater.run processMessage: queueSize: 1, message = {
   [junit4]   2> 	  "operation":"leader",
   [junit4]   2> 	  "shard":"shard2",
   [junit4]   2> 	  "collection":"collection1"} current state version: 5
   [junit4]   2> 1498856 T6022 C:collection1 S:shard2 C2727 P20767 oasc.SyncStrategy.syncReplicas Sync Success - now sync replicas to me
   [junit4]   2> 1498857 T6022 C:collection1 S:shard2 C2727 P20767 oasc.SyncStrategy.syncToMe http://127.0.0.1:20767/zg/collection1/ has no replicas
   [junit4]   2> 1498857 T6022 C:collection1 S:shard2 oasc.ShardLeaderElectionContext.runLeaderProcess I am the new leader: http://127.0.0.1:20767/zg/collection1/ shard2
   [junit4]   2> 1498857 T6022 C:collection1 S:shard2 oascc.SolrZkClient.makePath makePath: /collections/collection1/leaders/shard2
   [junit4]   2> 1498857 T5989 oasco.ZkStateWriter.writePendingUpdates going to update_collection /collections/collection1/state.json version: 1
   [junit4]   2> 1498858 T6017 oascc.ZkStateReader$7.process A cluster state change: WatchedEvent state:SyncConnected type:NodeDataChanged path:/collections/collection1/state.json for collection collection1 has occurred - updating... (live nodes size: 2)
   [junit4]   2> 1498858 T6017 oascc.ZkStateReader.updateWatchedCollection Updating data for collection1 to ver 2 
   [junit4]   2> 1498860 T5989 oasc.Overseer$ClusterStateUpdater.run processMessage: queueSize: 1, message = {
   [junit4]   2> 	  "operation":"leader",
   [junit4]   2> 	  "shard":"shard2",
   [junit4]   2> 	  "collection":"collection1",
   [junit4]   2> 	  "base_url":"http://127.0.0.1:20767/zg",
   [junit4]   2> 	  "core":"collection1",
   [junit4]   2> 	  "state":"active"} current state version: 5
   [junit4]   2> 1498861 T5989 oasco.ZkStateWriter.writePendingUpdates going to update_collection /collections/collection1/state.json version: 2
   [junit4]   2> 1498861 T6017 oascc.ZkStateReader$7.process A cluster state change: WatchedEvent state:SyncConnected type:NodeDataChanged path:/collections/collection1/state.json for collection collection1 has occurred - updating... (live nodes size: 2)
   [junit4]   2> 1498862 T6017 oascc.ZkStateReader.updateWatchedCollection Updating data for collection1 to ver 3 
   [junit4]   2> 1498863 T5988 oasc.DistributedQueue$LatchWatcher.process NodeChildrenChanged fired on path /overseer/queue state SyncConnected
   [junit4]   2> 1498910 T6022 C:collection1 S:shard2 oasc.ZkController.register We are http://127.0.0.1:20767/zg/collection1/ and leader is http://127.0.0.1:20767/zg/collection1/
   [junit4]   2> 1498911 T6022 C:collection1 S:shard2 oasc.ZkController.register No LogReplay needed for core=collection1 baseURL=http://127.0.0.1:20767/zg
   [junit4]   2> 1498911 T6022 C:collection1 S:shard2 oasc.ZkController.checkRecovery I am the leader, no recovery necessary
   [junit4]   2> 1498911 T6022 C:collection1 S:shard2 c:collection1 oasc.ZkController.publish publishing core=collection1 state=active collection=collection1
   [junit4]   2> 1498911 T6022 C:collection1 S:shard2 c:collection1 oasc.ZkController.publish numShards not found on descriptor - reading it from system property
   [junit4]   2> 1498912 T5988 oasc.DistributedQueue$LatchWatcher.process NodeChildrenChanged fired on path /overseer/queue state SyncConnected
   [junit4]   2> 1498913 T5989 oasc.Overseer$ClusterStateUpdater.run processMessage: queueSize: 1, message = {
   [junit4]   2> 	  "core_node_name":"core_node1",
   [junit4]   2> 	  "roles":null,
   [junit4]   2> 	  "base_url":"http://127.0.0.1:20767/zg",
   [junit4]   2> 	  "collection":"collection1",
   [junit4]   2> 	  "node_name":"127.0.0.1:20767_zg",
   [junit4]   2> 	  "core":"collection1",
   [junit4]   2> 	  "state":"active",
   [junit4]   2> 	  "numShards":"4",
   [junit4]   2> 	  "shard":"shard2",
   [junit4]   2> 	  "operation":"state"} current state version: 5
   [junit4]   2> 1498914 T5989 oasco.ReplicaMutator.updateState Update state numShards=4 message={
   [junit4]   2> 	  "core_node_name":"core_node1",
   [junit4]   2> 	  "roles":null,
   [junit4]   2> 	  "base_url":"http://127.0.0.1:20767/zg",
   [junit4]   2> 	  "collection":"collection1",
   [junit4]   2> 	  "node_name":"127.0.0.1:20767_zg",
   [junit4]   2> 	  "core":"collection1",
   [junit4]   2> 	  "state":"active",
   [junit4]   2> 	  "numShards":"4",
   [junit4]   2> 	  "shard":"shard2",
   [junit4]   2> 	  "operation":"state"}
   [junit4]   2> 1498914 T6022 C:collection1 S:shard2 oascc.ZkStateReader.updateWatchedCollection Updating data for collection1 to ver 3 
   [junit4]   2> 1498914 T5989 oasco.ZkStateWriter.writePendingUpdates going to update_collection /collections/collection1/state.json version: 3
   [junit4]   2> 1498915 T6017 oascc.ZkStateReader$7.process A cluster state change: WatchedEvent state:SyncConnected type:NodeDataChanged path:/collections/collection1/state.json for collection collection1 has occurred - updating... (live nodes size: 2)
   [junit4]   2> 1498915 T6017 oascc.ZkStateReader.updateWatchedCollection Updating data for collection1 to ver 4 
   [junit4]   2> 1499784 T5962 oas.SolrTestCaseJ4.writeCoreProperties Writing core.properties file to /usr/home/jenkins/jenkins-slave/workspace/Lucene-Solr-Tests-5.x-Java7/solr/build/solr-core/test/J2/temp/solr.cloud.TestRebalanceLeaders ED4E1CF455B33B43-001/shard-2-001/cores/collection1
   [junit4]   2> 1499786 T5962 oasc.AbstractFullDistribZkTestBase.createJettys create jetty 2 in directory /usr/home/jenkins/jenkins-slave/workspace/Lucene-Solr-Tests-5.x-Java7/solr/build/solr-core/test/J2/temp/solr.cloud.TestRebalanceLeaders ED4E1CF455B33B43-001/shard-2-001
   [junit4]   2> 1499787 T5962 oejs.Server.doStart jetty-8.1.10.v20130312
   [junit4]   2> 1499790 T5962 oejs.AbstractConnector.doStart Started SocketConnector@127.0.0.1:20781
   [junit4]   2> 1499790 T5962 oascse.JettySolrRunner$1.lifeCycleStarted Jetty properties: {coreRootDirectory=/usr/home/jenkins/jenkins-slave/workspace/Lucene-Solr-Tests-5.x-Java7/solr/build/solr-core/test/J2/temp/solr.cloud.TestRebalanceLeaders ED4E1CF455B33B43-001/shard-2-001/cores, hostPort=20781, solrconfig=solrconfig.xml, solr.data.dir=/usr/home/jenkins/jenkins-slave/workspace/Lucene-Solr-Tests-5.x-Java7/solr/build/solr-core/test/J2/temp/solr.cloud.TestRebalanceLeaders ED4E1CF455B33B43-001/tempDir-001/jetty2, hostContext=/zg}
   [junit4]   2> 1499790 T5962 oass.SolrDispatchFilter.init SolrDispatchFilter.init()sun.misc.Launcher$AppClassLoader@631d75b9
   [junit4]   2> 1499791 T5962 oasc.SolrResourceLoader.<init> new SolrResourceLoader for directory: '/usr/home/jenkins/jenkins-slave/workspace/Lucene-Solr-Tests-5.x-Java7/solr/build/solr-core/test/J2/temp/solr.cloud.TestRebalanceLeaders ED4E1CF455B33B43-001/shard-2-001/'
   [junit4]   2> 1499822 T5962 oasc.SolrXmlConfig.fromFile Loading container configuration from /usr/home/jenkins/jenkins-slave/workspace/Lucene-Solr-Tests-5.x-Java7/solr/build/solr-core/test/J2/temp/solr.cloud.TestRebalanceLeaders ED4E1CF455B33B43-001/shard-2-001/solr.xml
   [junit4]   2> 1499865 T5962 oasc.CorePropertiesLocator.<init> Config-defined core root directory: /usr/home/jenkins/jenkins-slave/workspace/Lucene-Solr-Tests-5.x-Java7/solr/build/solr-core/test/J2/temp/solr.cloud.TestRebalanceLeaders ED4E1CF455B33B43-001/shard-2-001/cores
   [junit4]   2> 1499866 T5962 oasc.CoreContainer.<init> New CoreContainer 1551576367
   [junit4]   2> 1499866 T5962 oasc.CoreContainer.load Loading cores into CoreContainer [instanceDir=/usr/home/jenkins/jenkins-slave/workspace/Lucene-Solr-Tests-5.x-Java7/solr/build/solr-core/test/J2/temp/solr.cloud.TestRebalanceLeaders ED4E1CF455B33B43-001/shard-2-001/]
   [junit4]   2> 1499866 T5962 oasc.CoreContainer.load loading shared library: /usr/home/jenkins/jenkins-slave/workspace/Lucene-Solr-Tests-5.x-Java7/solr/build/solr-core/test/J2/temp/solr.cloud.TestRebalanceLeaders ED4E1CF455B33B43-001/shard-2-001/lib
   [junit4]   2> 1499867 T5962 oasc.SolrResourceLoader.addToClassLoader WARN Can't find (or read) directory to add to classloader: lib (resolved as: /usr/home/jenkins/jenkins-slave/workspace/Lucene-Solr-Tests-5.x-Java7/solr/build/solr-core/test/J2/temp/solr.cloud.TestRebalanceLeaders ED4E1CF455B33B43-001/shard-2-001/lib).
   [junit4]   2> 1499877 T5962 oashc.HttpShardHandlerFactory.getParameter Setting socketTimeout to: 90000
   [junit4]   2> 1499877 T5962 oashc.HttpShardHandlerFactory.getParameter Setting urlScheme to: 
   [junit4]   2> 1499878 T5962 oashc.HttpShardHandlerFactory.getParameter Setting connTimeout to: 15000
   [junit4]   2> 1499878 T5962 oashc.HttpShardHandlerFactory.getParameter Setting maxConnectionsPerHost to: 20
   [junit4]   2> 1499878 T5962 oashc.HttpShardHandlerFactory.getParameter Setting maxConnections to: 10000
   [junit4]   2> 1499878 T5962 oashc.HttpShardHandlerFactory.getParameter Setting corePoolSize to: 0
   [junit4]   2> 1499878 T5962 oashc.HttpShardHandlerFactory.getParameter Setting maximumPoolSize to: 2147483647
   [junit4]   2> 1499879 T5962 oashc.HttpShardHandlerFactory.getParameter Setting maxThreadIdleTime to: 5
   [junit4]   2> 1499879 T5962 oashc.HttpShardHandlerFactory.getParameter Setting sizeOfQueue to: -1
   [junit4]   2> 1499879 T5962 oashc.HttpShardHandlerFactory.getParameter Setting fairnessPolicy to: false
   [junit4]   2> 1499879 T5962 oashc.HttpShardHandlerFactory.getParameter Setting useRetries to: false
   [junit4]   2> 1499885 T5962 oasu.UpdateShardHandler.<init> Creating UpdateShardHandler HTTP client w

[...truncated too long message...]

kStateReader.java:137)
   [junit4]    > 	at org.apache.solr.common.cloud.ZkNodeProps.load(ZkNodeProps.java:92)
   [junit4]    > 	at org.apache.solr.cloud.DistributedQueue.containsTaskWithRequestId(DistributedQueue.java:127)
   [junit4]    > 	at org.apache.solr.handler.admin.CollectionsHandler.overseerCollectionQueueContains(CollectionsHandler.java:647)
   [junit4]    > 	at org.apache.solr.handler.admin.CollectionsHandler.handleResponse(CollectionsHandler.java:669)
   [junit4]    > 	at org.apache.solr.handler.admin.CollectionsHandler.handleResponse(CollectionsHandler.java:652)
   [junit4]    > 	at org.apache.solr.handler.admin.CollectionsHandler.rejoinElection(CollectionsHandler.java:447)
   [junit4]    > 	at org.apache.solr.handler.admin.CollectionsHandler.insurePreferredIsLeader(CollectionsHandler.java:362)
   [junit4]    > 	at org.apache.solr.handler.admin.CollectionsHandler.handleBalanceLeaders(CollectionsHandler.java:269)
   [junit4]    > 	at org.apache.solr.handler.admin.CollectionsHandler.handleRequestBody(CollectionsHandler.java:235)
   [junit4]    > 	at org.apache.solr.handler.RequestHandlerBase.handleRequest(RequestHandlerBase.java:143)
   [junit4]    > 	at org.apache.solr.servlet.SolrDispatchFilter.handleAdminRequest(SolrDispatchFilter.java:782)
   [junit4]    > 	at org.apache.solr.servlet.SolrDispatchFilter.doFilter(SolrDispatchFilter.java:282)
   [junit4]    > 	at org.apache.solr.servlet.SolrDispatchFilter.doFilter(SolrDispatchFilter.java:220)
   [junit4]    > 	at org.eclipse.jetty.servlet.ServletHandler$CachedChain.doFilter(ServletHandler.java:1419)
   [junit4]    > 	at org.apache.solr.client.solrj.embedded.JettySolrRunner$DebugFilter.doFilter(JettySolrRunner.java:102)
   [junit4]    > 	at org.eclipse.jetty.servlet.ServletHandler$CachedChain.doFilter(ServletHandler.java:1419)
   [junit4]    > 	at org.eclipse.jetty.servlet.ServletHandler.doHandle(ServletHandler.java:455)
   [junit4]    > 	at org.eclipse.jetty.server.session.SessionHandler.doHandle(SessionHandler.java:229)
   [junit4]    > 	at org.eclipse.jetty.server.handler.ScopedHandler.handle(ScopedHandler.java:137)
   [junit4]    > 	at org.eclipse.jetty.server.handler.GzipHandler.handle(GzipHandler.java:301)
   [junit4]    > 	at org.eclipse.jetty.server.handler.ContextHandler.doHandle(ContextHandler.java:1077)
   [junit4]    > 	at org.eclipse.jetty.servlet.ServletHandler.doScope(ServletHandler.java:384)
   [junit4]    > 	at org.eclipse.jetty.server.session.SessionHandler.doScope(SessionHandler.java:193)
   [junit4]    > 	at org.eclipse.jetty.server.handler.ContextHandler.doScope(ContextHandler.java:1009)
   [junit4]    > 	at org.eclipse.jetty.server.handler.ScopedHandler.handle(ScopedHandler.java:135)
   [junit4]    > 	at org.eclipse.jetty.server.handler.HandlerWrapper.handle(HandlerWrapper.java:116)
   [junit4]    > 	at org.eclipse.jetty.server.Server.handle(Server.java:368)
   [junit4]    > 	at org.eclipse.jetty.server.AbstractHttpConnection.handleRequest(AbstractHttpConnection.java:489)
   [junit4]    > 	at org.eclipse.jetty.server.BlockingHttpConnection.handleRequest(BlockingHttpConnection.java:53)
   [junit4]    > 	at org.eclipse.jetty.server.AbstractHttpConnection.headerComplete(AbstractHttpConnection.java:942)
   [junit4]    > 	at org.eclipse.jetty.server.AbstractHttpConnection$RequestHandler.headerComplete(AbstractHttpConnection.java:1004)
   [junit4]    > 	at org.eclipse.jetty.http.HttpParser.parseNext(HttpParser.java:640)
   [junit4]    > 	at org.eclipse.jetty.http.HttpParser.parseAvailable(HttpParser.java:235)
   [junit4]    > 	at org.eclipse.jetty.server.BlockingHttpConnection.handle(BlockingHttpConnection.java:72)
   [junit4]    > 	at org.eclipse.jetty.server.bio.SocketConnector$ConnectorEndPoint.run(SocketConnector.java:264)
   [junit4]    > 	at org.eclipse.jetty.util.thread.QueuedThreadPool.runJob(QueuedThreadPool.java:608)
   [junit4]    > 	at org.eclipse.jetty.util.thread.QueuedThreadPool$3.run(QueuedThreadPool.java:543)
   [junit4]    > 	at java.lang.Thread.run(Thread.java:745)
   [junit4]    > ,code=500}</pre></p>
   [junit4]    > <hr /><i><small>Powered by Jetty://</small></i>
   [junit4]    >                                                 
   [junit4]    >                                                 
   [junit4]    >                                                 
   [junit4]    >                                                 
   [junit4]    >                                                 
   [junit4]    >                                                 
   [junit4]    >                                                 
   [junit4]    >                                                 
   [junit4]    >                                                 
   [junit4]    >                                                 
   [junit4]    >                                                 
   [junit4]    >                                                 
   [junit4]    >                                                 
   [junit4]    >                                                 
   [junit4]    >                                                 
   [junit4]    >                                                 
   [junit4]    >                                                 
   [junit4]    >                                                 
   [junit4]    >                                                 
   [junit4]    >                                                 
   [junit4]    > </body>
   [junit4]    > </html>
   [junit4]    > 	at org.apache.solr.client.solrj.impl.HttpSolrClient.executeMethod(HttpSolrClient.java:525)
   [junit4]    > 	at org.apache.solr.client.solrj.impl.HttpSolrClient.request(HttpSolrClient.java:233)
   [junit4]    > 	at org.apache.solr.client.solrj.impl.HttpSolrClient.request(HttpSolrClient.java:225)
   [junit4]    > 	at org.apache.solr.client.solrj.impl.LBHttpSolrClient.doRequest(LBHttpSolrClient.java:370)
   [junit4]    > 	at org.apache.solr.client.solrj.impl.LBHttpSolrClient.request(LBHttpSolrClient.java:338)
   [junit4]    > 	... 48 more
   [junit4]   2> 1592283 T5962 C:control_collection S:shard1 c:collection1 oas.SolrTestCaseJ4.deleteCore ###deleteCore
   [junit4]   2> NOTE: leaving temporary files on disk at: /usr/home/jenkins/jenkins-slave/workspace/Lucene-Solr-Tests-5.x-Java7/solr/build/solr-core/test/J2/temp/solr.cloud.TestRebalanceLeaders ED4E1CF455B33B43-001
   [junit4]   2> NOTE: test params are: codec=Asserting(Lucene50): {}, docValues:{}, sim=RandomSimilarityProvider(queryNorm=false,coord=no): {}, locale=it_CH, timezone=Asia/Calcutta
   [junit4]   2> NOTE: FreeBSD 9.1-RELEASE-p3 amd64/Oracle Corporation 1.7.0_65 (64-bit)/cpus=16,threads=1,free=211655760,total=402653184
   [junit4]   2> NOTE: All tests run in this JVM: [TestSolrQueryParserDefaultOperatorResource, TestNRTOpen, WordBreakSolrSpellCheckerTest, TestSolrXml, TestUpdate, TestCloudInspectUtil, TestElisionMultitermQuery, SpatialHeatmapFacetsTest, TestFieldCollectionResource, TestDistributedSearch, AnalysisErrorHandlingTest, TestLazyCores, DistribDocExpirationUpdateProcessorTest, CloudMLTQParserTest, DistributedFacetPivotLongTailTest, TestObjectReleaseTracker, TestSolrQueryParserResource, TestDistributedGrouping, FieldAnalysisRequestHandlerTest, ShardSplitTest, TestPostingsSolrHighlighter, DocValuesTest, FieldMutatingUpdateProcessorTest, TestManagedSynonymFilterFactory, PreAnalyzedFieldTest, DistributedQueryElevationComponentTest, TestInfoStreamLogging, HdfsChaosMonkeySafeLeaderTest, DistributedExpandComponentTest, OpenCloseCoreStressTest, BadCopyFieldTest, ClusterStateTest, TestStressLucene, CoreAdminCreateDiscoverTest, DeleteShardTest, HdfsBasicDistributedZkTest, TestSolrDeletionPolicy1, TestReload, ZkSolrClientTest, SpellCheckCollatorTest, AutoCommitTest, SpatialRPTFieldTypeTest, TestSuggestSpellingConverter, TestReplicaProperties, SharedFSAutoReplicaFailoverUtilsTest, CoreMergeIndexesAdminHandlerTest, TestOmitPositions, DirectSolrSpellCheckerTest, TestStressUserVersions, SpatialFilterTest, ZkStateWriterTest, DeleteReplicaTest, HdfsDirectoryTest, BadComponentTest, SortByFunctionTest, TestCustomSort, SolrPluginUtilsTest, TestCloudManagedSchemaConcurrent, TestCloudSchemaless, LeaderInitiatedRecoveryOnCommitTest, ShardRoutingTest, TestRebalanceLeaders]
   [junit4] Completed on J2 in 101.12s, 1 test, 1 error <<< FAILURES!

[...truncated 673 lines...]
BUILD FAILED
/usr/home/jenkins/jenkins-slave/workspace/Lucene-Solr-Tests-5.x-Java7/build.xml:529: The following error occurred while executing this line:
/usr/home/jenkins/jenkins-slave/workspace/Lucene-Solr-Tests-5.x-Java7/build.xml:477: The following error occurred while executing this line:
/usr/home/jenkins/jenkins-slave/workspace/Lucene-Solr-Tests-5.x-Java7/build.xml:61: The following error occurred while executing this line:
/usr/home/jenkins/jenkins-slave/workspace/Lucene-Solr-Tests-5.x-Java7/extra-targets.xml:39: The following error occurred while executing this line:
/usr/home/jenkins/jenkins-slave/workspace/Lucene-Solr-Tests-5.x-Java7/solr/build.xml:191: The following error occurred while executing this line:
/usr/home/jenkins/jenkins-slave/workspace/Lucene-Solr-Tests-5.x-Java7/solr/common-build.xml:509: The following error occurred while executing this line:
/usr/home/jenkins/jenkins-slave/workspace/Lucene-Solr-Tests-5.x-Java7/lucene/common-build.xml:1370: The following error occurred while executing this line:
/usr/home/jenkins/jenkins-slave/workspace/Lucene-Solr-Tests-5.x-Java7/lucene/common-build.xml:976: There were test failures: 480 suites, 1905 tests, 1 error, 62 ignored (22 assumptions)

Total time: 58 minutes 9 seconds
Build step 'Invoke Ant' marked build as failure
Archiving artifacts
Sending artifact delta relative to Lucene-Solr-Tests-5.x-Java7 #2431
Archived 5 artifacts
Archive block size is 32768
Received 0 blocks and 212847609 bytes
Compression is 0.0%
Took 41 sec
Recording test results
Email was triggered for: Failure
Sending email for trigger: Failure



Mime
View raw message