lucene-dev mailing list archives

Site index · List index
Message view « Date » · « Thread »
Top « Date » · « Thread »
From Policeman Jenkins Server <jenk...@thetaphi.de>
Subject [JENKINS] Lucene-Solr-trunk-Linux (64bit/jdk1.8.0_40) - Build # 12189 - Failure!
Date Thu, 02 Apr 2015 18:50:39 GMT
Build: http://jenkins.thetaphi.de/job/Lucene-Solr-trunk-Linux/12189/
Java: 64bit/jdk1.8.0_40 -XX:+UseCompressedOops -XX:+UseParallelGC

1 tests failed.
FAILED:  org.apache.lucene.search.suggest.document.SuggestFieldTest.testSuggestOnAllDeletedDocuments

Error Message:
MockDirectoryWrapper: cannot close: there are still open files: {_1_Lucene50_0.pay=1, _2_completion_0.pos=1,
_1.nvd=1, _2_completion_0.lkp=1, _0.nvd=1, _1_completion_0.pos=1, _2_Lucene50_0.pos=1, _4_completion_0.pay=1,
_3_completion_0.doc=1, _4_Lucene50_0.doc=1, _1_Lucene50_0.tim=1, _2.nvd=1, _3_completion_0.pos=1,
_4_Lucene50_0.pos=1, _3_completion_0.lkp=1, _2_completion_0.doc=1, _0_completion_0.pos=1,
_4_completion_0.tim=1, _4_completion_0.pos=1, _4_completion_0.lkp=1, _0_Lucene50_0.pos=1,
_2_completion_0.pay=1, _3_Lucene50_0.pay=1, _1_completion_0.doc=1, _4_Lucene50_0.tim=1, _4.fdt=1,
_1_completion_0.lkp=1, _2_completion_0.tim=1, _3_Lucene50_0.tim=1, _3.fdt=1, _4_completion_0.doc=1,
_4_Lucene50_0.pay=1, _0_Lucene50_0.doc=1, _3_Lucene50_0.pos=1, _2.fdt=1, _0_completion_0.pay=1,
_1_completion_0.tim=1, _2_Lucene50_0.tim=1, _1_Lucene50_0.pos=1, _3_Lucene50_0.doc=1, _0_completion_0.tim=1,
_1_completion_0.pay=1, _2_Lucene50_0.pay=1, _1.fdt=1, _0_Lucene50_0.tim=1, _3.nvd=1, _0_completion_0.lkp=1,
_4.nvd=1, _2_Lucene50_0.doc=1, _0.fdt=1, _3_completion_0.tim=1, _0_completion_0.doc=1, _1_Lucene50_0.doc=1,
_0_Lucene50_0.pay=1, _3_completion_0.pay=1}

Stack Trace:
java.lang.RuntimeException: MockDirectoryWrapper: cannot close: there are still open files:
{_1_Lucene50_0.pay=1, _2_completion_0.pos=1, _1.nvd=1, _2_completion_0.lkp=1, _0.nvd=1, _1_completion_0.pos=1,
_2_Lucene50_0.pos=1, _4_completion_0.pay=1, _3_completion_0.doc=1, _4_Lucene50_0.doc=1, _1_Lucene50_0.tim=1,
_2.nvd=1, _3_completion_0.pos=1, _4_Lucene50_0.pos=1, _3_completion_0.lkp=1, _2_completion_0.doc=1,
_0_completion_0.pos=1, _4_completion_0.tim=1, _4_completion_0.pos=1, _4_completion_0.lkp=1,
_0_Lucene50_0.pos=1, _2_completion_0.pay=1, _3_Lucene50_0.pay=1, _1_completion_0.doc=1, _4_Lucene50_0.tim=1,
_4.fdt=1, _1_completion_0.lkp=1, _2_completion_0.tim=1, _3_Lucene50_0.tim=1, _3.fdt=1, _4_completion_0.doc=1,
_4_Lucene50_0.pay=1, _0_Lucene50_0.doc=1, _3_Lucene50_0.pos=1, _2.fdt=1, _0_completion_0.pay=1,
_1_completion_0.tim=1, _2_Lucene50_0.tim=1, _1_Lucene50_0.pos=1, _3_Lucene50_0.doc=1, _0_completion_0.tim=1,
_1_completion_0.pay=1, _2_Lucene50_0.pay=1, _1.fdt=1, _0_Lucene50_0.tim=1, _3.nvd=1, _0_completion_0.lkp=1,
_4.nvd=1, _2_Lucene50_0.doc=1, _0.fdt=1, _3_completion_0.tim=1, _0_completion_0.doc=1, _1_Lucene50_0.doc=1,
_0_Lucene50_0.pay=1, _3_completion_0.pay=1}
	at org.apache.lucene.store.MockDirectoryWrapper.close(MockDirectoryWrapper.java:747)
	at org.apache.lucene.search.suggest.document.SuggestFieldTest.after(SuggestFieldTest.java:84)
	at sun.reflect.NativeMethodAccessorImpl.invoke0(Native Method)
	at sun.reflect.NativeMethodAccessorImpl.invoke(NativeMethodAccessorImpl.java:62)
	at sun.reflect.DelegatingMethodAccessorImpl.invoke(DelegatingMethodAccessorImpl.java:43)
	at java.lang.reflect.Method.invoke(Method.java:497)
	at com.carrotsearch.randomizedtesting.RandomizedRunner.invoke(RandomizedRunner.java:1627)
	at com.carrotsearch.randomizedtesting.RandomizedRunner$8.evaluate(RandomizedRunner.java:894)
	at org.apache.lucene.util.TestRuleSetupTeardownChained$1.evaluate(TestRuleSetupTeardownChained.java:50)
	at org.apache.lucene.util.AbstractBeforeAfterRule$1.evaluate(AbstractBeforeAfterRule.java:46)
	at org.apache.lucene.util.TestRuleThreadAndTestName$1.evaluate(TestRuleThreadAndTestName.java:49)
	at org.apache.lucene.util.TestRuleIgnoreAfterMaxFailures$1.evaluate(TestRuleIgnoreAfterMaxFailures.java:65)
	at org.apache.lucene.util.TestRuleMarkFailure$1.evaluate(TestRuleMarkFailure.java:48)
	at com.carrotsearch.randomizedtesting.rules.StatementAdapter.evaluate(StatementAdapter.java:36)
	at com.carrotsearch.randomizedtesting.ThreadLeakControl$StatementRunner.run(ThreadLeakControl.java:365)
	at com.carrotsearch.randomizedtesting.ThreadLeakControl.forkTimeoutingTask(ThreadLeakControl.java:798)
	at com.carrotsearch.randomizedtesting.ThreadLeakControl$3.evaluate(ThreadLeakControl.java:458)
	at com.carrotsearch.randomizedtesting.RandomizedRunner.runSingleTest(RandomizedRunner.java:845)
	at com.carrotsearch.randomizedtesting.RandomizedRunner$3.evaluate(RandomizedRunner.java:747)
	at com.carrotsearch.randomizedtesting.RandomizedRunner$4.evaluate(RandomizedRunner.java:781)
	at com.carrotsearch.randomizedtesting.RandomizedRunner$5.evaluate(RandomizedRunner.java:792)
	at org.apache.lucene.util.AbstractBeforeAfterRule$1.evaluate(AbstractBeforeAfterRule.java:46)
	at com.carrotsearch.randomizedtesting.rules.StatementAdapter.evaluate(StatementAdapter.java:36)
	at org.apache.lucene.util.TestRuleStoreClassName$1.evaluate(TestRuleStoreClassName.java:42)
	at com.carrotsearch.randomizedtesting.rules.NoShadowingOrOverridesOnMethodsRule$1.evaluate(NoShadowingOrOverridesOnMethodsRule.java:39)
	at com.carrotsearch.randomizedtesting.rules.NoShadowingOrOverridesOnMethodsRule$1.evaluate(NoShadowingOrOverridesOnMethodsRule.java:39)
	at com.carrotsearch.randomizedtesting.rules.StatementAdapter.evaluate(StatementAdapter.java:36)
	at com.carrotsearch.randomizedtesting.rules.StatementAdapter.evaluate(StatementAdapter.java:36)
	at com.carrotsearch.randomizedtesting.rules.StatementAdapter.evaluate(StatementAdapter.java:36)
	at org.apache.lucene.util.TestRuleAssertionsRequired$1.evaluate(TestRuleAssertionsRequired.java:54)
	at org.apache.lucene.util.TestRuleMarkFailure$1.evaluate(TestRuleMarkFailure.java:48)
	at org.apache.lucene.util.TestRuleIgnoreAfterMaxFailures$1.evaluate(TestRuleIgnoreAfterMaxFailures.java:65)
	at org.apache.lucene.util.TestRuleIgnoreTestSuites$1.evaluate(TestRuleIgnoreTestSuites.java:55)
	at com.carrotsearch.randomizedtesting.rules.StatementAdapter.evaluate(StatementAdapter.java:36)
	at com.carrotsearch.randomizedtesting.ThreadLeakControl$StatementRunner.run(ThreadLeakControl.java:365)
	at java.lang.Thread.run(Thread.java:745)
Caused by: java.lang.RuntimeException: unclosed IndexInput: _4_completion_0.pos
	at org.apache.lucene.store.MockDirectoryWrapper.addFileHandle(MockDirectoryWrapper.java:622)
	at org.apache.lucene.store.MockDirectoryWrapper.openInput(MockDirectoryWrapper.java:666)
	at org.apache.lucene.codecs.lucene50.Lucene50PostingsReader.<init>(Lucene50PostingsReader.java:89)
	at org.apache.lucene.codecs.lucene50.Lucene50PostingsFormat.fieldsProducer(Lucene50PostingsFormat.java:443)
	at org.apache.lucene.search.suggest.document.CompletionFieldsProducer.<init>(CompletionFieldsProducer.java:93)
	at org.apache.lucene.search.suggest.document.CompletionPostingsFormat.fieldsProducer(CompletionPostingsFormat.java:119)
	at org.apache.lucene.codecs.perfield.PerFieldPostingsFormat$FieldsReader.<init>(PerFieldPostingsFormat.java:258)
	at org.apache.lucene.codecs.perfield.PerFieldPostingsFormat.fieldsProducer(PerFieldPostingsFormat.java:336)
	at org.apache.lucene.index.SegmentCoreReaders.<init>(SegmentCoreReaders.java:104)
	at org.apache.lucene.index.SegmentReader.<init>(SegmentReader.java:65)
	at org.apache.lucene.index.ReadersAndUpdates.getReader(ReadersAndUpdates.java:132)
	at org.apache.lucene.index.ReadersAndUpdates.getReadOnlyClone(ReadersAndUpdates.java:184)
	at org.apache.lucene.index.StandardDirectoryReader.open(StandardDirectoryReader.java:99)
	at org.apache.lucene.index.IndexWriter.getReader(IndexWriter.java:430)
	at org.apache.lucene.index.DirectoryReader.open(DirectoryReader.java:86)
	at org.apache.lucene.search.suggest.document.SuggestFieldTest.testSuggestOnAllDeletedDocuments(SuggestFieldTest.java:256)
	at sun.reflect.NativeMethodAccessorImpl.invoke0(Native Method)
	at sun.reflect.NativeMethodAccessorImpl.invoke(NativeMethodAccessorImpl.java:62)
	at sun.reflect.DelegatingMethodAccessorImpl.invoke(DelegatingMethodAccessorImpl.java:43)
	at java.lang.reflect.Method.invoke(Method.java:497)
	at com.carrotsearch.randomizedtesting.RandomizedRunner.invoke(RandomizedRunner.java:1627)
	at com.carrotsearch.randomizedtesting.RandomizedRunner$6.evaluate(RandomizedRunner.java:836)
	at com.carrotsearch.randomizedtesting.RandomizedRunner$7.evaluate(RandomizedRunner.java:872)
	at com.carrotsearch.randomizedtesting.RandomizedRunner$8.evaluate(RandomizedRunner.java:886)
	... 28 more




Build Log:
[...truncated 8151 lines...]
   [junit4] Suite: org.apache.lucene.search.suggest.document.SuggestFieldTest
   [junit4]   2> NOTE: reproduce with: ant test  -Dtestcase=SuggestFieldTest -Dtests.method=testSuggestOnAllDeletedDocuments
-Dtests.seed=B0039B24CD273B6C -Dtests.multiplier=3 -Dtests.slow=true -Dtests.locale=hi_IN
-Dtests.timezone=Pacific/Nauru -Dtests.asserts=true -Dtests.file.encoding=UTF-8
   [junit4] ERROR   0.06s J0 | SuggestFieldTest.testSuggestOnAllDeletedDocuments <<<
   [junit4]    > Throwable #1: java.lang.AssertionError: 
   [junit4]    > Expected: <0>
   [junit4]    >      got: <28>
   [junit4]    > 	at org.apache.lucene.search.suggest.document.SuggestFieldTest.testSuggestOnAllDeletedDocuments(SuggestFieldTest.java:259)
   [junit4]    > 	at java.lang.Thread.run(Thread.java:745)Throwable #2: java.lang.RuntimeException:
MockDirectoryWrapper: cannot close: there are still open files: {_1_Lucene50_0.pay=1, _2_completion_0.pos=1,
_1.nvd=1, _2_completion_0.lkp=1, _0.nvd=1, _1_completion_0.pos=1, _2_Lucene50_0.pos=1, _4_completion_0.pay=1,
_3_completion_0.doc=1, _4_Lucene50_0.doc=1, _1_Lucene50_0.tim=1, _2.nvd=1, _3_completion_0.pos=1,
_4_Lucene50_0.pos=1, _3_completion_0.lkp=1, _2_completion_0.doc=1, _0_completion_0.pos=1,
_4_completion_0.tim=1, _4_completion_0.pos=1, _4_completion_0.lkp=1, _0_Lucene50_0.pos=1,
_2_completion_0.pay=1, _3_Lucene50_0.pay=1, _1_completion_0.doc=1, _4_Lucene50_0.tim=1, _4.fdt=1,
_1_completion_0.lkp=1, _2_completion_0.tim=1, _3_Lucene50_0.tim=1, _3.fdt=1, _4_completion_0.doc=1,
_4_Lucene50_0.pay=1, _0_Lucene50_0.doc=1, _3_Lucene50_0.pos=1, _2.fdt=1, _0_completion_0.pay=1,
_1_completion_0.tim=1, _2_Lucene50_0.tim=1, _1_Lucene50_0.pos=1, _3_Lucene50_0.doc=1, _0_completion_0.tim=1,
_1_completion_0.pay=1, _2_Lucene50_0.pay=1, _1.fdt=1, _0_Lucene50_0.tim=1, _3.nvd=1, _0_completion_0.lkp=1,
_4.nvd=1, _2_Lucene50_0.doc=1, _0.fdt=1, _3_completion_0.tim=1, _0_completion_0.doc=1, _1_Lucene50_0.doc=1,
_0_Lucene50_0.pay=1, _3_completion_0.pay=1}
   [junit4]    > 	at org.apache.lucene.store.MockDirectoryWrapper.close(MockDirectoryWrapper.java:747)
   [junit4]    > 	at org.apache.lucene.search.suggest.document.SuggestFieldTest.after(SuggestFieldTest.java:84)
   [junit4]    > 	at java.lang.Thread.run(Thread.java:745)
   [junit4]    > Caused by: java.lang.RuntimeException: unclosed IndexInput: _4_completion_0.pos
   [junit4]    > 	at org.apache.lucene.store.MockDirectoryWrapper.addFileHandle(MockDirectoryWrapper.java:622)
   [junit4]    > 	at org.apache.lucene.store.MockDirectoryWrapper.openInput(MockDirectoryWrapper.java:666)
   [junit4]    > 	at org.apache.lucene.codecs.lucene50.Lucene50PostingsReader.<init>(Lucene50PostingsReader.java:89)
   [junit4]    > 	at org.apache.lucene.codecs.lucene50.Lucene50PostingsFormat.fieldsProducer(Lucene50PostingsFormat.java:443)
   [junit4]    > 	at org.apache.lucene.search.suggest.document.CompletionFieldsProducer.<init>(CompletionFieldsProducer.java:93)
   [junit4]    > 	at org.apache.lucene.search.suggest.document.CompletionPostingsFormat.fieldsProducer(CompletionPostingsFormat.java:119)
   [junit4]    > 	at org.apache.lucene.codecs.perfield.PerFieldPostingsFormat$FieldsReader.<init>(PerFieldPostingsFormat.java:258)
   [junit4]    > 	at org.apache.lucene.codecs.perfield.PerFieldPostingsFormat.fieldsProducer(PerFieldPostingsFormat.java:336)
   [junit4]    > 	at org.apache.lucene.index.SegmentCoreReaders.<init>(SegmentCoreReaders.java:104)
   [junit4]    > 	at org.apache.lucene.index.SegmentReader.<init>(SegmentReader.java:65)
   [junit4]    > 	at org.apache.lucene.index.ReadersAndUpdates.getReader(ReadersAndUpdates.java:132)
   [junit4]    > 	at org.apache.lucene.index.ReadersAndUpdates.getReadOnlyClone(ReadersAndUpdates.java:184)
   [junit4]    > 	at org.apache.lucene.index.StandardDirectoryReader.open(StandardDirectoryReader.java:99)
   [junit4]    > 	at org.apache.lucene.index.IndexWriter.getReader(IndexWriter.java:430)
   [junit4]    > 	at org.apache.lucene.index.DirectoryReader.open(DirectoryReader.java:86)
   [junit4]    > 	at org.apache.lucene.search.suggest.document.SuggestFieldTest.testSuggestOnAllDeletedDocuments(SuggestFieldTest.java:256)
   [junit4]    > 	... 28 more
   [junit4]   2> NOTE: test params are: codec=HighCompressionCompressingStoredFields(storedFieldsFormat=CompressingStoredFieldsFormat(compressionMode=HIGH_COMPRESSION,
chunkSize=5, maxDocsPerChunk=2, blockSize=4), termVectorsFormat=CompressingTermVectorsFormat(compressionMode=HIGH_COMPRESSION,
chunkSize=5, blockSize=4)), sim=RandomSimilarityProvider(queryNorm=true,coord=yes): {suggest_field_3=IB
LL-DZ(0.3), suggest_field_2=DFR I(ne)L1, suggest_field_1=LM Jelinek-Mercer(0.100000), suggest_field_no_p_sep=IB
LL-L2, suggest_field_no_p_sep_or_pos_inc=DFR I(ne)LZ(0.3), suggest_field_no_p_pos_inc=IB SPL-D2,
suggest_field_default=DFR I(ne)2, sug_field_2=DFR I(n)L2, sug_field_1=DFR I(n)3(800.0), suggest_field=DFR
I(n)1}, locale=hi_IN, timezone=Pacific/Nauru
   [junit4]   2> NOTE: Linux 3.13.0-46-generic amd64/Oracle Corporation 1.8.0_40 (64-bit)/cpus=12,threads=1,free=327510952,total=515899392
   [junit4]   2> NOTE: All tests run in this JVM: [TestFreeTextSuggester, DocumentDictionaryTest,
TestNGramDistance, TestPlainTextDictionary, TestLuceneDictionary, TestSpellChecker, TestDirectSpellChecker,
TestLevenshteinDistance, TestHighFrequencyDictionary, TestJaroWinklerDistance, DocumentValueSourceDictionaryTest,
FileDictionaryTest, TestInputIterator, TestSuggestStopFilter, TestSuggestStopFilterFactory,
SuggestFieldTest]
   [junit4] Completed on J0 in 1.22s, 16 tests, 1 error <<< FAILURES!

[...truncated 24 lines...]
BUILD FAILED
/home/jenkins/workspace/Lucene-Solr-trunk-Linux/build.xml:519: The following error occurred
while executing this line:
/home/jenkins/workspace/Lucene-Solr-trunk-Linux/build.xml:467: The following error occurred
while executing this line:
/home/jenkins/workspace/Lucene-Solr-trunk-Linux/build.xml:61: The following error occurred
while executing this line:
/home/jenkins/workspace/Lucene-Solr-trunk-Linux/extra-targets.xml:39: The following error
occurred while executing this line:
/home/jenkins/workspace/Lucene-Solr-trunk-Linux/lucene/build.xml:456: The following error
occurred while executing this line:
/home/jenkins/workspace/Lucene-Solr-trunk-Linux/lucene/common-build.xml:2081: The following
error occurred while executing this line:
/home/jenkins/workspace/Lucene-Solr-trunk-Linux/lucene/module-build.xml:58: The following
error occurred while executing this line:
/home/jenkins/workspace/Lucene-Solr-trunk-Linux/lucene/common-build.xml:1351: The following
error occurred while executing this line:
/home/jenkins/workspace/Lucene-Solr-trunk-Linux/lucene/common-build.xml:958: There were test
failures: 26 suites, 162 tests, 1 error, 1 ignored

Total time: 29 minutes 33 seconds
Build step 'Invoke Ant' marked build as failure
[description-setter] Description set: Java: 64bit/jdk1.8.0_40 -XX:+UseCompressedOops -XX:+UseParallelGC
Archiving artifacts
Recording test results
Email was triggered for: Failure - Any
Sending email for trigger: Failure - Any



Mime
View raw message