lucene-dev mailing list archives

Site index · List index
Message view « Date » · « Thread »
Top « Date » · « Thread »
From Policeman Jenkins Server <jenk...@thetaphi.de>
Subject [JENKINS] Lucene-Solr-5.x-MacOSX (64bit/jdk1.8.0) - Build # 2168 - Failure!
Date Thu, 23 Apr 2015 07:03:42 GMT
Build: http://jenkins.thetaphi.de/job/Lucene-Solr-5.x-MacOSX/2168/
Java: 64bit/jdk1.8.0 -XX:-UseCompressedOops -XX:+UseConcMarkSweepGC

1 tests failed.
FAILED:  org.apache.solr.spelling.SpellCheckCollatorTest.testEstimatedHitCounts

Error Message:
Exception during query

Stack Trace:
java.lang.RuntimeException: Exception during query
	at __randomizedtesting.SeedInfo.seed([E2E696E785572280:D35D28D220683250]:0)
	at org.apache.solr.SolrTestCaseJ4.assertQ(SolrTestCaseJ4.java:794)
	at org.apache.solr.SolrTestCaseJ4.assertQ(SolrTestCaseJ4.java:761)
	at org.apache.solr.spelling.SpellCheckCollatorTest.testEstimatedHitCounts(SpellCheckCollatorTest.java:530)
	at sun.reflect.NativeMethodAccessorImpl.invoke0(Native Method)
	at sun.reflect.NativeMethodAccessorImpl.invoke(NativeMethodAccessorImpl.java:62)
	at sun.reflect.DelegatingMethodAccessorImpl.invoke(DelegatingMethodAccessorImpl.java:43)
	at java.lang.reflect.Method.invoke(Method.java:497)
	at com.carrotsearch.randomizedtesting.RandomizedRunner.invoke(RandomizedRunner.java:1627)
	at com.carrotsearch.randomizedtesting.RandomizedRunner$6.evaluate(RandomizedRunner.java:836)
	at com.carrotsearch.randomizedtesting.RandomizedRunner$7.evaluate(RandomizedRunner.java:872)
	at com.carrotsearch.randomizedtesting.RandomizedRunner$8.evaluate(RandomizedRunner.java:886)
	at com.carrotsearch.randomizedtesting.rules.SystemPropertiesRestoreRule$1.evaluate(SystemPropertiesRestoreRule.java:57)
	at org.apache.lucene.util.TestRuleSetupTeardownChained$1.evaluate(TestRuleSetupTeardownChained.java:50)
	at org.apache.lucene.util.AbstractBeforeAfterRule$1.evaluate(AbstractBeforeAfterRule.java:46)
	at org.apache.lucene.util.TestRuleThreadAndTestName$1.evaluate(TestRuleThreadAndTestName.java:49)
	at org.apache.lucene.util.TestRuleIgnoreAfterMaxFailures$1.evaluate(TestRuleIgnoreAfterMaxFailures.java:65)
	at org.apache.lucene.util.TestRuleMarkFailure$1.evaluate(TestRuleMarkFailure.java:48)
	at com.carrotsearch.randomizedtesting.rules.StatementAdapter.evaluate(StatementAdapter.java:36)
	at com.carrotsearch.randomizedtesting.ThreadLeakControl$StatementRunner.run(ThreadLeakControl.java:365)
	at com.carrotsearch.randomizedtesting.ThreadLeakControl.forkTimeoutingTask(ThreadLeakControl.java:798)
	at com.carrotsearch.randomizedtesting.ThreadLeakControl$3.evaluate(ThreadLeakControl.java:458)
	at com.carrotsearch.randomizedtesting.RandomizedRunner.runSingleTest(RandomizedRunner.java:845)
	at com.carrotsearch.randomizedtesting.RandomizedRunner$3.evaluate(RandomizedRunner.java:747)
	at com.carrotsearch.randomizedtesting.RandomizedRunner$4.evaluate(RandomizedRunner.java:781)
	at com.carrotsearch.randomizedtesting.RandomizedRunner$5.evaluate(RandomizedRunner.java:792)
	at com.carrotsearch.randomizedtesting.rules.StatementAdapter.evaluate(StatementAdapter.java:36)
	at com.carrotsearch.randomizedtesting.rules.SystemPropertiesRestoreRule$1.evaluate(SystemPropertiesRestoreRule.java:57)
	at org.apache.lucene.util.AbstractBeforeAfterRule$1.evaluate(AbstractBeforeAfterRule.java:46)
	at com.carrotsearch.randomizedtesting.rules.StatementAdapter.evaluate(StatementAdapter.java:36)
	at org.apache.lucene.util.TestRuleStoreClassName$1.evaluate(TestRuleStoreClassName.java:42)
	at com.carrotsearch.randomizedtesting.rules.NoShadowingOrOverridesOnMethodsRule$1.evaluate(NoShadowingOrOverridesOnMethodsRule.java:39)
	at com.carrotsearch.randomizedtesting.rules.NoShadowingOrOverridesOnMethodsRule$1.evaluate(NoShadowingOrOverridesOnMethodsRule.java:39)
	at com.carrotsearch.randomizedtesting.rules.StatementAdapter.evaluate(StatementAdapter.java:36)
	at com.carrotsearch.randomizedtesting.rules.StatementAdapter.evaluate(StatementAdapter.java:36)
	at com.carrotsearch.randomizedtesting.rules.StatementAdapter.evaluate(StatementAdapter.java:36)
	at org.apache.lucene.util.TestRuleAssertionsRequired$1.evaluate(TestRuleAssertionsRequired.java:54)
	at org.apache.lucene.util.TestRuleMarkFailure$1.evaluate(TestRuleMarkFailure.java:48)
	at org.apache.lucene.util.TestRuleIgnoreAfterMaxFailures$1.evaluate(TestRuleIgnoreAfterMaxFailures.java:65)
	at org.apache.lucene.util.TestRuleIgnoreTestSuites$1.evaluate(TestRuleIgnoreTestSuites.java:55)
	at com.carrotsearch.randomizedtesting.rules.StatementAdapter.evaluate(StatementAdapter.java:36)
	at com.carrotsearch.randomizedtesting.ThreadLeakControl$StatementRunner.run(ThreadLeakControl.java:365)
	at java.lang.Thread.run(Thread.java:745)
Caused by: java.lang.RuntimeException: REQUEST FAILED: xpath=//lst[@name='spellcheck']/lst[@name='collations']/lst[@name='collation']/int[@name='hits' and 6 <= . and . <= 10]
	xml response was: <?xml version="1.0" encoding="UTF-8"?>
<response>
<lst name="responseHeader"><int name="status">0</int><int name="QTime">8</int></lst><result name="response" numFound="0" start="0"></result><lst name="spellcheck"><lst name="suggestions"><lst name="everother"><int name="numFound">1</int><int name="startOffset">9</int><int name="endOffset">18</int><arr name="suggestion"><str>everyother</str></arr></lst></lst><lst name="collations"><lst name="collation"><str name="collationQuery">teststop:everyother</str><int name="hits">12</int><lst name="misspellingsAndCorrections"><str name="everother">everyother</str></lst></lst></lst></lst>
</response>

	request was:spellcheck=true&spellcheck.dictionary=direct&spellcheck.count=1&spellcheck.collate=true&spellcheck.maxCollationTries=1&spellcheck.maxCollations=1&spellcheck.collateExtendedResults=true&qt=spellCheckCompRH&q=teststop%3Aeverother&spellcheck.collateMaxCollectDocs=5
	at org.apache.solr.SolrTestCaseJ4.assertQ(SolrTestCaseJ4.java:787)
	... 41 more




Build Log:
[...truncated 10216 lines...]
   [junit4] Suite: org.apache.solr.spelling.SpellCheckCollatorTest
   [junit4]   2> Creating dataDir: /Users/jenkins/workspace/Lucene-Solr-5.x-MacOSX/solr/build/solr-core/test/J1/temp/solr.spelling.SpellCheckCollatorTest E2E696E785572280-001/init-core-data-001
   [junit4]   2> 1050413 T4548 oas.SolrTestCaseJ4.buildSSLConfig Randomized ssl (false) and clientAuth (false)
   [junit4]   2> 1050414 T4548 oas.SolrTestCaseJ4.initCore ####initCore
   [junit4]   2> 1050414 T4548 oasc.SolrResourceLoader.<init> new SolrResourceLoader for directory: '/Users/jenkins/workspace/Lucene-Solr-5.x-MacOSX/solr/core/src/test-files/solr/collection1/'
   [junit4]   2> 1050416 T4548 oasc.SolrResourceLoader.replaceClassLoader Adding 'file:/Users/jenkins/workspace/Lucene-Solr-5.x-MacOSX/solr/core/src/test-files/solr/collection1/lib/classes/' to classloader
   [junit4]   2> 1050416 T4548 oasc.SolrResourceLoader.replaceClassLoader Adding 'file:/Users/jenkins/workspace/Lucene-Solr-5.x-MacOSX/solr/core/src/test-files/solr/collection1/lib/README' to classloader
   [junit4]   2> 1050475 T4548 oasc.SolrConfig.refreshRequestParams current version of requestparams : -1
   [junit4]   2> 1050481 T4548 oasc.SolrConfig.<init> Using Lucene MatchVersion: 5.2.0
   [junit4]   2> 1050499 T4548 oasc.SolrConfig.<init> Loaded SolrConfig: solrconfig-spellcheckcomponent.xml
   [junit4]   2> 1050500 T4548 oass.IndexSchema.readSchema Reading Solr Schema from /Users/jenkins/workspace/Lucene-Solr-5.x-MacOSX/solr/core/src/test-files/solr/collection1/conf/schema.xml
   [junit4]   2> 1050505 T4548 oass.IndexSchema.readSchema [null] Schema name=test
   [junit4]   2> 1050740 T4548 oass.OpenExchangeRatesOrgProvider.init Initialized with rates=open-exchange-rates.json, refreshInterval=1440.
   [junit4]   2> 1050750 T4548 oass.IndexSchema.readSchema default search field in schema is text
   [junit4]   2> 1050751 T4548 oass.IndexSchema.readSchema unique key field: id
   [junit4]   2> 1050762 T4548 oass.FileExchangeRateProvider.reload Reloading exchange rates from file currency.xml
   [junit4]   2> 1050764 T4548 oass.FileExchangeRateProvider.reload Reloading exchange rates from file currency.xml
   [junit4]   2> 1050766 T4548 oass.OpenExchangeRatesOrgProvider.reload Reloading exchange rates from open-exchange-rates.json
   [junit4]   2> 1050767 T4548 oass.OpenExchangeRatesOrgProvider$OpenExchangeRates.<init> WARN Unknown key IMPORTANT NOTE
   [junit4]   2> 1050767 T4548 oass.OpenExchangeRatesOrgProvider$OpenExchangeRates.<init> WARN Expected key, got STRING
   [junit4]   2> 1050768 T4548 oass.OpenExchangeRatesOrgProvider.reload Reloading exchange rates from open-exchange-rates.json
   [junit4]   2> 1050768 T4548 oass.OpenExchangeRatesOrgProvider$OpenExchangeRates.<init> WARN Unknown key IMPORTANT NOTE
   [junit4]   2> 1050768 T4548 oass.OpenExchangeRatesOrgProvider$OpenExchangeRates.<init> WARN Expected key, got STRING
   [junit4]   2> 1050769 T4548 oasc.SolrResourceLoader.locateSolrHome JNDI not configured for solr (NoInitialContextEx)
   [junit4]   2> 1050769 T4548 oasc.SolrResourceLoader.locateSolrHome using system property solr.solr.home: /Users/jenkins/workspace/Lucene-Solr-5.x-MacOSX/solr/core/src/test-files/solr
   [junit4]   2> 1050769 T4548 oasc.SolrResourceLoader.<init> new SolrResourceLoader for directory: '/Users/jenkins/workspace/Lucene-Solr-5.x-MacOSX/solr/core/src/test-files/solr/'
   [junit4]   2> 1050784 T4548 oasc.CoreContainer.<init> New CoreContainer 1419552726
   [junit4]   2> 1050784 T4548 oasc.CoreContainer.load Loading cores into CoreContainer [instanceDir=/Users/jenkins/workspace/Lucene-Solr-5.x-MacOSX/solr/core/src/test-files/solr/]
   [junit4]   2> 1050784 T4548 oasc.CoreContainer.load loading shared library: /Users/jenkins/workspace/Lucene-Solr-5.x-MacOSX/solr/core/src/test-files/solr/lib
   [junit4]   2> 1050785 T4548 oasc.SolrResourceLoader.addToClassLoader WARN Can't find (or read) directory to add to classloader: lib (resolved as: /Users/jenkins/workspace/Lucene-Solr-5.x-MacOSX/solr/core/src/test-files/solr/lib).
   [junit4]   2> 1050793 T4548 oashc.HttpShardHandlerFactory.init created with socketTimeout : 600000,connTimeout : 60000,maxConnectionsPerHost : 20,maxConnections : 10000,corePoolSize : 0,maximumPoolSize : 2147483647,maxThreadIdleTime : 5,sizeOfQueue : -1,fairnessPolicy : false,useRetries : false,
   [junit4]   2> 1050798 T4548 oasu.UpdateShardHandler.<init> Creating UpdateShardHandler HTTP client with params: socketTimeout=30000&connTimeout=30000&retry=true
   [junit4]   2> 1050799 T4548 oasl.LogWatcher.createWatcher SLF4J impl is org.slf4j.impl.Log4jLoggerFactory
   [junit4]   2> 1050799 T4548 oasl.LogWatcher.newRegisteredLogWatcher Registering Log Listener [Log4j (org.slf4j.impl.Log4jLoggerFactory)]
   [junit4]   2> 1050799 T4548 oasc.CoreContainer.load Node Name: testNode
   [junit4]   2> 1050802 T4548 oasc.CoreDescriptor.<init> CORE DESCRIPTOR: {name=collection1, config=solrconfig-spellcheckcomponent.xml, transient=false, schema=schema.xml, loadOnStartup=true, instanceDir=collection1, collection=collection1, absoluteInstDir=/Users/jenkins/workspace/Lucene-Solr-5.x-MacOSX/solr/core/src/test-files/solr/collection1/, dataDir=/Users/jenkins/workspace/Lucene-Solr-5.x-MacOSX/solr/build/solr-core/test/J1/temp/solr.spelling.SpellCheckCollatorTest E2E696E785572280-001/init-core-data-001, shard=shard1}
   [junit4]   2> 1050802 T4549 oasc.SolrResourceLoader.<init> new SolrResourceLoader for directory: '/Users/jenkins/workspace/Lucene-Solr-5.x-MacOSX/solr/core/src/test-files/solr/collection1/'
   [junit4]   2> 1050804 T4549 oasc.SolrResourceLoader.replaceClassLoader Adding 'file:/Users/jenkins/workspace/Lucene-Solr-5.x-MacOSX/solr/core/src/test-files/solr/collection1/lib/classes/' to classloader
   [junit4]   2> 1050804 T4549 oasc.SolrResourceLoader.replaceClassLoader Adding 'file:/Users/jenkins/workspace/Lucene-Solr-5.x-MacOSX/solr/core/src/test-files/solr/collection1/lib/README' to classloader
   [junit4]   2> 1050829 T4549 oasc.SolrConfig.refreshRequestParams current version of requestparams : -1
   [junit4]   2> 1050834 T4549 oasc.SolrConfig.<init> Using Lucene MatchVersion: 5.2.0
   [junit4]   2> 1050853 T4549 oasc.SolrConfig.<init> Loaded SolrConfig: solrconfig-spellcheckcomponent.xml
   [junit4]   2> 1050854 T4549 oass.IndexSchema.readSchema Reading Solr Schema from /Users/jenkins/workspace/Lucene-Solr-5.x-MacOSX/solr/core/src/test-files/solr/collection1/conf/schema.xml
   [junit4]   2> 1050859 T4549 oass.IndexSchema.readSchema [collection1] Schema name=test
   [junit4]   2> 1051009 T4549 oass.OpenExchangeRatesOrgProvider.init Initialized with rates=open-exchange-rates.json, refreshInterval=1440.
   [junit4]   2> 1051014 T4549 oass.IndexSchema.readSchema default search field in schema is text
   [junit4]   2> 1051016 T4549 oass.IndexSchema.readSchema unique key field: id
   [junit4]   2> 1051025 T4549 oass.FileExchangeRateProvider.reload Reloading exchange rates from file currency.xml
   [junit4]   2> 1051027 T4549 oass.FileExchangeRateProvider.reload Reloading exchange rates from file currency.xml
   [junit4]   2> 1051029 T4549 oass.OpenExchangeRatesOrgProvider.reload Reloading exchange rates from open-exchange-rates.json
   [junit4]   2> 1051030 T4549 oass.OpenExchangeRatesOrgProvider$OpenExchangeRates.<init> WARN Unknown key IMPORTANT NOTE
   [junit4]   2> 1051030 T4549 oass.OpenExchangeRatesOrgProvider$OpenExchangeRates.<init> WARN Expected key, got STRING
   [junit4]   2> 1051030 T4549 oass.OpenExchangeRatesOrgProvider.reload Reloading exchange rates from open-exchange-rates.json
   [junit4]   2> 1051031 T4549 oass.OpenExchangeRatesOrgProvider$OpenExchangeRates.<init> WARN Unknown key IMPORTANT NOTE
   [junit4]   2> 1051031 T4549 oass.OpenExchangeRatesOrgProvider$OpenExchangeRates.<init> WARN Expected key, got STRING
   [junit4]   2> 1051031 T4549 oasc.CoreContainer.create Creating SolrCore 'collection1' using configuration from instancedir /Users/jenkins/workspace/Lucene-Solr-5.x-MacOSX/solr/core/src/test-files/solr/collection1/
   [junit4]   2> 1051032 T4549 c:collection1 oasc.SolrCore.initDirectoryFactory org.apache.solr.core.MockDirectoryFactory
   [junit4]   2> 1051032 T4549 c:collection1 oasc.SolrCore.<init> [[collection1] ] Opening new SolrCore at [/Users/jenkins/workspace/Lucene-Solr-5.x-MacOSX/solr/core/src/test-files/solr/collection1/], dataDir=[null]
   [junit4]   2> 1051032 T4549 c:collection1 oasc.SolrCore.initInfoRegistry JMX monitoring not detected for core: collection1
   [junit4]   2> 1051033 T4549 c:collection1 oasc.CachingDirectoryFactory.get return new directory for /Users/jenkins/workspace/Lucene-Solr-5.x-MacOSX/solr/build/solr-core/test/J1/temp/solr.spelling.SpellCheckCollatorTest E2E696E785572280-001/init-core-data-001
   [junit4]   2> 1051033 T4549 c:collection1 oasc.SolrCore.getNewIndexDir New index directory detected: old=null new=/Users/jenkins/workspace/Lucene-Solr-5.x-MacOSX/solr/build/solr-core/test/J1/temp/solr.spelling.SpellCheckCollatorTest E2E696E785572280-001/init-core-data-001/index/
   [junit4]   2> 1051033 T4549 c:collection1 oasc.SolrCore.initIndex WARN [collection1] Solr index directory '/Users/jenkins/workspace/Lucene-Solr-5.x-MacOSX/solr/build/solr-core/test/J1/temp/solr.spelling.SpellCheckCollatorTest E2E696E785572280-001/init-core-data-001/index' doesn't exist. Creating new index...
   [junit4]   2> 1051033 T4549 c:collection1 oasc.CachingDirectoryFactory.get return new directory for /Users/jenkins/workspace/Lucene-Solr-5.x-MacOSX/solr/build/solr-core/test/J1/temp/solr.spelling.SpellCheckCollatorTest E2E696E785572280-001/init-core-data-001/index
   [junit4]   2> 1051034 T4549 c:collection1 oasu.RandomMergePolicy.<init> RandomMergePolicy wrapping class org.apache.lucene.index.TieredMergePolicy: [TieredMergePolicy: maxMergeAtOnce=15, maxMergeAtOnceExplicit=19, maxMergedSegmentMB=50.87890625, floorSegmentMB=1.693359375, forceMergeDeletesPctAllowed=9.95862913766621, segmentsPerTier=20.0, maxCFSSegmentSizeMB=8.796093022207999E12, noCFSRatio=0.0
   [junit4]   2> 1051034 T4549 c:collection1 oasc.SolrDeletionPolicy.onCommit SolrDeletionPolicy.onCommit: commits: num=1
   [junit4]   2> 		commit{dir=MockDirectoryWrapper(RAMDirectory@7fceae55 lockFactory=org.apache.lucene.store.SingleInstanceLockFactory@4a0ce676),segFN=segments_1,generation=1}
   [junit4]   2> 1051035 T4549 c:collection1 oasc.SolrDeletionPolicy.updateCommits newest commit generation = 1
   [junit4]   2> 1051038 T4549 c:collection1 oasc.SolrCore.loadUpdateProcessorChains no updateRequestProcessorChain defined as default, creating implicit default
   [junit4]   2> 1051044 T4549 c:collection1 oashl.XMLLoader.init xsltCacheLifetimeSeconds=60
   [junit4]   2> 1051045 T4549 c:collection1 oashl.XMLLoader.init xsltCacheLifetimeSeconds=60
   [junit4]   2> 1051046 T4549 c:collection1 oashl.XMLLoader.init xsltCacheLifetimeSeconds=60
   [junit4]   2> 1051047 T4549 c:collection1 oashl.XMLLoader.init xsltCacheLifetimeSeconds=60
   [junit4]   2> 1051049 T4549 c:collection1 oasc.RequestHandlers.initHandlersFromConfig Registered paths: /admin/mbeans,standard,spellCheckCompRH,/update/csv,/update/json/docs,/admin/luke,/admin/segments,/get,spellCheckCompRH1,/admin/system,/replication,/admin/properties,/config,/schema,/admin/plugins,/admin/logging,spellCheckWithWordbreak,/update/json,/admin/threads,/admin/ping,/update,/admin/file
   [junit4]   2> 1051049 T4549 c:collection1 oasc.SolrCore.initStatsCache Using default statsCache cache: org.apache.solr.search.stats.LocalStatsCache
   [junit4]   2> 1051050 T4549 c:collection1 oasu.CommitTracker.<init> Hard AutoCommit: disabled
   [junit4]   2> 1051050 T4549 c:collection1 oasu.CommitTracker.<init> Soft AutoCommit: disabled
   [junit4]   2> 1051050 T4549 c:collection1 oasu.RandomMergePolicy.<init> RandomMergePolicy wrapping class org.apache.lucene.index.TieredMergePolicy: [TieredMergePolicy: maxMergeAtOnce=50, maxMergeAtOnceExplicit=38, maxMergedSegmentMB=61.7646484375, floorSegmentMB=0.9765625, forceMergeDeletesPctAllowed=18.740698035530134, segmentsPerTier=18.0, maxCFSSegmentSizeMB=8.796093022207999E12, noCFSRatio=0.42111818171829074
   [junit4]   2> 1051051 T4549 c:collection1 oasc.SolrDeletionPolicy.onInit SolrDeletionPolicy.onInit: commits: num=1
   [junit4]   2> 		commit{dir=MockDirectoryWrapper(RAMDirectory@7fceae55 lockFactory=org.apache.lucene.store.SingleInstanceLockFactory@4a0ce676),segFN=segments_1,generation=1}
   [junit4]   2> 1051051 T4549 c:collection1 oasc.SolrDeletionPolicy.updateCommits newest commit generation = 1
   [junit4]   2> 1051051 T4549 c:collection1 oass.SolrIndexSearcher.<init> Opening Searcher@54db460d[collection1] main
   [junit4]   2> 1051052 T4549 c:collection1 oasr.ManagedResourceStorage.newStorageIO WARN Cannot write to config directory /Users/jenkins/workspace/Lucene-Solr-5.x-MacOSX/solr/core/src/test-files/solr/collection1/conf; switching to use InMemory storage instead.
   [junit4]   2> 1051052 T4549 c:collection1 oasr.RestManager.init Initializing RestManager with initArgs: {}
   [junit4]   2> 1051052 T4549 c:collection1 oasr.ManagedResourceStorage.load Reading _rest_managed.json using InMemoryStorage
   [junit4]   2> 1051052 T4549 c:collection1 oasr.RestManager.init Initializing 0 registered ManagedResources
   [junit4]   2> 1051052 T4549 c:collection1 oashc.SpellCheckComponent.inform Initializing spell checkers
   [junit4]   2> 1051058 T4549 c:collection1 oashc.SpellCheckComponent.inform Registering newSearcher listener for spellchecker: default
   [junit4]   2> 1051064 T4549 c:collection1 oashc.SpellCheckComponent.inform Registering newSearcher listener for spellchecker: default_teststop
   [junit4]   2> 1051064 T4549 c:collection1 oass.DirectSolrSpellChecker.init init: {name=direct,classname=solr.DirectSolrSpellChecker,minQueryLength=3,maxQueryFrequency=100.0,field=teststop}
   [junit4]   2> 1051065 T4549 c:collection1 oass.DirectSolrSpellChecker.init init: {name=direct_lowerfilt,classname=solr.DirectSolrSpellChecker,minQueryLength=3,maxQueryFrequency=100.0,field=lowerfilt}
   [junit4]   2> 1051070 T4549 c:collection1 oashc.SpellCheckComponent.inform Registering newSearcher listener for spellchecker: threshold
   [junit4]   2> 1051070 T4549 c:collection1 oass.DirectSolrSpellChecker.init init: {name=threshold_direct,classname=solr.DirectSolrSpellChecker,field=lowerfilt,spellcheckIndexDir=spellcheckerThreshold,buildOnCommit=true,thresholdTokenFrequency=0.29}
   [junit4]   2> 1051071 T4549 c:collection1 oashc.SpellCheckComponent.inform Registering newSearcher listener for spellchecker: threshold_direct
   [junit4]   2> 1051077 T4549 c:collection1 oashc.SpellCheckComponent.inform Registering newSearcher listener for spellchecker: multipleFields
   [junit4]   2> 1051102 T4549 c:collection1 oashc.SpellCheckComponent.inform Registering newSearcher listener for spellchecker: freq
   [junit4]   2> 1051110 T4549 c:collection1 oashc.SpellCheckComponent.inform Registering newSearcher listener for spellchecker: fqcn
   [junit4]   2> 1051111 T4549 c:collection1 oash.ReplicationHandler.inform Commits will be reserved for  10000
   [junit4]   2> 1051111 T4550 c:collection1 oashc.SpellCheckComponent$SpellCheckerListener.newSearcher Loading spell index for spellchecker: default
   [junit4]   2> 1051111 T4549 c:collection1 oasc.CoreContainer.registerCore registering core: collection1
   [junit4]   2> 1051112 T4550 c:collection1 oashc.SpellCheckComponent$SpellCheckerListener.newSearcher Loading spell index for spellchecker: default_teststop
   [junit4]   2> 1051113 T4550 c:collection1 oashc.SpellCheckComponent$SpellCheckerListener.newSearcher Loading spell index for spellchecker: direct
   [junit4]   2> 1051113 T4550 c:collection1 oashc.SpellCheckComponent$SpellCheckerListener.newSearcher Loading spell index for spellchecker: direct_lowerfilt
   [junit4]   2> 1051113 T4550 c:collection1 oashc.SpellCheckComponent$SpellCheckerListener.newSearcher Loading spell index for spellchecker: wordbreak
   [junit4]   2> 1051113 T4550 c:collection1 oashc.SpellCheckComponent$SpellCheckerListener.newSearcher Loading spell index for spellchecker: threshold
   [junit4]   2> 1051114 T4550 c:collection1 oashc.SpellCheckComponent$SpellCheckerListener.newSearcher Loading spell index for spellchecker: threshold_direct
   [junit4]   2> 1051114 T4550 c:collection1 oashc.SpellCheckComponent$SpellCheckerListener.newSearcher Loading spell index for spellchecker: multipleFields
   [junit4]   2> 1051115 T4550 c:collection1 oashc.SpellCheckComponent$SpellCheckerListener.newSearcher Loading spell index for spellchecker: jarowinkler
   [junit4]   2> 1051116 T4550 c:collection1 oashc.SpellCheckComponent$SpellCheckerListener.newSearcher Loading spell index for spellchecker: external
   [junit4]   2> 1051116 T4548 oas.SolrTestCaseJ4.initCore ####initCore end
   [junit4]   2> 1051116 T4550 c:collection1 oashc.SpellCheckComponent$SpellCheckerListener.newSearcher Loading spell index for spellchecker: freq
   [junit4]   2> 1051117 T4550 c:collection1 oashc.SpellCheckComponent$SpellCheckerListener.newSearcher Loading spell index for spellchecker: fqcn
   [junit4]   2> 1051118 T4550 c:collection1 oashc.SpellCheckComponent$SpellCheckerListener.newSearcher Loading spell index for spellchecker: perDict
   [junit4]   2> 1051118 T4550 c:collection1 oasc.SolrCore.registerSearcher [collection1] Registered new searcher Searcher@54db460d[collection1] main{ExitableDirectoryReader(UninvertingDirectoryReader())}
   [junit4]   2> ASYNC  NEW_CORE C2455 name=collection1 org.apache.solr.core.SolrCore@66a9870
   [junit4]   2> 1051120 T4548 C2455 oasup.LogUpdateProcessor.finish [collection1] webapp=null path=null params={} {add=[0]} 0 4
   [junit4]   2> 1051126 T4548 C2455 oasup.LogUpdateProcessor.finish [collection1] webapp=null path=null params={} {add=[1]} 0 0
   [junit4]   2> 1051134 T4548 C2455 oasup.LogUpdateProcessor.finish [collection1] webapp=null path=null params={} {add=[2]} 0 7
   [junit4]   2> 1051135 T4548 C2455 oasup.LogUpdateProcessor.finish [collection1] webapp=null path=null params={} {add=[3]} 0 0
   [junit4]   2> 1051136 T4548 C2455 oasup.LogUpdateProcessor.finish [collection1] webapp=null path=null params={} {add=[4]} 0 1
   [junit4]   2> 1051140 T4548 C2455 oasup.LogUpdateProcessor.finish [collection1] webapp=null path=null params={} {add=[5]} 0 3
   [junit4]   2> 1051141 T4548 C2455 oasup.LogUpdateProcessor.finish [collection1] webapp=null path=null params={} {add=[6]} 0 1
   [junit4]   2> ASYNC  NEW_CORE C2456 name=collection1 org.apache.solr.core.SolrCore@66a9870
   [junit4]   2> 1051147 T4548 C2456 oasup.LogUpdateProcessor.finish [collection1] webapp=null path=null params={} {add=[7]} 0 0
   [junit4]   2> 1051151 T4548 C2456 oasup.LogUpdateProcessor.finish [collection1] webapp=null path=null params={} {add=[8]} 0 2
   [junit4]   2> 1051152 T4548 C2456 oasup.LogUpdateProcessor.finish [collection1] webapp=null path=null params={} {add=[9]} 0 1
   [junit4]   2> 1051152 T4548 C2456 oasup.LogUpdateProcessor.finish [collection1] webapp=null path=null params={} {add=[10]} 0 0
   [junit4]   2> 1051154 T4548 C2456 oasup.LogUpdateProcessor.finish [collection1] webapp=null path=null params={} {add=[11]} 0 1
   [junit4]   2> 1051155 T4548 C2456 oasup.LogUpdateProcessor.finish [collection1] webapp=null path=null params={} {add=[12]} 0 0
   [junit4]   2> 1051156 T4548 C2456 oasup.LogUpdateProcessor.finish [collection1] webapp=null path=null params={} {add=[13]} 0 0
   [junit4]   2> 1051159 T4548 C2456 oasup.LogUpdateProcessor.finish [collection1] webapp=null path=null params={} {add=[14]} 0 2
   [junit4]   2> 1051160 T4548 C2456 oasup.LogUpdateProcessor.finish [collection1] webapp=null path=null params={} {add=[15]} 0 0
   [junit4]   2> 1051161 T4548 C2456 oasup.LogUpdateProcessor.finish [collection1] webapp=null path=null params={} {add=[16]} 0 0
   [junit4]   2> 1051163 T4548 C2456 oasu.DirectUpdateHandler2.commit start commit{,optimize=false,openSearcher=true,waitSearcher=true,expungeDeletes=false,softCommit=false,prepareCommit=false}
   [junit4]   2> 1051176 T4548 C2456 oasc.SolrDeletionPolicy.onCommit SolrDeletionPolicy.onCommit: commits: num=2
   [junit4]   2> 		commit{dir=MockDirectoryWrapper(RAMDirectory@7fceae55 lockFactory=org.apache.lucene.store.SingleInstanceLockFactory@4a0ce676),segFN=segments_1,generation=1}
   [junit4]   2> 		commit{dir=MockDirectoryWrapper(RAMDirectory@7fceae55 lockFactory=org.apache.lucene.store.SingleInstanceLockFactory@4a0ce676),segFN=segments_2,generation=2}
   [junit4]   2> 1051177 T4548 C2456 oasc.SolrDeletionPolicy.updateCommits newest commit generation = 2
   [junit4]   2> 1051179 T4548 C2456 oass.SolrIndexSearcher.<init> Opening Searcher@281e3391[collection1] main
   [junit4]   2> 1051179 T4548 C2456 oasu.DirectUpdateHandler2.commit end_commit_flush
   [junit4]   2> 1051179 T4550 oashc.SpellCheckComponent$SpellCheckerListener.buildSpellIndex Building spell index for spell checker: default
   [junit4]   2> 1051235 T4550 oashc.SpellCheckComponent$SpellCheckerListener.buildSpellIndex Building spell index for spell checker: default_teststop
   [junit4]   2> 1051294 T4550 oashc.SpellCheckComponent$SpellCheckerListener.buildSpellIndex Building spell index for spell checker: threshold
   [junit4]   2> 1051310 T4550 oashc.SpellCheckComponent$SpellCheckerListener.buildSpellIndex Building spell index for spell checker: threshold_direct
   [junit4]   2> 1051310 T4550 oashc.SpellCheckComponent$SpellCheckerListener.buildSpellIndex Building spell index for spell checker: multipleFields
   [junit4]   2> 1051346 T4550 oashc.SpellCheckComponent$SpellCheckerListener.buildSpellIndex Building spell index for spell checker: freq
   [junit4]   2> 1051383 T4550 oashc.SpellCheckComponent$SpellCheckerListener.buildSpellIndex Building spell index for spell checker: fqcn
   [junit4]   2> 1051432 T4550 oasc.SolrCore.registerSearcher [collection1] Registered new searcher Searcher@281e3391[collection1] main{ExitableDirectoryReader(UninvertingDirectoryReader(Uninverting(_0(5.2.0):C3) Uninverting(_1(5.2.0):C3) Uninverting(_2(5.2.0):C3) Uninverting(_3(5.2.0):C3) Uninverting(_4(5.2.0):C3) Uninverting(_5(5.2.0):C2)))}
   [junit4]   2> ASYNC  NEW_CORE C2457 name=collection1 org.apache.solr.core.SolrCore@66a9870
   [junit4]   2> 1051433 T4548 C2457 oasup.LogUpdateProcessor.finish [collection1] webapp=null path=null params={} {commit=} 0 271
   [junit4]   2> 1051438 T4548 oas.SolrTestCaseJ4.setUp ###Starting testEstimatedHitCounts
   [junit4]   2> 1051454 T4548 C2457 oasc.SolrCore.execute [collection1] webapp=null path=null params={spellcheck=true&spellcheck.dictionary=direct&spellcheck.count=1&spellcheck.collate=true&spellcheck.maxCollationTries=1&spellcheck.maxCollations=1&spellcheck.collateExtendedResults=true&qt=spellCheckCompRH&q=teststop%3Ametnoia} hits=0 status=0 QTime=16 
   [junit4]   2> 1051460 T4548 C2457 oasc.SolrCore.execute [collection1] webapp=null path=null params={spellcheck=true&spellcheck.dictionary=direct&spellcheck.count=1&spellcheck.collate=true&spellcheck.maxCollationTries=1&spellcheck.maxCollations=1&spellcheck.collateExtendedResults=true&qt=spellCheckCompRH&q=teststop%3Ametnoia&spellcheck.collateMaxCollectDocs=0} hits=0 status=0 QTime=5 
   [junit4]   2> ASYNC  NEW_CORE C2458 name=collection1 org.apache.solr.core.SolrCore@66a9870
   [junit4]   2> 1051497 T4548 C2458 oasc.SolrCore.execute [collection1] webapp=null path=null params={spellcheck=true&spellcheck.dictionary=direct&spellcheck.count=1&spellcheck.collate=true&spellcheck.maxCollationTries=1&spellcheck.maxCollations=1&spellcheck.collateExtendedResults=true&qt=spellCheckCompRH&q=teststop%3Ametnoia&spellcheck.collateMaxCollectDocs=30} hits=0 status=0 QTime=30 
   [junit4]   2> 1051507 T4548 C2458 oasc.SolrCore.execute [collection1] webapp=null path=null params={spellcheck=true&spellcheck.dictionary=direct&spellcheck.count=1&spellcheck.collate=true&spellcheck.maxCollationTries=1&spellcheck.maxCollations=1&spellcheck.collateExtendedResults=true&qt=spellCheckCompRH&q=teststop%3Ametnoia&spellcheck.collateMaxCollectDocs=100} hits=0 status=0 QTime=8 
   [junit4]   2> 1051515 T4548 C2458 oasc.SolrCore.execute [collection1] webapp=null path=null params={spellcheck=true&spellcheck.dictionary=direct&spellcheck.count=1&spellcheck.collate=true&spellcheck.maxCollationTries=1&spellcheck.maxCollations=1&spellcheck.collateExtendedResults=true&qt=spellCheckCompRH&q=teststop%3Ametnoia&spellcheck.collateMaxCollectDocs=10000} hits=0 status=0 QTime=7 
   [junit4]   2> 1051526 T4548 C2458 oasc.SolrCore.execute [collection1] webapp=null path=null params={spellcheck=true&spellcheck.dictionary=direct&spellcheck.count=1&spellcheck.collate=true&spellcheck.maxCollationTries=1&spellcheck.maxCollations=1&spellcheck.collateExtendedResults=true&qt=spellCheckCompRH&q=teststop%3Ametnoia&spellcheck.collateMaxCollectDocs=3} hits=0 status=0 QTime=9 
   [junit4]   2> 1051534 T4548 C2458 oasc.SolrCore.execute [collection1] webapp=null path=null params={spellcheck=true&spellcheck.dictionary=direct&spellcheck.count=1&spellcheck.collate=true&spellcheck.maxCollationTries=1&spellcheck.maxCollations=1&spellcheck.collateExtendedResults=true&qt=spellCheckCompRH&q=teststop%3Ametnoia&spellcheck.collateMaxCollectDocs=17} hits=0 status=0 QTime=5 
   [junit4]   2> 1051548 T4548 C2458 oasc.SolrCore.execute [collection1] webapp=null path=null params={spellcheck=true&spellcheck.dictionary=direct&spellcheck.count=1&spellcheck.collate=true&spellcheck.maxCollationTries=1&spellcheck.maxCollations=1&spellcheck.collateExtendedResults=true&qt=spellCheckCompRH&q=teststop%3Ametnoia&spellcheck.collateMaxCollectDocs=17} hits=0 status=0 QTime=12 
   [junit4]   2> 1051554 T4548 C2458 oasc.SolrCore.execute [collection1] webapp=null path=null params={spellcheck=true&spellcheck.dictionary=direct&spellcheck.count=1&spellcheck.collate=true&spellcheck.maxCollationTries=1&spellcheck.maxCollations=1&spellcheck.collateExtendedResults=true&qt=spellCheckCompRH&q=teststop%3Ametnoia&spellcheck.collateMaxCollectDocs=6} hits=0 status=0 QTime=4 
   [junit4]   2> ASYNC  NEW_CORE C2459 name=collection1 org.apache.solr.core.SolrCore@66a9870
   [junit4]   2> 1051565 T4548 C2459 oasc.SolrCore.execute [collection1] webapp=null path=null params={spellcheck=true&spellcheck.dictionary=direct&spellcheck.count=1&spellcheck.collate=true&spellcheck.maxCollationTries=1&spellcheck.maxCollations=1&spellcheck.collateExtendedResults=true&qt=spellCheckCompRH&q=teststop%3Ametnoia&spellcheck.collateMaxCollectDocs=12} hits=0 status=0 QTime=11 
   [junit4]   2> 1051573 T4548 C2459 oasc.SolrCore.execute [collection1] webapp=null path=null params={spellcheck=true&spellcheck.dictionary=direct&spellcheck.count=1&spellcheck.collate=true&spellcheck.maxCollationTries=1&spellcheck.maxCollations=1&spellcheck.collateExtendedResults=true&qt=spellCheckCompRH&q=teststop%3Ametnoia&spellcheck.collateMaxCollectDocs=14} hits=0 status=0 QTime=7 
   [junit4]   2> 1051593 T4548 C2459 oasc.SolrCore.execute [collection1] webapp=null path=null params={spellcheck=true&spellcheck.dictionary=direct&spellcheck.count=1&spellcheck.collate=true&spellcheck.maxCollationTries=1&spellcheck.maxCollations=1&spellcheck.collateExtendedResults=true&qt=spellCheckCompRH&q=teststop%3Ametnoia&spellcheck.collateMaxCollectDocs=17} hits=0 status=0 QTime=19 
   [junit4]   2> 1051605 T4548 C2459 oasc.SolrCore.execute [collection1] webapp=null path=null params={spellcheck=true&spellcheck.dictionary=direct&spellcheck.count=1&spellcheck.collate=true&spellcheck.maxCollationTries=1&spellcheck.maxCollations=1&spellcheck.collateExtendedResults=true&qt=spellCheckCompRH&q=teststop%3Ametnoia&spellcheck.collateMaxCollectDocs=16} hits=0 status=0 QTime=11 
   [junit4]   2> 1051612 T4548 C2459 oasc.SolrCore.execute [collection1] webapp=null path=null params={spellcheck=true&spellcheck.dictionary=direct&spellcheck.count=1&spellcheck.collate=true&spellcheck.maxCollationTries=1&spellcheck.maxCollations=1&spellcheck.collateExtendedResults=true&qt=spellCheckCompRH&q=teststop%3Ametnoia&spellcheck.collateMaxCollectDocs=3} hits=0 status=0 QTime=6 
   [junit4]   2> 1051619 T4548 C2459 oasc.SolrCore.execute [collection1] webapp=null path=null params={spellcheck=true&spellcheck.dictionary=direct&spellcheck.count=1&spellcheck.collate=true&spellcheck.maxCollationTries=1&spellcheck.maxCollations=1&spellcheck.collateExtendedResults=true&qt=spellCheckCompRH&q=teststop%3Ametnoia&spellcheck.collateMaxCollectDocs=7} hits=0 status=0 QTime=6 
   [junit4]   2> 1051627 T4548 C2459 oasc.SolrCore.execute [collection1] webapp=null path=null params={spellcheck=true&spellcheck.dictionary=direct&spellcheck.count=1&spellcheck.collate=true&spellcheck.maxCollationTries=1&spellcheck.maxCollations=1&spellcheck.collateExtendedResults=true&qt=spellCheckCompRH&q=teststop%3Ametnoia&spellcheck.collateMaxCollectDocs=11} hits=0 status=0 QTime=7 
   [junit4]   2> 1051634 T4548 C2459 oasc.SolrCore.execute [collection1] webapp=null path=null params={spellcheck=true&spellcheck.dictionary=direct&spellcheck.count=1&spellcheck.collate=true&spellcheck.maxCollationTries=1&spellcheck.maxCollations=1&spellcheck.collateExtendedResults=true&qt=spellCheckCompRH&q=teststop%3Ametnoia&spellcheck.collateMaxCollectDocs=13} hits=0 status=0 QTime=5 
   [junit4]   2> ASYNC  NEW_CORE C2460 name=collection1 org.apache.solr.core.SolrCore@66a9870
   [junit4]   2> 1051655 T4548 C2460 oasc.SolrCore.execute [collection1] webapp=null path=null params={spellcheck=true&spellcheck.dictionary=direct&spellcheck.count=1&spellcheck.collate=true&spellcheck.maxCollationTries=1&spellcheck.maxCollations=1&spellcheck.collateExtendedResults=true&qt=spellCheckCompRH&q=teststop%3Aeverother&spellcheck.collateMaxCollectDocs=5} hits=0 status=0 QTime=8 
   [junit4]   2> 1051658 T4548 oas.SolrTestCaseJ4.assertQ ERROR REQUEST FAILED: xpath=//lst[@name='spellcheck']/lst[@name='collations']/lst[@name='collation']/int[@name='hits' and 6 <= . and . <= 10]
   [junit4]   2> 		xml response was: <?xml version="1.0" encoding="UTF-8"?>
   [junit4]   2> 	<response>
   [junit4]   2> 	<lst name="responseHeader"><int name="status">0</int><int name="QTime">8</int></lst><result name="response" numFound="0" start="0"></result><lst name="spellcheck"><lst name="suggestions"><lst name="everother"><int name="numFound">1</int><int name="startOffset">9</int><int name="endOffset">18</int><arr name="suggestion"><str>everyother</str></arr></lst></lst><lst name="collations"><lst name="collation"><str name="collationQuery">teststop:everyother</str><int name="hits">12</int><lst name="misspellingsAndCorrections"><str name="everother">everyother</str></lst></lst></lst></lst>
   [junit4]   2> 	</response>
   [junit4]   2> 	
   [junit4]   2> 		request was:spellcheck=true&spellcheck.dictionary=direct&spellcheck.count=1&spellcheck.collate=true&spellcheck.maxCollationTries=1&spellcheck.maxCollations=1&spellcheck.collateExtendedResults=true&qt=spellCheckCompRH&q=teststop%3Aeverother&spellcheck.collateMaxCollectDocs=5
   [junit4]   2> 1051659 T4548 oasc.SolrException.log ERROR REQUEST FAILED: spellcheck=true&spellcheck.dictionary=direct&spellcheck.count=1&spellcheck.collate=true&spellcheck.maxCollationTries=1&spellcheck.maxCollations=1&spellcheck.collateExtendedResults=true&qt=spellCheckCompRH&q=teststop%3Aeverother&spellcheck.collateMaxCollectDocs=5:java.lang.RuntimeException: REQUEST FAILED: xpath=//lst[@name='spellcheck']/lst[@name='collations']/lst[@name='collation']/int[@name='hits' and 6 <= . and . <= 10]
   [junit4]   2> 		xml response was: <?xml version="1.0" encoding="UTF-8"?>
   [junit4]   2> 	<response>
   [junit4]   2> 	<lst name="responseHeader"><int name="status">0</int><int name="QTime">8</int></lst><result name="response" numFound="0" start="0"></result><lst name="spellcheck"><lst name="suggestions"><lst name="everother"><int name="numFound">1</int><int name="startOffset">9</int><int name="endOffset">18</int><arr name="suggestion"><str>everyother</str></arr></lst></lst><lst name="collations"><lst name="collation"><str name="collationQuery">teststop:everyother</str><int name="hits">12</int><lst name="misspellingsAndCorrections"><str name="everother">everyother</str></lst></lst></lst></lst>
   [junit4]   2> 	</response>
   [junit4]   2> 	
   [junit4]   2> 		request was:spellcheck=true&spellcheck.dictionary=direct&spellcheck.count=1&spellcheck.collate=true&spellcheck.maxCollationTries=1&spellcheck.maxCollations=1&spellcheck.collateExtendedResults=true&qt=spellCheckCompRH&q=teststop%3Aeverother&spellcheck.collateMaxCollectDocs=5
   [junit4]   2> 		at org.apache.solr.SolrTestCaseJ4.assertQ(SolrTestCaseJ4.java:787)
   [junit4]   2> 		at org.apache.solr.SolrTestCaseJ4.assertQ(SolrTestCaseJ4.java:761)
   [junit4]   2> 		at org.apache.solr.spelling.SpellCheckCollatorTest.testEstimatedHitCounts(SpellCheckCollatorTest.java:530)
   [junit4]   2> 		at sun.reflect.NativeMethodAccessorImpl.invoke0(Native Method)
   [junit4]   2> 		at sun.reflect.NativeMethodAccessorImpl.invoke(NativeMethodAccessorImpl.java:62)
   [junit4]   2> 		at sun.reflect.DelegatingMethodAccessorImpl.invoke(DelegatingMethodAccessorImpl.java:43)
   [junit4]   2> 		at java.lang.reflect.Method.invoke(Method.java:497)
   [junit4]   2> 		at com.carrotsearch.randomizedtesting.RandomizedRunner.invoke(RandomizedRunner.java:1627)
   [junit4]   2> 		at com.carrotsearch.randomizedtesting.RandomizedRunner$6.evaluate(RandomizedRunner.java:836)
   [junit4]   2> 		at com.carrotsearch.randomizedtesting.RandomizedRunner$7.evaluate(RandomizedRunner.java:872)
   [junit4]   2> 		at com.carrotsearch.randomizedtesting.RandomizedRunner$8.evaluate(RandomizedRunner.java:886)
   [junit4]   2> 		at com.carrotsearch.randomizedtesting.rules.SystemPropertiesRestoreRule$1.evaluate(SystemPropertiesRestoreRule.java:57)
   [junit4]   2> 		at org.apache.lucene.util.TestRuleSetupTeardownChained$1.evaluate(TestRuleSetupTeardownChained.java:50)
   [junit4]   2> 		at org.apache.lucene.util.AbstractBeforeAfterRule$1.evaluate(AbstractBeforeAfterRule.java:46)
   [junit4]   2> 		at org.apache.lucene.util.TestRuleThreadAndTestName$1.evaluate(TestRuleThreadAndTestName.java:49)
   [junit4]   2> 		at org.apache.lucene.util.TestRuleIgnoreAfterMaxFailures$1.evaluate(TestRuleIgnoreAfterMaxFailures.java:65)
   [junit4]   2> 		at org.apache.lucene.util.TestRuleMarkFailure$1.evaluate(TestRuleMarkFailure.java:48)
   [junit4]   2> 		at com.carrotsearch.randomizedtesting.rules.StatementAdapter.evaluate(StatementAdapter.java:36)
   [junit4]   2> 		at com.carrotsearch.randomizedtesting.ThreadLeakControl$StatementRunner.run(ThreadLeakControl.java:365)
   [junit4]   2> 		at com.carrotsearch.randomizedtesting.ThreadLeakControl.forkTimeoutingTask(ThreadLeakControl.java:798)
   [junit4]   2> 		at com.carrotsearch.randomizedtesting.ThreadLeakControl$3.evaluate(ThreadLeakControl.java:458)
   [junit4]   2> 		at com.carrotsearch.randomizedtesting.RandomizedRunner.runSingleTest(RandomizedRunner.java:845)
   [junit4]   2> 		at com.carrotsearch.randomizedtesting.RandomizedRunner$3.evaluate(RandomizedRunner.java:747)
   [junit4]   2> 		at com.carrotsearch.randomizedtesting.RandomizedRunner$4.evaluate(RandomizedRunner.java:781)
   [junit4]   2> 		at com.carrotsearch.randomizedtesting.RandomizedRunner$5.evaluate(RandomizedRunner.java:792)
   [junit4]   2> 		at com.carrotsearch.randomizedtesting.rules.StatementAdapter.evaluate(StatementAdapter.java:36)
   [junit4]   2> 		at com.carrotsearch.randomizedtesting.rules.SystemPropertiesRestoreRule$1.evaluate(SystemPropertiesRestoreRule.java:57)
   [junit4]   2> 		at org.apache.lucene.util.AbstractBeforeAfterRule$1.evaluate(AbstractBeforeAfterRule.java:46)
   [junit4]   2> 		at com.carrotsearch.randomizedtesting.rules.StatementAdapter.evaluate(StatementAdapter.java:36)
   [junit4]   2> 		at org.apache.lucene.util.TestRuleStoreClassName$1.evaluate(TestRuleStoreClassName.java:42)
   [junit4]   2> 		at com.carrotsearch.randomizedtesting.rules.NoShadowingOrOverridesOnMethodsRule$1.evaluate(NoShadowingOrOverridesOnMethodsRule.java:39)
   [junit4]   2> 		at com.carrotsearch.randomizedtesting.rules.NoShadowingOrOverridesOnMethodsRule$1.evaluate(NoShadowingOrOverridesOnMethodsRule.java:39)
   [junit4]   2> 		at com.carrotsearch.randomizedtesting.rules.StatementAdapter.evaluate(StatementAdapter.java:36)
   [junit4]   2> 		at com.carrotsearch.randomizedtesting.rules.StatementAdapter.evaluate(StatementAdapter.java:36)
   [junit4]   2> 		at com.carrotsearch.randomizedtesting.rules.StatementAdapter.evaluate(StatementAdapter.java:36)
   [junit4]   2> 		at org.apache.lucene.util.TestRuleAssertionsRequired$1.evaluate(TestRuleAssertionsRequired.java:54)
   [junit4]   2> 		at org.apache.lucene.util.TestRuleMarkFailure$1.evaluate(TestRuleMarkFailure.java:48)
   [junit4]   2> 		at org.apache.lucene.util.TestRuleIgnoreAfterMaxFailures$1.evaluate(TestRuleIgnoreAfterMaxFailures.java:65)
   [junit4]   2> 		at org.apache.lucene.util.TestRuleIgnoreTestSuites$1.evaluate(TestRuleIgnoreTestSuites.java:55)
   [junit4]   2> 		at com.carrotsearch.randomizedtesting.rules.StatementAdapter.evaluate(StatementAdapter.java:36)
   [junit4]   2> 		at com.carrotsearch.randomizedtesting.ThreadLeakControl$StatementRunner.run(ThreadLeakControl.java:365)
   [junit4]   2> 		at java.lang.Thread.run(Thread.java:745)
   [junit4]   2> 	
   [junit4]   2> 1051661 T4548 oas.SolrTestCaseJ4.tearDown ###Ending testEstimatedHitCounts
   [junit4]   2> NOTE: reproduce with: ant test  -Dtestcase=SpellCheckCollatorTest -Dtests.method=testEstimatedHitCounts -Dtests.seed=E2E696E785572280 -Dtests.slow=true -Dtests.locale=hr -Dtests.timezone=America/Argentina/Ushuaia -Dtests.asserts=true -Dtests.file.encoding=UTF-8
   [junit4] ERROR   0.25s J1 | SpellCheckCollatorTest.testEstimatedHitCounts <<<
   [junit4]    > Throwable #1: java.lang.RuntimeException: Exception during query
   [junit4]    > 	at __randomizedtesting.SeedInfo.seed([E2E696E785572280:D35D28D220683250]:0)
   [junit4]    > 	at org.apache.solr.SolrTestCaseJ4.assertQ(SolrTestCaseJ4.java:794)
   [junit4]    > 	at org.apache.solr.SolrTestCaseJ4.assertQ(SolrTestCaseJ4.java:761)
   [junit4]    > 	at org.apache.solr.spelling.SpellCheckCollatorTest.testEstimatedHitCounts(SpellCheckCollatorTest.java:530)
   [junit4]    > 	at java.lang.Thread.run(Thread.java:745)
   [junit4]    > Caused by: java.lang.RuntimeException: REQUEST FAILED: xpath=//lst[@name='spellcheck']/lst[@name='collations']/lst[@name='collation']/int[@name='hits' and 6 <= . and . <= 10]
   [junit4]    > 	xml response was: <?xml version="1.0" encoding="UTF-8"?>
   [junit4]    > <response>
   [junit4]    > <lst name="responseHeader"><int name="status">0</int><int name="QTime">8</int></lst><result name="response" numFound="0" start="0"></result><lst name="spellcheck"><lst name="suggestions"><lst name="everother"><int name="numFound">1</int><int name="startOffset">9</int><int name="endOffset">18</int><arr name="suggestion"><str>everyother</str></arr></lst></lst><lst name="collations"><lst name="collation"><str name="collationQuery">teststop:everyother</str><int name="hits">12</int><lst name="misspellingsAndCorrections"><str name="everother">everyother</str></lst></lst></lst></lst>
   [junit4]    > </response>
   [junit4]    > 	request was:spellcheck=true&spellcheck.dictionary=direct&spellcheck.count=1&spellcheck.collate=true&spellcheck.maxCollationTries=1&spellcheck.maxCollations=1&spellcheck.collateExtendedResults=true&qt=spellCheckCompRH&q=teststop%3Aeverother&spellcheck.collateMaxCollectDocs=5
   [junit4]    > 	at org.apache.solr.SolrTestCaseJ4.assertQ(SolrTestCaseJ4.java:787)
   [junit4]    > 	... 41 more
   [junit4]   2> 1051703 T4548 oas.SolrTestCaseJ4.setUp ###Starting testContextSensitiveCollate
   [junit4]   2> 1051715 T4548 C2460 oasc.SolrCore.execute [collection1] webapp=null path=null params={spellcheck.collateExtendedResults=true&qt=spellCheckCompRH&spellcheck.dictionary=direct&indent=true&spellcheck.maxCollations=1&spellcheck.maxCollationTries=10&spellcheck.alternativeTermCount=5&spellcheck.build=true&spellcheck.extendedResults=true&q=teststop:(flew+AND+form+AND+heathrow)&spellcheck.maxResultsForSuggest=0&spellcheck=true&spellcheck.count=10&wt=xml&spellcheck.collate=true} hits=0 status=0 QTime=11 
   [junit4]   2> 1051738 T4548 C2460 oasc.SolrCore.execute [collection1] webapp=null path=null params={spellcheck.collateExtendedResults=true&qt=spellCheckCompRH&spellcheck.dictionary=direct&indent=true&spellcheck.maxCollations=1&spellcheck.maxCollationTries=10&spellcheck.alternativeTermCount=5&spellcheck.extendedResults=true&q=teststop:(june+AND+customs)&spellcheck.maxResultsForSuggest=1&spellcheck=true&spellcheck.count=10&wt=xml&spellcheck.collate=true} hits=1 status=0 QTime=22 
   [junit4]   2> ASYNC  NEW_CORE C2461 name=collection1 org.apache.solr.core.SolrCore@66a9870
   [junit4]   2> 1051759 T4548 C2461 oasc.SolrCore.execute [collection1] webapp=null path=null params={mm=2&q=teststop:(june+customs)&qt=spellCheckCompRH&spellcheck.dictionary=direct&indent=true&spellcheck=true&spellcheck.count=10&spellcheck.alternativeTermCount=0&wt=xml&spellcheck.collate=true} hits=2 status=0 QTime=1 
   [junit4]   2> 1051850 T4548 C2461 oasc.SolrCore.execute [collection1] webapp=null path=null params={spellcheck.collateExtendedResults=true&qt=spellCheckCompRH&spellcheck.dictionary=default_teststop&indent=true&spellcheck.maxCollations=1&spellcheck.maxCollationTries=10&spellcheck.alternativeTermCount=5&spellcheck.build=true&spellcheck.extendedResults=true&q=teststop:(flew+AND+form+AND+heathrow)&spellcheck.maxResultsForSuggest=0&spellcheck=true&spellcheck.count=10&wt=xml&spellcheck.collate=true} hits=0 status=0 QTime=86 
   [junit4]   2> 1051863 T4548 C2461 oasc.SolrCore.execute [collection1] webapp=null path=null params={spellcheck.collateExtendedResults=true&qt=spellCheckCompRH&spellcheck.dictionary=default_teststop&indent=true&spellcheck.maxCollations=1&spellcheck.maxCollationTries=10&spellcheck.alternativeTermCount=5&spellcheck.extendedResults=true&q=teststop:(june+AND+customs)&spellcheck.maxResultsForSuggest=1&spellcheck=true&spellcheck.count=10&wt=xml&spellcheck.collate=true} hits=1 status=0 QTime=11 
   [junit4]   2> ASYNC  NEW_CORE C2462 name=collection1 org.apache.solr.core.SolrCore@66a9870
   [junit4]   2> 1051876 T4548 C2462 oasc.SolrCore.execute [collection1] webapp=null path=null params={mm=2&q=teststop:(june+customs)&qt=spellCheckCompRH&spellcheck.dictionary=default_teststop&indent=true&spellcheck=true&spellcheck.count=10&spellcheck.alternativeTermCount=0&wt=xml&spellcheck.collate=true} hits=2 status=0 QTime=9 
   [junit4]   2> 1051876 T4548 oas.SolrTestCaseJ4.tearDown ###Ending testContextSensitiveCollate
   [junit4]   2> 1051881 T4548 oas.SolrTestCaseJ4.setUp ###Starting testCollateWithMultipleRequestHandlers
   [junit4]   2> 1051934 T4548 oas.SolrTestCaseJ4.tearDown ###Ending testCollateWithMultipleRequestHandlers
   [junit4]   2> 1051945 T4548 oas.SolrTestCaseJ4.setUp ###Starting testCollateWithGrouping
   [junit4]   2> 1052008 T4548 oas.SolrTestCaseJ4.tearDown ###Ending testCollateWithGrouping
   [junit4]   2> 1052016 T4548 oas.SolrTestCaseJ4.setUp ###Starting testCollationWithHypens
   [junit4]   2> 1052146 T4548 oas.SolrTestCaseJ4.tearDown ###Ending testCollationWithHypens
   [junit4]   2> 1052153 T4548 oas.SolrTestCaseJ4.setUp ###Starting testZeroTries
   [junit4]   2> 1052207 T4548 oas.SolrTestCaseJ4.tearDown ###Ending testZeroTries
   [junit4]   2> 1052217 T4548 oas.SolrTestCaseJ4.setUp ###Starting testCollateWithOverride
   [junit4]   2> ASYNC  NEW_CORE C2463 name=collection1 org.apache.solr.core.SolrCore@66a9870
   [junit4]   2> 1052242 T4548 C2463 oasc.SolrCore.execute [collection1] webapp=null path=null params={mm=1&q=partisian+politcal+mashine&defType=edismax&spellcheck.dictionary=direct&qt=spellCheckCompRH&spellcheck=true&qf=teststop&spellcheck.maxCollations=10&spellcheck.count=10&spellcheck.maxCollationTries=10&wt=xml&spellcheck.collate=true} hits=0 status=0 QTime=24 
   [junit4]   2> 1052285 T4548 C2463 oasc.SolrCore.execute [collection1] webapp=null path=null params={mm=1&spellcheck.dictionary=direct&qt=spellCheckCompRH&spellcheck.maxCollations=10&spellcheck.maxCollationTries=10&q=partisian+politcal+mashine&defType=edismax&spellcheck.collateParam.mm=100%25&spellcheck=true&qf=teststop&spellcheck.count=10&wt=xml&spellcheck.collate=true} hits=0 status=0 QTime=40 
   [junit4]   2> 1052286 T4548 oas.SolrTestCaseJ4.tearDown ###Ending testCollateWithOverride
   [junit4]   2> 1052297 T4548 oas.SolrTestCaseJ4.setUp ###Starting testExtendedCollate
   [junit4]   2> 1052395 T4548 oas.SolrTestCaseJ4.tearDown ###Ending testExtendedCollate
   [junit4]   2> 1052403 T4548 oas.SolrTestCaseJ4.setUp ###Starting testCollateWithFilter
   [junit4]   2> 1052461 T4548 oas.SolrTestCaseJ4.tearDown ###Ending testCollateWithFilter
   [junit4]   2> 1052463 T4548 oas.SolrTestCaseJ4.deleteCore ###deleteCore
   [junit4]   2> 1052463 T4548 oasc.CoreContainer.shutdown Shutting down CoreContainer instance=1419552726
   [junit4]   2> 1052464 T4548 oasc.SolrCore.close [collection1]  CLOSING SolrCore org.apache.solr.core.SolrCore@66a9870
   [junit4]   2> 1052464 T4548 oasu.DirectUpdateHandler2.close closing DirectUpdateHandler2{commits=1,autocommits=0,soft autocommits=0,optimizes=0,rollbacks=0,expungeDeletes=0,docsPending=0,adds=0,deletesById=0,deletesByQuery=0,errors=0,cumulative_adds=17,cumulative_deletesById=0,cumulative_deletesByQuery=0,cumulative_errors=0}
   [junit4]   2> 1052464 T4548 oasu.SolrCoreState.decrefSolrCoreState Closing SolrCoreState
   [junit4]   2> 1052465 T4548 oasu.DefaultSolrCoreState.closeIndexWriter SolrCoreState ref count has reached 0 - closing IndexWriter
   [junit4]   2> 1052465 T4548 oasu.DefaultSolrCoreState.closeIndexWriter closing IndexWriter with IndexWriterCloser
   [junit4]   2> 1052466 T4548 oasc.SolrCore.closeSearcher [collection1] Closing main searcher on request.
   [junit4]   2> 1052467 T4548 oasc.CachingDirectoryFactory.close Closing MockDirectoryFactory - 2 directories currently being tracked
   [junit4]   2> 1052467 T4548 oasc.CachingDirectoryFactory.closeCacheValue looking to close /Users/jenkins/workspace/Lucene-Solr-5.x-MacOSX/solr/build/solr-core/test/J1/temp/solr.spelling.SpellCheckCollatorTest E2E696E785572280-001/init-core-data-001 [CachedDir<<refCount=0;path=/Users/jenkins/workspace/Lucene-Solr-5.x-MacOSX/solr/build/solr-core/test/J1/temp/solr.spelling.SpellCheckCollatorTest E2E696E785572280-001/init-core-data-001;done=false>>]
   [junit4]   2> 1052468 T4548 oasc.CachingDirectoryFactory.close Closing directory: /Users/jenkins/workspace/Lucene-Solr-5.x-MacOSX/solr/build/solr-core/test/J1/temp/solr.spelling.SpellCheckCollatorTest E2E696E785572280-001/init-core-data-001
   [junit4]   2> 1052468 T4548 oasc.CachingDirectoryFactory.closeCacheValue looking to close /Users/jenkins/workspace/Lucene-Solr-5.x-MacOSX/solr/build/solr-core/test/J1/temp/solr.spelling.SpellCheckCollatorTest E2E696E785572280-001/init-core-data-001/index [CachedDir<<refCount=0;path=/Users/jenkins/workspace/Lucene-Solr-5.x-MacOSX/solr/build/solr-core/test/J1/temp/solr.spelling.SpellCheckCollatorTest E2E696E785572280-001/init-core-data-001/index;done=false>>]
   [junit4]   2> 1052468 T4548 oasc.CachingDirectoryFactory.close Closing directory: /Users/jenkins/workspace/Lucene-Solr-5.x-MacOSX/solr/build/solr-core/test/J1/temp/solr.spelling.SpellCheckCollatorTest E2E696E785572280-001/init-core-data-001/index
   [junit4]   2> NOTE: leaving temporary files on disk at: /Users/jenkins/workspace/Lucene-Solr-5.x-MacOSX/solr/build/solr-core/test/J1/temp/solr.spelling.SpellCheckCollatorTest E2E696E785572280-001
   [junit4]   2> NOTE: test params are: codec=Asserting(Lucene50): {start1=Lucene50(blocksize=128), lowerfilt1=Lucene50(blocksize=128), multiDefault=BlockTreeOrds(blocksize=128), teststop=BlockTreeOrds(blocksize=128), intDefault=PostingsFormat(name=Direct), range_facet_l=PostingsFormat(name=Direct), lowerfilt1and2=BlockTreeOrds(blocksize=128), end4=Lucene50(blocksize=128), end3=BlockTreeOrds(blocksize=128), end2=PostingsFormat(name=LuceneVarGapDocFreqInterval), end1=PostingsFormat(name=Direct), lowerfilt=BlockTreeOrds(blocksize=128), gram1=PostingsFormat(name=Direct), id=PostingsFormat(name=LuceneVarGapDocFreqInterval), gram2=PostingsFormat(name=LuceneVarGapDocFreqInterval), gram3=BlockTreeOrds(blocksize=128), start3=PostingsFormat(name=LuceneVarGapDocFreqInterval), gram4=Lucene50(blocksize=128), start2=BlockTreeOrds(blocksize=128), word=PostingsFormat(name=Direct), timestamp=PostingsFormat(name=Direct), start4=PostingsFormat(name=Direct)}, docValues:{timestamp=DocValuesFormat(name=Direct)}, sim=DefaultSimilarity, locale=hr, timezone=America/Argentina/Ushuaia
   [junit4]   2> NOTE: Mac OS X 10.8.5 x86_64/Oracle Corporation 1.8.0_40 (64-bit)/cpus=3,threads=1,free=110675512,total=223678464
   [junit4]   2> NOTE: All tests run in this JVM: [ReturnFieldsTest, TestSchemaNameResource, StatelessScriptUpdateProcessorFactoryTest, TestSchemaVersionResource, TestCollectionAPI, TestJsonFacets, TestPHPSerializedResponseWriter, SolrIndexConfigTest, TestQuerySenderNoQuery, FileBasedSpellCheckerTest, TestLRUStatsCache, CurrencyFieldOpenExchangeTest, TestSearchPerf, CurrencyFieldXmlFileTest, ChaosMonkeySafeLeaderTest, TestMacros, DocExpirationUpdateProcessorFactoryTest, TestLeaderElectionZkExpiry, UpdateParamsTest, TestRealTimeGet, SolrCmdDistributorTest, OpenExchangeRatesOrgProviderTest, OpenCloseCoreStressTest, DateMathParserTest, DateFieldTest, BasicZkTest, TestUtils, TestSolr4Spatial, ZkSolrClientTest, HdfsThreadLeakTest, ReplicationFactorTest, ShardRoutingCustomTest, ResourceLoaderTest, TestRandomMergePolicy, WordBreakSolrSpellCheckerTest, QueryParsingTest, ParsingFieldUpdateProcessorsTest, FacetPivotSmallTest, TestBlobHandler, TestRTGBase, TestLMJelinekMercerSimilarityFactory, TestZkChroot, TestMiniSolrCloudClusterSSL, TestSearcherReuse, UpdateRequestProcessorFactoryTest, TestSolrQueryParser, SpatialFilterTest, TestJoin, TestSuggestSpellingConverter, TestTolerantSearch, VMParamsZkACLAndCredentialsProvidersTest, TestSimpleTrackingShardHandler, TestValueSourceCache, TestCollapseQParserPlugin, DebugComponentTest, TestReplicationHandlerBackup, PrimitiveFieldTypeTest, HttpPartitionTest, TestSerializedLuceneMatchVersion, CollectionReloadTest, TestManagedSchemaFieldTypeResource, TestSystemIdResolver, TestExactStatsCache, DocValuesMissingTest, LeaderElectionIntegrationTest, TestFiltering, TestBulkSchemaConcurrent, CustomCollectionTest, TestCopyFieldCollectionResource, FileUtilsTest, TestTrie, SegmentsInfoRequestHandlerTest, DocumentBuilderTest, RollingRestartTest, SpellCheckComponentTest, TestCodecSupport, TestReversedWildcardFilterFactory, TestImplicitCoreProperties, StandardRequestHandlerTest, TestPseudoReturnFields, TestChildDocTransformer, TestSolrQueryParserResource, TestReload, ZkStateWriterTest, TestSolrCoreProperties, SignatureUpdateProcessorFactoryTest, TestCoreDiscovery, LeaderInitiatedRecoveryOnCommitTest, AutoCommitTest, TestPivotHelperCode, TestHighlightDedupGrouping, TestRestManager, XsltUpdateRequestHandlerTest, TestConfigReload, DirectUpdateHandlerOptimizeTest, TestFastWriter, JsonLoaderTest, NotRequiredUniqueKeyTest, OverseerRolesTest, SpellCheckCollatorTest]
   [junit4] Completed [200/483] on J1 in 2.08s, 9 tests, 1 error <<< FAILURES!

[...truncated 887 lines...]
BUILD FAILED
/Users/jenkins/workspace/Lucene-Solr-5.x-MacOSX/build.xml:536: The following error occurred while executing this line:
/Users/jenkins/workspace/Lucene-Solr-5.x-MacOSX/build.xml:484: The following error occurred while executing this line:
/Users/jenkins/workspace/Lucene-Solr-5.x-MacOSX/build.xml:61: The following error occurred while executing this line:
/Users/jenkins/workspace/Lucene-Solr-5.x-MacOSX/extra-targets.xml:39: The following error occurred while executing this line:
/Users/jenkins/workspace/Lucene-Solr-5.x-MacOSX/solr/build.xml:229: The following error occurred while executing this line:
/Users/jenkins/workspace/Lucene-Solr-5.x-MacOSX/solr/common-build.xml:512: The following error occurred while executing this line:
/Users/jenkins/workspace/Lucene-Solr-5.x-MacOSX/lucene/common-build.xml:1434: The following error occurred while executing this line:
/Users/jenkins/workspace/Lucene-Solr-5.x-MacOSX/lucene/common-build.xml:991: There were test failures: 483 suites, 1930 tests, 1 error, 58 ignored (24 assumptions)

Total time: 70 minutes 44 seconds
Build step 'Invoke Ant' marked build as failure
Archiving artifacts
Recording test results
Email was triggered for: Failure - Any
Sending email for trigger: Failure - Any



Mime
View raw message