lucene-dev mailing list archives

Site index · List index
Message view « Date » · « Thread »
Top « Date » · « Thread »
From Apache Jenkins Server <jenk...@builds.apache.org>
Subject [JENKINS] Lucene-Solr-Tests-5.x-Java7 - Build # 2910 - Still Failing
Date Wed, 08 Apr 2015 08:41:52 GMT
Build: https://builds.apache.org/job/Lucene-Solr-Tests-5.x-Java7/2910/

1 tests failed.
REGRESSION:  org.apache.lucene.search.join.TestJoinUtil.testRandomOrdinalsJoin

Error Message:
expected:<296> but was:<269>

Stack Trace:
java.lang.AssertionError: expected:<296> but was:<269>
	at __randomizedtesting.SeedInfo.seed([5214ECCDEBB46393:EDC9ED543B48769F]:0)
	at org.junit.Assert.fail(Assert.java:93)
	at org.junit.Assert.failNotEquals(Assert.java:647)
	at org.junit.Assert.assertEquals(Assert.java:128)
	at org.junit.Assert.assertEquals(Assert.java:472)
	at org.junit.Assert.assertEquals(Assert.java:456)
	at org.apache.lucene.search.join.TestJoinUtil.assertTopDocs(TestJoinUtil.java:714)
	at org.apache.lucene.search.join.TestJoinUtil.testRandomOrdinalsJoin(TestJoinUtil.java:345)
	at sun.reflect.NativeMethodAccessorImpl.invoke0(Native Method)
	at sun.reflect.NativeMethodAccessorImpl.invoke(NativeMethodAccessorImpl.java:57)
	at sun.reflect.DelegatingMethodAccessorImpl.invoke(DelegatingMethodAccessorImpl.java:43)
	at java.lang.reflect.Method.invoke(Method.java:606)
	at com.carrotsearch.randomizedtesting.RandomizedRunner.invoke(RandomizedRunner.java:1627)
	at com.carrotsearch.randomizedtesting.RandomizedRunner$6.evaluate(RandomizedRunner.java:836)
	at com.carrotsearch.randomizedtesting.RandomizedRunner$7.evaluate(RandomizedRunner.java:872)
	at com.carrotsearch.randomizedtesting.RandomizedRunner$8.evaluate(RandomizedRunner.java:886)
	at org.apache.lucene.util.TestRuleSetupTeardownChained$1.evaluate(TestRuleSetupTeardownChained.java:50)
	at org.apache.lucene.util.AbstractBeforeAfterRule$1.evaluate(AbstractBeforeAfterRule.java:46)
	at org.apache.lucene.util.TestRuleThreadAndTestName$1.evaluate(TestRuleThreadAndTestName.java:49)
	at org.apache.lucene.util.TestRuleIgnoreAfterMaxFailures$1.evaluate(TestRuleIgnoreAfterMaxFailures.java:65)
	at org.apache.lucene.util.TestRuleMarkFailure$1.evaluate(TestRuleMarkFailure.java:48)
	at com.carrotsearch.randomizedtesting.rules.StatementAdapter.evaluate(StatementAdapter.java:36)
	at com.carrotsearch.randomizedtesting.ThreadLeakControl$StatementRunner.run(ThreadLeakControl.java:365)
	at com.carrotsearch.randomizedtesting.ThreadLeakControl.forkTimeoutingTask(ThreadLeakControl.java:798)
	at com.carrotsearch.randomizedtesting.ThreadLeakControl$3.evaluate(ThreadLeakControl.java:458)
	at com.carrotsearch.randomizedtesting.RandomizedRunner.runSingleTest(RandomizedRunner.java:845)
	at com.carrotsearch.randomizedtesting.RandomizedRunner$3.evaluate(RandomizedRunner.java:747)
	at com.carrotsearch.randomizedtesting.RandomizedRunner$4.evaluate(RandomizedRunner.java:781)
	at com.carrotsearch.randomizedtesting.RandomizedRunner$5.evaluate(RandomizedRunner.java:792)
	at org.apache.lucene.util.AbstractBeforeAfterRule$1.evaluate(AbstractBeforeAfterRule.java:46)
	at com.carrotsearch.randomizedtesting.rules.StatementAdapter.evaluate(StatementAdapter.java:36)
	at org.apache.lucene.util.TestRuleStoreClassName$1.evaluate(TestRuleStoreClassName.java:42)
	at com.carrotsearch.randomizedtesting.rules.NoShadowingOrOverridesOnMethodsRule$1.evaluate(NoShadowingOrOverridesOnMethodsRule.java:39)
	at com.carrotsearch.randomizedtesting.rules.NoShadowingOrOverridesOnMethodsRule$1.evaluate(NoShadowingOrOverridesOnMethodsRule.java:39)
	at com.carrotsearch.randomizedtesting.rules.StatementAdapter.evaluate(StatementAdapter.java:36)
	at com.carrotsearch.randomizedtesting.rules.StatementAdapter.evaluate(StatementAdapter.java:36)
	at com.carrotsearch.randomizedtesting.rules.StatementAdapter.evaluate(StatementAdapter.java:36)
	at org.apache.lucene.util.TestRuleAssertionsRequired$1.evaluate(TestRuleAssertionsRequired.java:54)
	at org.apache.lucene.util.TestRuleMarkFailure$1.evaluate(TestRuleMarkFailure.java:48)
	at org.apache.lucene.util.TestRuleIgnoreAfterMaxFailures$1.evaluate(TestRuleIgnoreAfterMaxFailures.java:65)
	at org.apache.lucene.util.TestRuleIgnoreTestSuites$1.evaluate(TestRuleIgnoreTestSuites.java:55)
	at com.carrotsearch.randomizedtesting.rules.StatementAdapter.evaluate(StatementAdapter.java:36)
	at com.carrotsearch.randomizedtesting.ThreadLeakControl$StatementRunner.run(ThreadLeakControl.java:365)
	at java.lang.Thread.run(Thread.java:745)




Build Log:
[...truncated 6851 lines...]
   [junit4] Suite: org.apache.lucene.search.join.TestJoinUtil
   [junit4]   2> NOTE: reproduce with: ant test  -Dtestcase=TestJoinUtil -Dtests.method=testRandomOrdinalsJoin
-Dtests.seed=5214ECCDEBB46393 -Dtests.multiplier=2 -Dtests.slow=true -Dtests.locale=de_LU
-Dtests.timezone=Europe/Jersey -Dtests.asserts=true -Dtests.file.encoding=US-ASCII
   [junit4] FAILURE 0.76s J1 | TestJoinUtil.testRandomOrdinalsJoin <<<
   [junit4]    > Throwable #1: java.lang.AssertionError: expected:<296> but was:<269>
   [junit4]    > 	at __randomizedtesting.SeedInfo.seed([5214ECCDEBB46393:EDC9ED543B48769F]:0)
   [junit4]    > 	at org.apache.lucene.search.join.TestJoinUtil.assertTopDocs(TestJoinUtil.java:714)
   [junit4]    > 	at org.apache.lucene.search.join.TestJoinUtil.testRandomOrdinalsJoin(TestJoinUtil.java:345)
   [junit4]    > 	at java.lang.Thread.run(Thread.java:745)
   [junit4]   2> NOTE: test params are: codec=Asserting(Lucene50): {movieId=PostingsFormat(name=MockRandom),
name=PostingsFormat(name=MockRandom), id=PostingsFormat(name=MockRandom), description=PostingsFormat(name=Memory
doPackFST= true), type=PostingsFormat(name=LuceneVarGapFixedInterval), to=PostingsFormat(name=MockRandom),
price=PostingsFormat(name=LuceneFixedGap), value=PostingsFormat(name=LuceneFixedGap), from=PostingsFormat(name=LuceneVarGapFixedInterval),
subtitle=PostingsFormat(name=Memory doPackFST= true), productId=PostingsFormat(name=LuceneVarGapFixedInterval)},
docValues:{movieId=DocValuesFormat(name=Asserting), id=DocValuesFormat(name=Asserting), to=DocValuesFormat(name=Asserting),
join_field=DocValuesFormat(name=Memory), idproductId=DocValuesFormat(name=Asserting), from=DocValuesFormat(name=Lucene50),
productId=DocValuesFormat(name=Lucene50)}, sim=DefaultSimilarity, locale=de_LU, timezone=Europe/Jersey
   [junit4]   2> NOTE: FreeBSD 9.1-RELEASE-p3 amd64/Oracle Corporation 1.7.0_65 (64-bit)/cpus=16,threads=1,free=151345944,total=272105472
   [junit4]   2> NOTE: All tests run in this JVM: [TestJoinUtil]
   [junit4] Completed on J1 in 15.11s, 9 tests, 1 failure <<< FAILURES!

[...truncated 12 lines...]
BUILD FAILED
/usr/home/jenkins/jenkins-slave/workspace/Lucene-Solr-Tests-5.x-Java7/build.xml:529: The following
error occurred while executing this line:
/usr/home/jenkins/jenkins-slave/workspace/Lucene-Solr-Tests-5.x-Java7/build.xml:477: The following
error occurred while executing this line:
/usr/home/jenkins/jenkins-slave/workspace/Lucene-Solr-Tests-5.x-Java7/build.xml:61: The following
error occurred while executing this line:
/usr/home/jenkins/jenkins-slave/workspace/Lucene-Solr-Tests-5.x-Java7/extra-targets.xml:39:
The following error occurred while executing this line:
/usr/home/jenkins/jenkins-slave/workspace/Lucene-Solr-Tests-5.x-Java7/lucene/build.xml:456:
The following error occurred while executing this line:
/usr/home/jenkins/jenkins-slave/workspace/Lucene-Solr-Tests-5.x-Java7/lucene/common-build.xml:2166:
The following error occurred while executing this line:
/usr/home/jenkins/jenkins-slave/workspace/Lucene-Solr-Tests-5.x-Java7/lucene/module-build.xml:58:
The following error occurred while executing this line:
/usr/home/jenkins/jenkins-slave/workspace/Lucene-Solr-Tests-5.x-Java7/lucene/common-build.xml:1370:
The following error occurred while executing this line:
/usr/home/jenkins/jenkins-slave/workspace/Lucene-Solr-Tests-5.x-Java7/lucene/common-build.xml:976:
There were test failures: 4 suites, 29 tests, 1 failure

Total time: 18 minutes 42 seconds
Build step 'Invoke Ant' marked build as failure
Archiving artifacts
Sending artifact delta relative to Lucene-Solr-Tests-5.x-Java7 #2431
Archived 5 artifacts
Archive block size is 32768
Received 0 blocks and 62472 bytes
Compression is 0.0%
Took 0.27 sec
Recording test results
Email was triggered for: Failure
Sending email for trigger: Failure



Mime
View raw message