lucene-dev mailing list archives

Site index · List index
Message view « Date » · « Thread »
Top « Date » · « Thread »
From Policeman Jenkins Server <jenk...@thetaphi.de>
Subject [JENKINS] Lucene-Solr-trunk-Linux (32bit/jdk1.8.0_40) - Build # 12357 - Failure!
Date Sun, 19 Apr 2015 15:35:58 GMT
Build: http://jenkins.thetaphi.de/job/Lucene-Solr-trunk-Linux/12357/
Java: 32bit/jdk1.8.0_40 -server -XX:+UseParallelGC

3 tests failed.
FAILED:  junit.framework.TestSuite.org.apache.solr.cloud.SaslZkACLProviderTest

Error Message:
6 threads leaked from SUITE scope at org.apache.solr.cloud.SaslZkACLProviderTest:     1) Thread[id=1908, name=groupCache.data, state=TIMED_WAITING, group=TGRP-SaslZkACLProviderTest]         at sun.misc.Unsafe.park(Native Method)         at java.util.concurrent.locks.LockSupport.parkNanos(LockSupport.java:215)         at java.util.concurrent.locks.AbstractQueuedSynchronizer$ConditionObject.awaitNanos(AbstractQueuedSynchronizer.java:2078)         at java.util.concurrent.ScheduledThreadPoolExecutor$DelayedWorkQueue.take(ScheduledThreadPoolExecutor.java:1093)         at java.util.concurrent.ScheduledThreadPoolExecutor$DelayedWorkQueue.take(ScheduledThreadPoolExecutor.java:809)         at java.util.concurrent.ThreadPoolExecutor.getTask(ThreadPoolExecutor.java:1067)         at java.util.concurrent.ThreadPoolExecutor.runWorker(ThreadPoolExecutor.java:1127)         at java.util.concurrent.ThreadPoolExecutor$Worker.run(ThreadPoolExecutor.java:617)         at java.lang.Thread.run(Thread.java:745)    2) Thread[id=1912, name=NioSocketAcceptor-1, state=RUNNABLE, group=TGRP-SaslZkACLProviderTest]         at sun.nio.ch.EPollArrayWrapper.epollWait(Native Method)         at sun.nio.ch.EPollArrayWrapper.poll(EPollArrayWrapper.java:269)         at sun.nio.ch.EPollSelectorImpl.doSelect(EPollSelectorImpl.java:79)         at sun.nio.ch.SelectorImpl.lockAndDoSelect(SelectorImpl.java:86)         at sun.nio.ch.SelectorImpl.select(SelectorImpl.java:97)         at sun.nio.ch.SelectorImpl.select(SelectorImpl.java:101)         at org.apache.mina.transport.socket.nio.NioSocketAcceptor.select(NioSocketAcceptor.java:234)         at org.apache.mina.core.polling.AbstractPollingIoAcceptor$Acceptor.run(AbstractPollingIoAcceptor.java:417)         at org.apache.mina.util.NamePreservingRunnable.run(NamePreservingRunnable.java:64)         at java.util.concurrent.ThreadPoolExecutor.runWorker(ThreadPoolExecutor.java:1142)         at java.util.concurrent.ThreadPoolExecutor$Worker.run(ThreadPoolExecutor.java:617)         at java.lang.Thread.run(Thread.java:745)    3) Thread[id=1909, name=ou=system.data, state=TIMED_WAITING, group=TGRP-SaslZkACLProviderTest]         at sun.misc.Unsafe.park(Native Method)         at java.util.concurrent.locks.LockSupport.parkNanos(LockSupport.java:215)         at java.util.concurrent.locks.AbstractQueuedSynchronizer$ConditionObject.awaitNanos(AbstractQueuedSynchronizer.java:2078)         at java.util.concurrent.ScheduledThreadPoolExecutor$DelayedWorkQueue.take(ScheduledThreadPoolExecutor.java:1093)         at java.util.concurrent.ScheduledThreadPoolExecutor$DelayedWorkQueue.take(ScheduledThreadPoolExecutor.java:809)         at java.util.concurrent.ThreadPoolExecutor.getTask(ThreadPoolExecutor.java:1067)         at java.util.concurrent.ThreadPoolExecutor.runWorker(ThreadPoolExecutor.java:1127)         at java.util.concurrent.ThreadPoolExecutor$Worker.run(ThreadPoolExecutor.java:617)         at java.lang.Thread.run(Thread.java:745)    4) Thread[id=1910, name=changePwdReplayCache.data, state=TIMED_WAITING, group=TGRP-SaslZkACLProviderTest]         at sun.misc.Unsafe.park(Native Method)         at java.util.concurrent.locks.LockSupport.parkNanos(LockSupport.java:215)         at java.util.concurrent.locks.AbstractQueuedSynchronizer$ConditionObject.awaitNanos(AbstractQueuedSynchronizer.java:2078)         at java.util.concurrent.ScheduledThreadPoolExecutor$DelayedWorkQueue.take(ScheduledThreadPoolExecutor.java:1093)         at java.util.concurrent.ScheduledThreadPoolExecutor$DelayedWorkQueue.take(ScheduledThreadPoolExecutor.java:809)         at java.util.concurrent.ThreadPoolExecutor.getTask(ThreadPoolExecutor.java:1067)         at java.util.concurrent.ThreadPoolExecutor.runWorker(ThreadPoolExecutor.java:1127)         at java.util.concurrent.ThreadPoolExecutor$Worker.run(ThreadPoolExecutor.java:617)         at java.lang.Thread.run(Thread.java:745)    5) Thread[id=1907, name=apacheds, state=WAITING, group=TGRP-SaslZkACLProviderTest]         at java.lang.Object.wait(Native Method)         at java.lang.Object.wait(Object.java:502)         at java.util.TimerThread.mainLoop(Timer.java:526)         at java.util.TimerThread.run(Timer.java:505)    6) Thread[id=1911, name=kdcReplayCache.data, state=TIMED_WAITING, group=TGRP-SaslZkACLProviderTest]         at sun.misc.Unsafe.park(Native Method)         at java.util.concurrent.locks.LockSupport.parkNanos(LockSupport.java:215)         at java.util.concurrent.locks.AbstractQueuedSynchronizer$ConditionObject.awaitNanos(AbstractQueuedSynchronizer.java:2078)         at java.util.concurrent.ScheduledThreadPoolExecutor$DelayedWorkQueue.take(ScheduledThreadPoolExecutor.java:1093)         at java.util.concurrent.ScheduledThreadPoolExecutor$DelayedWorkQueue.take(ScheduledThreadPoolExecutor.java:809)         at java.util.concurrent.ThreadPoolExecutor.getTask(ThreadPoolExecutor.java:1067)         at java.util.concurrent.ThreadPoolExecutor.runWorker(ThreadPoolExecutor.java:1127)         at java.util.concurrent.ThreadPoolExecutor$Worker.run(ThreadPoolExecutor.java:617)         at java.lang.Thread.run(Thread.java:745)

Stack Trace:
com.carrotsearch.randomizedtesting.ThreadLeakError: 6 threads leaked from SUITE scope at org.apache.solr.cloud.SaslZkACLProviderTest: 
   1) Thread[id=1908, name=groupCache.data, state=TIMED_WAITING, group=TGRP-SaslZkACLProviderTest]
        at sun.misc.Unsafe.park(Native Method)
        at java.util.concurrent.locks.LockSupport.parkNanos(LockSupport.java:215)
        at java.util.concurrent.locks.AbstractQueuedSynchronizer$ConditionObject.awaitNanos(AbstractQueuedSynchronizer.java:2078)
        at java.util.concurrent.ScheduledThreadPoolExecutor$DelayedWorkQueue.take(ScheduledThreadPoolExecutor.java:1093)
        at java.util.concurrent.ScheduledThreadPoolExecutor$DelayedWorkQueue.take(ScheduledThreadPoolExecutor.java:809)
        at java.util.concurrent.ThreadPoolExecutor.getTask(ThreadPoolExecutor.java:1067)
        at java.util.concurrent.ThreadPoolExecutor.runWorker(ThreadPoolExecutor.java:1127)
        at java.util.concurrent.ThreadPoolExecutor$Worker.run(ThreadPoolExecutor.java:617)
        at java.lang.Thread.run(Thread.java:745)
   2) Thread[id=1912, name=NioSocketAcceptor-1, state=RUNNABLE, group=TGRP-SaslZkACLProviderTest]
        at sun.nio.ch.EPollArrayWrapper.epollWait(Native Method)
        at sun.nio.ch.EPollArrayWrapper.poll(EPollArrayWrapper.java:269)
        at sun.nio.ch.EPollSelectorImpl.doSelect(EPollSelectorImpl.java:79)
        at sun.nio.ch.SelectorImpl.lockAndDoSelect(SelectorImpl.java:86)
        at sun.nio.ch.SelectorImpl.select(SelectorImpl.java:97)
        at sun.nio.ch.SelectorImpl.select(SelectorImpl.java:101)
        at org.apache.mina.transport.socket.nio.NioSocketAcceptor.select(NioSocketAcceptor.java:234)
        at org.apache.mina.core.polling.AbstractPollingIoAcceptor$Acceptor.run(AbstractPollingIoAcceptor.java:417)
        at org.apache.mina.util.NamePreservingRunnable.run(NamePreservingRunnable.java:64)
        at java.util.concurrent.ThreadPoolExecutor.runWorker(ThreadPoolExecutor.java:1142)
        at java.util.concurrent.ThreadPoolExecutor$Worker.run(ThreadPoolExecutor.java:617)
        at java.lang.Thread.run(Thread.java:745)
   3) Thread[id=1909, name=ou=system.data, state=TIMED_WAITING, group=TGRP-SaslZkACLProviderTest]
        at sun.misc.Unsafe.park(Native Method)
        at java.util.concurrent.locks.LockSupport.parkNanos(LockSupport.java:215)
        at java.util.concurrent.locks.AbstractQueuedSynchronizer$ConditionObject.awaitNanos(AbstractQueuedSynchronizer.java:2078)
        at java.util.concurrent.ScheduledThreadPoolExecutor$DelayedWorkQueue.take(ScheduledThreadPoolExecutor.java:1093)
        at java.util.concurrent.ScheduledThreadPoolExecutor$DelayedWorkQueue.take(ScheduledThreadPoolExecutor.java:809)
        at java.util.concurrent.ThreadPoolExecutor.getTask(ThreadPoolExecutor.java:1067)
        at java.util.concurrent.ThreadPoolExecutor.runWorker(ThreadPoolExecutor.java:1127)
        at java.util.concurrent.ThreadPoolExecutor$Worker.run(ThreadPoolExecutor.java:617)
        at java.lang.Thread.run(Thread.java:745)
   4) Thread[id=1910, name=changePwdReplayCache.data, state=TIMED_WAITING, group=TGRP-SaslZkACLProviderTest]
        at sun.misc.Unsafe.park(Native Method)
        at java.util.concurrent.locks.LockSupport.parkNanos(LockSupport.java:215)
        at java.util.concurrent.locks.AbstractQueuedSynchronizer$ConditionObject.awaitNanos(AbstractQueuedSynchronizer.java:2078)
        at java.util.concurrent.ScheduledThreadPoolExecutor$DelayedWorkQueue.take(ScheduledThreadPoolExecutor.java:1093)
        at java.util.concurrent.ScheduledThreadPoolExecutor$DelayedWorkQueue.take(ScheduledThreadPoolExecutor.java:809)
        at java.util.concurrent.ThreadPoolExecutor.getTask(ThreadPoolExecutor.java:1067)
        at java.util.concurrent.ThreadPoolExecutor.runWorker(ThreadPoolExecutor.java:1127)
        at java.util.concurrent.ThreadPoolExecutor$Worker.run(ThreadPoolExecutor.java:617)
        at java.lang.Thread.run(Thread.java:745)
   5) Thread[id=1907, name=apacheds, state=WAITING, group=TGRP-SaslZkACLProviderTest]
        at java.lang.Object.wait(Native Method)
        at java.lang.Object.wait(Object.java:502)
        at java.util.TimerThread.mainLoop(Timer.java:526)
        at java.util.TimerThread.run(Timer.java:505)
   6) Thread[id=1911, name=kdcReplayCache.data, state=TIMED_WAITING, group=TGRP-SaslZkACLProviderTest]
        at sun.misc.Unsafe.park(Native Method)
        at java.util.concurrent.locks.LockSupport.parkNanos(LockSupport.java:215)
        at java.util.concurrent.locks.AbstractQueuedSynchronizer$ConditionObject.awaitNanos(AbstractQueuedSynchronizer.java:2078)
        at java.util.concurrent.ScheduledThreadPoolExecutor$DelayedWorkQueue.take(ScheduledThreadPoolExecutor.java:1093)
        at java.util.concurrent.ScheduledThreadPoolExecutor$DelayedWorkQueue.take(ScheduledThreadPoolExecutor.java:809)
        at java.util.concurrent.ThreadPoolExecutor.getTask(ThreadPoolExecutor.java:1067)
        at java.util.concurrent.ThreadPoolExecutor.runWorker(ThreadPoolExecutor.java:1127)
        at java.util.concurrent.ThreadPoolExecutor$Worker.run(ThreadPoolExecutor.java:617)
        at java.lang.Thread.run(Thread.java:745)
	at __randomizedtesting.SeedInfo.seed([C655DEB443EE614D]:0)


FAILED:  junit.framework.TestSuite.org.apache.solr.cloud.SaslZkACLProviderTest

Error Message:
There are still zombie threads that couldn't be terminated:    1) Thread[id=1908, name=groupCache.data, state=TIMED_WAITING, group=TGRP-SaslZkACLProviderTest]         at sun.misc.Unsafe.park(Native Method)         at java.util.concurrent.locks.LockSupport.parkNanos(LockSupport.java:215)         at java.util.concurrent.locks.AbstractQueuedSynchronizer$ConditionObject.awaitNanos(AbstractQueuedSynchronizer.java:2078)         at java.util.concurrent.ScheduledThreadPoolExecutor$DelayedWorkQueue.take(ScheduledThreadPoolExecutor.java:1093)         at java.util.concurrent.ScheduledThreadPoolExecutor$DelayedWorkQueue.take(ScheduledThreadPoolExecutor.java:809)         at java.util.concurrent.ThreadPoolExecutor.getTask(ThreadPoolExecutor.java:1067)         at java.util.concurrent.ThreadPoolExecutor.runWorker(ThreadPoolExecutor.java:1127)         at java.util.concurrent.ThreadPoolExecutor$Worker.run(ThreadPoolExecutor.java:617)         at java.lang.Thread.run(Thread.java:745)    2) Thread[id=1912, name=NioSocketAcceptor-1, state=RUNNABLE, group=TGRP-SaslZkACLProviderTest]         at sun.nio.ch.IOUtil.drain(Native Method)         at sun.nio.ch.EPollSelectorImpl.doSelect(EPollSelectorImpl.java:90)         at sun.nio.ch.SelectorImpl.lockAndDoSelect(SelectorImpl.java:86)         at sun.nio.ch.SelectorImpl.select(SelectorImpl.java:97)         at sun.nio.ch.SelectorImpl.select(SelectorImpl.java:101)         at org.apache.mina.transport.socket.nio.NioSocketAcceptor.select(NioSocketAcceptor.java:234)         at org.apache.mina.core.polling.AbstractPollingIoAcceptor$Acceptor.run(AbstractPollingIoAcceptor.java:417)         at org.apache.mina.util.NamePreservingRunnable.run(NamePreservingRunnable.java:64)         at java.util.concurrent.ThreadPoolExecutor.runWorker(ThreadPoolExecutor.java:1142)         at java.util.concurrent.ThreadPoolExecutor$Worker.run(ThreadPoolExecutor.java:617)         at java.lang.Thread.run(Thread.java:745)    3) Thread[id=1909, name=ou=system.data, state=TIMED_WAITING, group=TGRP-SaslZkACLProviderTest]         at sun.misc.Unsafe.park(Native Method)         at java.util.concurrent.locks.LockSupport.parkNanos(LockSupport.java:215)         at java.util.concurrent.locks.AbstractQueuedSynchronizer$ConditionObject.awaitNanos(AbstractQueuedSynchronizer.java:2078)         at java.util.concurrent.ScheduledThreadPoolExecutor$DelayedWorkQueue.take(ScheduledThreadPoolExecutor.java:1093)         at java.util.concurrent.ScheduledThreadPoolExecutor$DelayedWorkQueue.take(ScheduledThreadPoolExecutor.java:809)         at java.util.concurrent.ThreadPoolExecutor.getTask(ThreadPoolExecutor.java:1067)         at java.util.concurrent.ThreadPoolExecutor.runWorker(ThreadPoolExecutor.java:1127)         at java.util.concurrent.ThreadPoolExecutor$Worker.run(ThreadPoolExecutor.java:617)         at java.lang.Thread.run(Thread.java:745)    4) Thread[id=1910, name=changePwdReplayCache.data, state=TIMED_WAITING, group=TGRP-SaslZkACLProviderTest]         at sun.misc.Unsafe.park(Native Method)         at java.util.concurrent.locks.LockSupport.parkNanos(LockSupport.java:215)         at java.util.concurrent.locks.AbstractQueuedSynchronizer$ConditionObject.awaitNanos(AbstractQueuedSynchronizer.java:2078)         at java.util.concurrent.ScheduledThreadPoolExecutor$DelayedWorkQueue.take(ScheduledThreadPoolExecutor.java:1093)         at java.util.concurrent.ScheduledThreadPoolExecutor$DelayedWorkQueue.take(ScheduledThreadPoolExecutor.java:809)         at java.util.concurrent.ThreadPoolExecutor.getTask(ThreadPoolExecutor.java:1067)         at java.util.concurrent.ThreadPoolExecutor.runWorker(ThreadPoolExecutor.java:1127)         at java.util.concurrent.ThreadPoolExecutor$Worker.run(ThreadPoolExecutor.java:617)         at java.lang.Thread.run(Thread.java:745)    5) Thread[id=1907, name=apacheds, state=WAITING, group=TGRP-SaslZkACLProviderTest]         at java.lang.Object.wait(Native Method)         at java.lang.Object.wait(Object.java:502)         at java.util.TimerThread.mainLoop(Timer.java:526)         at java.util.TimerThread.run(Timer.java:505)    6) Thread[id=1911, name=kdcReplayCache.data, state=TIMED_WAITING, group=TGRP-SaslZkACLProviderTest]         at sun.misc.Unsafe.park(Native Method)         at java.util.concurrent.locks.LockSupport.parkNanos(LockSupport.java:215)         at java.util.concurrent.locks.AbstractQueuedSynchronizer$ConditionObject.awaitNanos(AbstractQueuedSynchronizer.java:2078)         at java.util.concurrent.ScheduledThreadPoolExecutor$DelayedWorkQueue.take(ScheduledThreadPoolExecutor.java:1093)         at java.util.concurrent.ScheduledThreadPoolExecutor$DelayedWorkQueue.take(ScheduledThreadPoolExecutor.java:809)         at java.util.concurrent.ThreadPoolExecutor.getTask(ThreadPoolExecutor.java:1067)         at java.util.concurrent.ThreadPoolExecutor.runWorker(ThreadPoolExecutor.java:1127)         at java.util.concurrent.ThreadPoolExecutor$Worker.run(ThreadPoolExecutor.java:617)         at java.lang.Thread.run(Thread.java:745)

Stack Trace:
com.carrotsearch.randomizedtesting.ThreadLeakError: There are still zombie threads that couldn't be terminated:
   1) Thread[id=1908, name=groupCache.data, state=TIMED_WAITING, group=TGRP-SaslZkACLProviderTest]
        at sun.misc.Unsafe.park(Native Method)
        at java.util.concurrent.locks.LockSupport.parkNanos(LockSupport.java:215)
        at java.util.concurrent.locks.AbstractQueuedSynchronizer$ConditionObject.awaitNanos(AbstractQueuedSynchronizer.java:2078)
        at java.util.concurrent.ScheduledThreadPoolExecutor$DelayedWorkQueue.take(ScheduledThreadPoolExecutor.java:1093)
        at java.util.concurrent.ScheduledThreadPoolExecutor$DelayedWorkQueue.take(ScheduledThreadPoolExecutor.java:809)
        at java.util.concurrent.ThreadPoolExecutor.getTask(ThreadPoolExecutor.java:1067)
        at java.util.concurrent.ThreadPoolExecutor.runWorker(ThreadPoolExecutor.java:1127)
        at java.util.concurrent.ThreadPoolExecutor$Worker.run(ThreadPoolExecutor.java:617)
        at java.lang.Thread.run(Thread.java:745)
   2) Thread[id=1912, name=NioSocketAcceptor-1, state=RUNNABLE, group=TGRP-SaslZkACLProviderTest]
        at sun.nio.ch.IOUtil.drain(Native Method)
        at sun.nio.ch.EPollSelectorImpl.doSelect(EPollSelectorImpl.java:90)
        at sun.nio.ch.SelectorImpl.lockAndDoSelect(SelectorImpl.java:86)
        at sun.nio.ch.SelectorImpl.select(SelectorImpl.java:97)
        at sun.nio.ch.SelectorImpl.select(SelectorImpl.java:101)
        at org.apache.mina.transport.socket.nio.NioSocketAcceptor.select(NioSocketAcceptor.java:234)
        at org.apache.mina.core.polling.AbstractPollingIoAcceptor$Acceptor.run(AbstractPollingIoAcceptor.java:417)
        at org.apache.mina.util.NamePreservingRunnable.run(NamePreservingRunnable.java:64)
        at java.util.concurrent.ThreadPoolExecutor.runWorker(ThreadPoolExecutor.java:1142)
        at java.util.concurrent.ThreadPoolExecutor$Worker.run(ThreadPoolExecutor.java:617)
        at java.lang.Thread.run(Thread.java:745)
   3) Thread[id=1909, name=ou=system.data, state=TIMED_WAITING, group=TGRP-SaslZkACLProviderTest]
        at sun.misc.Unsafe.park(Native Method)
        at java.util.concurrent.locks.LockSupport.parkNanos(LockSupport.java:215)
        at java.util.concurrent.locks.AbstractQueuedSynchronizer$ConditionObject.awaitNanos(AbstractQueuedSynchronizer.java:2078)
        at java.util.concurrent.ScheduledThreadPoolExecutor$DelayedWorkQueue.take(ScheduledThreadPoolExecutor.java:1093)
        at java.util.concurrent.ScheduledThreadPoolExecutor$DelayedWorkQueue.take(ScheduledThreadPoolExecutor.java:809)
        at java.util.concurrent.ThreadPoolExecutor.getTask(ThreadPoolExecutor.java:1067)
        at java.util.concurrent.ThreadPoolExecutor.runWorker(ThreadPoolExecutor.java:1127)
        at java.util.concurrent.ThreadPoolExecutor$Worker.run(ThreadPoolExecutor.java:617)
        at java.lang.Thread.run(Thread.java:745)
   4) Thread[id=1910, name=changePwdReplayCache.data, state=TIMED_WAITING, group=TGRP-SaslZkACLProviderTest]
        at sun.misc.Unsafe.park(Native Method)
        at java.util.concurrent.locks.LockSupport.parkNanos(LockSupport.java:215)
        at java.util.concurrent.locks.AbstractQueuedSynchronizer$ConditionObject.awaitNanos(AbstractQueuedSynchronizer.java:2078)
        at java.util.concurrent.ScheduledThreadPoolExecutor$DelayedWorkQueue.take(ScheduledThreadPoolExecutor.java:1093)
        at java.util.concurrent.ScheduledThreadPoolExecutor$DelayedWorkQueue.take(ScheduledThreadPoolExecutor.java:809)
        at java.util.concurrent.ThreadPoolExecutor.getTask(ThreadPoolExecutor.java:1067)
        at java.util.concurrent.ThreadPoolExecutor.runWorker(ThreadPoolExecutor.java:1127)
        at java.util.concurrent.ThreadPoolExecutor$Worker.run(ThreadPoolExecutor.java:617)
        at java.lang.Thread.run(Thread.java:745)
   5) Thread[id=1907, name=apacheds, state=WAITING, group=TGRP-SaslZkACLProviderTest]
        at java.lang.Object.wait(Native Method)
        at java.lang.Object.wait(Object.java:502)
        at java.util.TimerThread.mainLoop(Timer.java:526)
        at java.util.TimerThread.run(Timer.java:505)
   6) Thread[id=1911, name=kdcReplayCache.data, state=TIMED_WAITING, group=TGRP-SaslZkACLProviderTest]
        at sun.misc.Unsafe.park(Native Method)
        at java.util.concurrent.locks.LockSupport.parkNanos(LockSupport.java:215)
        at java.util.concurrent.locks.AbstractQueuedSynchronizer$ConditionObject.awaitNanos(AbstractQueuedSynchronizer.java:2078)
        at java.util.concurrent.ScheduledThreadPoolExecutor$DelayedWorkQueue.take(ScheduledThreadPoolExecutor.java:1093)
        at java.util.concurrent.ScheduledThreadPoolExecutor$DelayedWorkQueue.take(ScheduledThreadPoolExecutor.java:809)
        at java.util.concurrent.ThreadPoolExecutor.getTask(ThreadPoolExecutor.java:1067)
        at java.util.concurrent.ThreadPoolExecutor.runWorker(ThreadPoolExecutor.java:1127)
        at java.util.concurrent.ThreadPoolExecutor$Worker.run(ThreadPoolExecutor.java:617)
        at java.lang.Thread.run(Thread.java:745)
	at __randomizedtesting.SeedInfo.seed([C655DEB443EE614D]:0)


FAILED:  org.apache.solr.cloud.SaslZkACLProviderTest.testSaslZkACLProvider

Error Message:
Could not get the port for ZooKeeper server

Stack Trace:
java.lang.RuntimeException: Could not get the port for ZooKeeper server
	at org.apache.solr.cloud.ZkTestServer.run(ZkTestServer.java:506)
	at org.apache.solr.cloud.SaslZkACLProviderTest$SaslZkTestServer.run(SaslZkACLProviderTest.java:226)
	at org.apache.solr.cloud.SaslZkACLProviderTest.setUp(SaslZkACLProviderTest.java:91)
	at sun.reflect.GeneratedMethodAccessor13.invoke(Unknown Source)
	at sun.reflect.DelegatingMethodAccessorImpl.invoke(DelegatingMethodAccessorImpl.java:43)
	at java.lang.reflect.Method.invoke(Method.java:497)
	at com.carrotsearch.randomizedtesting.RandomizedRunner.invoke(RandomizedRunner.java:1627)
	at com.carrotsearch.randomizedtesting.RandomizedRunner$7.evaluate(RandomizedRunner.java:870)
	at com.carrotsearch.randomizedtesting.RandomizedRunner$8.evaluate(RandomizedRunner.java:886)
	at com.carrotsearch.randomizedtesting.rules.SystemPropertiesRestoreRule$1.evaluate(SystemPropertiesRestoreRule.java:57)
	at org.apache.lucene.util.TestRuleSetupTeardownChained$1.evaluate(TestRuleSetupTeardownChained.java:50)
	at org.apache.lucene.util.AbstractBeforeAfterRule$1.evaluate(AbstractBeforeAfterRule.java:46)
	at org.apache.lucene.util.TestRuleThreadAndTestName$1.evaluate(TestRuleThreadAndTestName.java:49)
	at org.apache.lucene.util.TestRuleIgnoreAfterMaxFailures$1.evaluate(TestRuleIgnoreAfterMaxFailures.java:65)
	at org.apache.lucene.util.TestRuleMarkFailure$1.evaluate(TestRuleMarkFailure.java:48)
	at com.carrotsearch.randomizedtesting.rules.StatementAdapter.evaluate(StatementAdapter.java:36)
	at com.carrotsearch.randomizedtesting.ThreadLeakControl$StatementRunner.run(ThreadLeakControl.java:365)
	at com.carrotsearch.randomizedtesting.ThreadLeakControl.forkTimeoutingTask(ThreadLeakControl.java:798)
	at com.carrotsearch.randomizedtesting.ThreadLeakControl$3.evaluate(ThreadLeakControl.java:458)
	at com.carrotsearch.randomizedtesting.RandomizedRunner.runSingleTest(RandomizedRunner.java:845)
	at com.carrotsearch.randomizedtesting.RandomizedRunner$3.evaluate(RandomizedRunner.java:747)
	at com.carrotsearch.randomizedtesting.RandomizedRunner$4.evaluate(RandomizedRunner.java:781)
	at com.carrotsearch.randomizedtesting.RandomizedRunner$5.evaluate(RandomizedRunner.java:792)
	at com.carrotsearch.randomizedtesting.rules.StatementAdapter.evaluate(StatementAdapter.java:36)
	at com.carrotsearch.randomizedtesting.rules.SystemPropertiesRestoreRule$1.evaluate(SystemPropertiesRestoreRule.java:57)
	at org.apache.lucene.util.AbstractBeforeAfterRule$1.evaluate(AbstractBeforeAfterRule.java:46)
	at com.carrotsearch.randomizedtesting.rules.StatementAdapter.evaluate(StatementAdapter.java:36)
	at org.apache.lucene.util.TestRuleStoreClassName$1.evaluate(TestRuleStoreClassName.java:42)
	at com.carrotsearch.randomizedtesting.rules.NoShadowingOrOverridesOnMethodsRule$1.evaluate(NoShadowingOrOverridesOnMethodsRule.java:39)
	at com.carrotsearch.randomizedtesting.rules.NoShadowingOrOverridesOnMethodsRule$1.evaluate(NoShadowingOrOverridesOnMethodsRule.java:39)
	at com.carrotsearch.randomizedtesting.rules.StatementAdapter.evaluate(StatementAdapter.java:36)
	at com.carrotsearch.randomizedtesting.rules.StatementAdapter.evaluate(StatementAdapter.java:36)
	at com.carrotsearch.randomizedtesting.rules.StatementAdapter.evaluate(StatementAdapter.java:36)
	at org.apache.lucene.util.TestRuleAssertionsRequired$1.evaluate(TestRuleAssertionsRequired.java:54)
	at org.apache.lucene.util.TestRuleMarkFailure$1.evaluate(TestRuleMarkFailure.java:48)
	at org.apache.lucene.util.TestRuleIgnoreAfterMaxFailures$1.evaluate(TestRuleIgnoreAfterMaxFailures.java:65)
	at org.apache.lucene.util.TestRuleIgnoreTestSuites$1.evaluate(TestRuleIgnoreTestSuites.java:55)
	at com.carrotsearch.randomizedtesting.rules.StatementAdapter.evaluate(StatementAdapter.java:36)
	at com.carrotsearch.randomizedtesting.ThreadLeakControl$StatementRunner.run(ThreadLeakControl.java:365)
	at java.lang.Thread.run(Thread.java:745)




Build Log:
[...truncated 9707 lines...]
   [junit4] Suite: org.apache.solr.cloud.SaslZkACLProviderTest
   [junit4]   2> Creating dataDir: /home/jenkins/workspace/Lucene-Solr-trunk-Linux/solr/build/solr-core/test/J0/temp/solr.cloud.SaslZkACLProviderTest C655DEB443EE614D-001/init-core-data-001
   [junit4]   2> 330737 T1905 oas.SolrTestCaseJ4.buildSSLConfig Randomized ssl (false) and clientAuth (false)
   [junit4]   2> 330740 T1905 oas.SolrTestCaseJ4.setUp ###Starting testSaslZkACLProvider
   [junit4]   2> 330740 T1905 oasc.SaslZkACLProviderTest.setUp ####SETUP_START testSaslZkACLProvider
   [junit4]   2> 330741 T1905 oasc.SaslZkACLProviderTest.setUp ZooKeeper dataDir:/home/jenkins/workspace/Lucene-Solr-trunk-Linux/solr/build/solr-core/test/J0/temp/solr.cloud.SaslZkACLProviderTest C655DEB443EE614D-001/tempDir-002/zookeeper/server1/data
   [junit4]   2> 336252 T1905 oadsc.DefaultDirectoryService.showSecurityWarnings WARN You didn't change the admin password of directory service instance 'DefaultKrbServer'.  Please update the admin password as soon as possible to prevent a possible security breach.
   [junit4]   2> 337843 T1905 oasc.ZkTestServer.run STARTING ZK TEST SERVER
   [junit4]   2> 337844 T1913 oasc.ZkTestServer$2$1.setClientPort client port:0.0.0.0/0.0.0.0:0
   [junit4]   2> 337844 T1913 oasc.ZkTestServer$ZKServerMain.runFromConfig Starting server
   [junit4]   2> 338030 T1914 oadskka.AuthenticationService.generateTicket ERROR Ticket cannot be generated, as the endTime is below the startTime
   [junit4]   2> 338030 T1914 oadskp.KerberosProtocolHandler.messageReceived WARN Requested start time is later than end time (11)
   [junit4]   2> 338031 T1914 oadskp.KerberosProtocolHandler.messageReceived WARN Requested start time is later than end time (11)
   [junit4]   2> 7312 T1913 ccr.RandomizedRunner$QueueUncaughtExceptionsHandler.uncaughtException WARNING Uncaught exception in thread: Thread[Thread-700,5,TGRP-SaslZkACLProviderTest] java.lang.RuntimeException: java.io.IOException: Could not configure server because SASL configuration did not allow the  ZooKeeper server to authenticate itself properly: javax.security.auth.login.LoginException: Requested start time is later than end time (11) - Requested start time is later than end time
   [junit4]   2> 	at __randomizedtesting.SeedInfo.seed([C655DEB443EE614D]:0)
   [junit4]   2> 	at org.apache.solr.cloud.ZkTestServer$2.run(ZkTestServer.java:483)
   [junit4]   2> Caused by: java.io.IOException: Could not configure server because SASL configuration did not allow the  ZooKeeper server to authenticate itself properly: javax.security.auth.login.LoginException: Requested start time is later than end time (11) - Requested start time is later than end time
   [junit4]   2> 	at org.apache.zookeeper.server.ServerCnxnFactory.configureSaslLogin(ServerCnxnFactory.java:207)
   [junit4]   2> 	at org.apache.zookeeper.server.NIOServerCnxnFactory.configure(NIOServerCnxnFactory.java:87)
   [junit4]   2> 	at org.apache.solr.cloud.ZkTestServer$ZKServerMain.runFromConfig(ZkTestServer.java:305)
   [junit4]   2> 	at org.apache.solr.cloud.ZkTestServer$2.run(ZkTestServer.java:481)
   [junit4]   2> 
   [junit4]   2> NOTE: reproduce with: ant test  -Dtestcase=SaslZkACLProviderTest -Dtests.method=testSaslZkACLProvider -Dtests.seed=C655DEB443EE614D -Dtests.multiplier=3 -Dtests.slow=true -Dtests.locale=th_TH -Dtests.timezone=America/Santarem -Dtests.asserts=true -Dtests.file.encoding=US-ASCII
   [junit4] ERROR   57.3s J0 | SaslZkACLProviderTest.testSaslZkACLProvider <<<
   [junit4]    > Throwable #1: java.lang.RuntimeException: Could not get the port for ZooKeeper server
   [junit4]    > 	at org.apache.solr.cloud.ZkTestServer.run(ZkTestServer.java:506)
   [junit4]    > 	at org.apache.solr.cloud.SaslZkACLProviderTest$SaslZkTestServer.run(SaslZkACLProviderTest.java:226)
   [junit4]    > 	at org.apache.solr.cloud.SaslZkACLProviderTest.setUp(SaslZkACLProviderTest.java:91)
   [junit4]    > 	at java.lang.Thread.run(Thread.java:745)Throwable #2: java.lang.NullPointerException
   [junit4]    > 	at org.apache.zookeeper.server.NIOServerCnxnFactory.getLocalPort(NIOServerCnxnFactory.java:134)
   [junit4]    > 	at org.apache.solr.cloud.ZkTestServer$ZKServerMain.shutdown(ZkTestServer.java:334)
   [junit4]    > 	at org.apache.solr.cloud.ZkTestServer.shutdown(ZkTestServer.java:516)
   [junit4]    > 	at org.apache.solr.cloud.SaslZkACLProviderTest$SaslZkTestServer.shutdown(SaslZkACLProviderTest.java:231)
   [junit4]    > 	at org.apache.solr.cloud.SaslZkACLProviderTest.tearDown(SaslZkACLProviderTest.java:126)
   [junit4]    > 	at java.lang.Thread.run(Thread.java:745)Throwable #3: com.carrotsearch.randomizedtesting.UncaughtExceptionError: Captured an uncaught exception in thread: Thread[id=1913, name=Thread-700, state=RUNNABLE, group=TGRP-SaslZkACLProviderTest]
   [junit4]    > Caused by: java.lang.RuntimeException: java.io.IOException: Could not configure server because SASL configuration did not allow the  ZooKeeper server to authenticate itself properly: javax.security.auth.login.LoginException: Requested start time is later than end time (11) - Requested start time is later than end time
   [junit4]    > 	at __randomizedtesting.SeedInfo.seed([C655DEB443EE614D]:0)
   [junit4]    > 	at org.apache.solr.cloud.ZkTestServer$2.run(ZkTestServer.java:483)
   [junit4]    > Caused by: java.io.IOException: Could not configure server because SASL configuration did not allow the  ZooKeeper server to authenticate itself properly: javax.security.auth.login.LoginException: Requested start time is later than end time (11) - Requested start time is later than end time
   [junit4]    > 	at org.apache.zookeeper.server.ServerCnxnFactory.configureSaslLogin(ServerCnxnFactory.java:207)
   [junit4]    > 	at org.apache.zookeeper.server.NIOServerCnxnFactory.configure(NIOServerCnxnFactory.java:87)
   [junit4]    > 	at org.apache.solr.cloud.ZkTestServer$ZKServerMain.runFromConfig(ZkTestServer.java:305)
   [junit4]    > 	at org.apache.solr.cloud.ZkTestServer$2.run(ZkTestServer.java:481)
   [junit4]   2> 388052 T1905 oas.SolrTestCaseJ4.deleteCore ###deleteCore
   [junit4]   2> NOTE: leaving temporary files on disk at: /home/jenkins/workspace/Lucene-Solr-trunk-Linux/solr/build/solr-core/test/J0/temp/solr.cloud.SaslZkACLProviderTest C655DEB443EE614D-001
   [junit4]   2> 57322 T1904 ccr.ThreadLeakControl.checkThreadLeaks WARNING Will linger awaiting termination of 7 leaked thread(s).
   [junit4]   2> 77361 T1904 ccr.ThreadLeakControl.checkThreadLeaks SEVERE 6 threads leaked from SUITE scope at org.apache.solr.cloud.SaslZkACLProviderTest: 
   [junit4]   2> 	   1) Thread[id=1908, name=groupCache.data, state=TIMED_WAITING, group=TGRP-SaslZkACLProviderTest]
   [junit4]   2> 	        at sun.misc.Unsafe.park(Native Method)
   [junit4]   2> 	        at java.util.concurrent.locks.LockSupport.parkNanos(LockSupport.java:215)
   [junit4]   2> 	        at java.util.concurrent.locks.AbstractQueuedSynchronizer$ConditionObject.awaitNanos(AbstractQueuedSynchronizer.java:2078)
   [junit4]   2> 	        at java.util.concurrent.ScheduledThreadPoolExecutor$DelayedWorkQueue.take(ScheduledThreadPoolExecutor.java:1093)
   [junit4]   2> 	        at java.util.concurrent.ScheduledThreadPoolExecutor$DelayedWorkQueue.take(ScheduledThreadPoolExecutor.java:809)
   [junit4]   2> 	        at java.util.concurrent.ThreadPoolExecutor.getTask(ThreadPoolExecutor.java:1067)
   [junit4]   2> 	        at java.util.concurrent.ThreadPoolExecutor.runWorker(ThreadPoolExecutor.java:1127)
   [junit4]   2> 	        at java.util.concurrent.ThreadPoolExecutor$Worker.run(ThreadPoolExecutor.java:617)
   [junit4]   2> 	        at java.lang.Thread.run(Thread.java:745)
   [junit4]   2> 	   2) Thread[id=1912, name=NioSocketAcceptor-1, state=RUNNABLE, group=TGRP-SaslZkACLProviderTest]
   [junit4]   2> 	        at sun.nio.ch.EPollArrayWrapper.epollWait(Native Method)
   [junit4]   2> 	        at sun.nio.ch.EPollArrayWrapper.poll(EPollArrayWrapper.java:269)
   [junit4]   2> 	        at sun.nio.ch.EPollSelectorImpl.doSelect(EPollSelectorImpl.java:79)
   [junit4]   2> 	        at sun.nio.ch.SelectorImpl.lockAndDoSelect(SelectorImpl.java:86)
   [junit4]   2> 	        at sun.nio.ch.SelectorImpl.select(SelectorImpl.java:97)
   [junit4]   2> 	        at sun.nio.ch.SelectorImpl.select(SelectorImpl.java:101)
   [junit4]   2> 	        at org.apache.mina.transport.socket.nio.NioSocketAcceptor.select(NioSocketAcceptor.java:234)
   [junit4]   2> 	        at org.apache.mina.core.polling.AbstractPollingIoAcceptor$Acceptor.run(AbstractPollingIoAcceptor.java:417)
   [junit4]   2> 	        at org.apache.mina.util.NamePreservingRunnable.run(NamePreservingRunnable.java:64)
   [junit4]   2> 	        at java.util.concurrent.ThreadPoolExecutor.runWorker(ThreadPoolExecutor.java:1142)
   [junit4]   2> 	        at java.util.concurrent.ThreadPoolExecutor$Worker.run(ThreadPoolExecutor.java:617)
   [junit4]   2> 	        at java.lang.Thread.run(Thread.java:745)
   [junit4]   2> 	   3) Thread[id=1909, name=ou=system.data, state=TIMED_WAITING, group=TGRP-SaslZkACLProviderTest]
   [junit4]   2> 	        at sun.misc.Unsafe.park(Native Method)
   [junit4]   2> 	        at java.util.concurrent.locks.LockSupport.parkNanos(LockSupport.java:215)
   [junit4]   2> 	        at java.util.concurrent.locks.AbstractQueuedSynchronizer$ConditionObject.awaitNanos(AbstractQueuedSynchronizer.java:2078)
   [junit4]   2> 	        at java.util.concurrent.ScheduledThreadPoolExecutor$DelayedWorkQueue.take(ScheduledThreadPoolExecutor.java:1093)
   [junit4]   2> 	        at java.util.concurrent.ScheduledThreadPoolExecutor$DelayedWorkQueue.take(ScheduledThreadPoolExecutor.java:809)
   [junit4]   2> 	        at java.util.concurrent.ThreadPoolExecutor.getTask(ThreadPoolExecutor.java:1067)
   [junit4]   2> 	        at java.util.concurrent.ThreadPoolExecutor.runWorker(ThreadPoolExecutor.java:1127)
   [junit4]   2> 	        at java.util.concurrent.ThreadPoolExecutor$Worker.run(ThreadPoolExecutor.java:617)
   [junit4]   2> 	        at java.lang.Thread.run(Thread.java:745)
   [junit4]   2> 	   4) Thread[id=1910, name=changePwdReplayCache.data, state=TIMED_WAITING, group=TGRP-SaslZkACLProviderTest]
   [junit4]   2> 	        at sun.misc.Unsafe.park(Native Method)
   [junit4]   2> 	        at java.util.concurrent.locks.LockSupport.parkNanos(LockSupport.java:215)
   [junit4]   2> 	        at java.util.concurrent.locks.AbstractQueuedSynchronizer$ConditionObject.awaitNanos(AbstractQueuedSynchronizer.java:2078)
   [junit4]   2> 	        at java.util.concurrent.ScheduledThreadPoolExecutor$DelayedWorkQueue.take(ScheduledThreadPoolExecutor.java:1093)
   [junit4]   2> 	        at java.util.concurrent.ScheduledThreadPoolExecutor$DelayedWorkQueue.take(ScheduledThreadPoolExecutor.java:809)
   [junit4]   2> 	        at java.util.concurrent.ThreadPoolExecutor.getTask(ThreadPoolExecutor.java:1067)
   [junit4]   2> 	        at java.util.concurrent.ThreadPoolExecutor.runWorker(ThreadPoolExecutor.java:1127)
   [junit4]   2> 	        at java.util.concurrent.ThreadPoolExecutor$Worker.run(ThreadPoolExecutor.java:617)
   [junit4]   2> 	        at java.lang.Thread.run(Thread.java:745)
   [junit4]   2> 	   5) Thread[id=1907, name=apacheds, state=WAITING, group=TGRP-SaslZkACLProviderTest]
   [junit4]   2> 	        at java.lang.Object.wait(Native Method)
   [junit4]   2> 	        at java.lang.Object.wait(Object.java:502)
   [junit4]   2> 	        at java.util.TimerThread.mainLoop(Timer.java:526)
   [junit4]   2> 	        at java.util.TimerThread.run(Timer.java:505)
   [junit4]   2> 	   6) Thread[id=1911, name=kdcReplayCache.data, state=TIMED_WAITING, group=TGRP-SaslZkACLProviderTest]
   [junit4]   2> 	        at sun.misc.Unsafe.park(Native Method)
   [junit4]   2> 	        at java.util.concurrent.locks.LockSupport.parkNanos(LockSupport.java:215)
   [junit4]   2> 	        at java.util.concurrent.locks.AbstractQueuedSynchronizer$ConditionObject.awaitNanos(AbstractQueuedSynchronizer.java:2078)
   [junit4]   2> 	        at java.util.concurrent.ScheduledThreadPoolExecutor$DelayedWorkQueue.take(ScheduledThreadPoolExecutor.java:1093)
   [junit4]   2> 	        at java.util.concurrent.ScheduledThreadPoolExecutor$DelayedWorkQueue.take(ScheduledThreadPoolExecutor.java:809)
   [junit4]   2> 	        at java.util.concurrent.ThreadPoolExecutor.getTask(ThreadPoolExecutor.java:1067)
   [junit4]   2> 	        at java.util.concurrent.ThreadPoolExecutor.runWorker(ThreadPoolExecutor.java:1127)
   [junit4]   2> 	        at java.util.concurrent.ThreadPoolExecutor$Worker.run(ThreadPoolExecutor.java:617)
   [junit4]   2> 	        at java.lang.Thread.run(Thread.java:745)
   [junit4]   2> 77362 T1904 ccr.ThreadLeakControl.tryToInterruptAll Starting to interrupt leaked threads:
   [junit4]   2> 	   1) Thread[id=1908, name=groupCache.data, state=TIMED_WAITING, group=TGRP-SaslZkACLProviderTest]
   [junit4]   2> 	   2) Thread[id=1912, name=NioSocketAcceptor-1, state=RUNNABLE, group=TGRP-SaslZkACLProviderTest]
   [junit4]   2> 	   3) Thread[id=1909, name=ou=system.data, state=TIMED_WAITING, group=TGRP-SaslZkACLProviderTest]
   [junit4]   2> 	   4) Thread[id=1910, name=changePwdReplayCache.data, state=TIMED_WAITING, group=TGRP-SaslZkACLProviderTest]
   [junit4]   2> 	   5) Thread[id=1907, name=apacheds, state=WAITING, group=TGRP-SaslZkACLProviderTest]
   [junit4]   2> 	   6) Thread[id=1911, name=kdcReplayCache.data, state=TIMED_WAITING, group=TGRP-SaslZkACLProviderTest]
   [junit4]   2> 80398 T1904 ccr.ThreadLeakControl.tryToInterruptAll SEVERE There are still zombie threads that couldn't be terminated:
   [junit4]   2> 	   1) Thread[id=1908, name=groupCache.data, state=TIMED_WAITING, group=TGRP-SaslZkACLProviderTest]
   [junit4]   2> 	        at sun.misc.Unsafe.park(Native Method)
   [junit4]   2> 	        at java.util.concurrent.locks.LockSupport.parkNanos(LockSupport.java:215)
   [junit4]   2> 	        at java.util.concurrent.locks.AbstractQueuedSynchronizer$ConditionObject.awaitNanos(AbstractQueuedSynchronizer.java:2078)
   [junit4]   2> 	        at java.util.concurrent.ScheduledThreadPoolExecutor$DelayedWorkQueue.take(ScheduledThreadPoolExecutor.java:1093)
   [junit4]   2> 	        at java.util.concurrent.ScheduledThreadPoolExecutor$DelayedWorkQueue.take(ScheduledThreadPoolExecutor.java:809)
   [junit4]   2> 	        at java.util.concurrent.ThreadPoolExecutor.getTask(ThreadPoolExecutor.java:1067)
   [junit4]   2> 	        at java.util.concurrent.ThreadPoolExecutor.runWorker(ThreadPoolExecutor.java:1127)
   [junit4]   2> 	        at java.util.concurrent.ThreadPoolExecutor$Worker.run(ThreadPoolExecutor.java:617)
   [junit4]   2> 	        at java.lang.Thread.run(Thread.java:745)
   [junit4]   2> 	   2) Thread[id=1912, name=NioSocketAcceptor-1, state=RUNNABLE, group=TGRP-SaslZkACLProviderTest]
   [junit4]   2> 	        at sun.nio.ch.IOUtil.drain(Native Method)
   [junit4]   2> 	        at sun.nio.ch.EPollSelectorImpl.doSelect(EPollSelectorImpl.java:90)
   [junit4]   2> 	        at sun.nio.ch.SelectorImpl.lockAndDoSelect(SelectorImpl.java:86)
   [junit4]   2> 	        at sun.nio.ch.SelectorImpl.select(SelectorImpl.java:97)
   [junit4]   2> 	        at sun.nio.ch.SelectorImpl.select(SelectorImpl.java:101)
   [junit4]   2> 	        at org.apache.mina.transport.socket.nio.NioSocketAcceptor.select(NioSocketAcceptor.java:234)
   [junit4]   2> 	        at org.apache.mina.core.polling.AbstractPollingIoAcceptor$Acceptor.run(AbstractPollingIoAcceptor.java:417)
   [junit4]   2> 	        at org.apache.mina.util.NamePreservingRunnable.run(NamePreservingRunnable.java:64)
   [junit4]   2> 	        at java.util.concurrent.ThreadPoolExecutor.runWorker(ThreadPoolExecutor.java:1142)
   [junit4]   2> 	        at java.util.concurrent.ThreadPoolExecutor$Worker.run(ThreadPoolExecutor.java:617)
   [junit4]   2> 	        at java.lang.Thread.run(Thread.java:745)
   [junit4]   2> 	   3) Thread[id=1909, name=ou=system.data, state=TIMED_WAITING, group=TGRP-SaslZkACLProviderTest]
   [junit4]   2> 	        at sun.misc.Unsafe.park(Native Method)
   [junit4]   2> 	        at java.util.concurrent.locks.LockSupport.parkNanos(LockSupport.java:215)
   [junit4]   2> 	        at java.util.concurrent.locks.AbstractQueuedSynchronizer$ConditionObject.awaitNanos(AbstractQueuedSynchronizer.java:2078)
   [junit4]   2> 	        at java.util.concurrent.ScheduledThreadPoolExecutor$DelayedWorkQueue.take(ScheduledThreadPoolExecutor.java:1093)
   [junit4]   2> 	        at java.util.concurrent.ScheduledThreadPoolExecutor$DelayedWorkQueue.take(ScheduledThreadPoolExecutor.java:809)
   [junit4]   2> 	        at java.util.concurrent.ThreadPoolExecutor.getTask(ThreadPoolExecutor.java:1067)
   [junit4]   2> 	        at java.util.concurrent.ThreadPoolExecutor.runWorker(ThreadPoolExecutor.java:1127)
   [junit4]   2> 	        at java.util.concurrent.ThreadPoolExecutor$Worker.run(ThreadPoolExecutor.java:617)
   [junit4]   2> 	        at java.lang.Thread.run(Thread.java:745)
   [junit4]   2> 	   4) Thread[id=1910, name=changePwdReplayCache.data, state=TIMED_WAITING, group=TGRP-SaslZkACLProviderTest]
   [junit4]   2> 	        at sun.misc.Unsafe.park(Native Method)
   [junit4]   2> 	        at java.util.concurrent.locks.LockSupport.parkNanos(LockSupport.java:215)
   [junit4]   2> 	        at java.util.concurrent.locks.AbstractQueuedSynchronizer$ConditionObject.awaitNanos(AbstractQueuedSynchronizer.java:2078)
   [junit4]   2> 	        at java.util.concurrent.ScheduledThreadPoolExecutor$DelayedWorkQueue.take(ScheduledThreadPoolExecutor.java:1093)
   [junit4]   2> 	        at java.util.concurrent.ScheduledThreadPoolExecutor$DelayedWorkQueue.take(ScheduledThreadPoolExecutor.java:809)
   [junit4]   2> 	        at java.util.concurrent.ThreadPoolExecutor.getTask(ThreadPoolExecutor.java:1067)
   [junit4]   2> 	        at java.util.concurrent.ThreadPoolExecutor.runWorker(ThreadPoolExecutor.java:1127)
   [junit4]   2> 	        at java.util.concurrent.ThreadPoolExecutor$Worker.run(ThreadPoolExecutor.java:617)
   [junit4]   2> 	        at java.lang.Thread.run(Thread.java:745)
   [junit4]   2> 	   5) Thread[id=1907, name=apacheds, state=WAITING, group=TGRP-SaslZkACLProviderTest]
   [junit4]   2> 	        at java.lang.Object.wait(Native Method)
   [junit4]   2> 	        at java.lang.Object.wait(Object.java:502)
   [junit4]   2> 	        at java.util.TimerThread.mainLoop(Timer.java:526)
   [junit4]   2> 	        at java.util.TimerThread.run(Timer.java:505)
   [junit4]   2> 	   6) Thread[id=1911, name=kdcReplayCache.data, state=TIMED_WAITING, group=TGRP-SaslZkACLProviderTest]
   [junit4]   2> 	        at sun.misc.Unsafe.park(Native Method)
   [junit4]   2> 	        at java.util.concurrent.locks.LockSupport.parkNanos(LockSupport.java:215)
   [junit4]   2> 	        at java.util.concurrent.locks.AbstractQueuedSynchronizer$ConditionObject.awaitNanos(AbstractQueuedSynchronizer.java:2078)
   [junit4]   2> 	        at java.util.concurrent.ScheduledThreadPoolExecutor$DelayedWorkQueue.take(ScheduledThreadPoolExecutor.java:1093)
   [junit4]   2> 	        at java.util.concurrent.ScheduledThreadPoolExecutor$DelayedWorkQueue.take(ScheduledThreadPoolExecutor.java:809)
   [junit4]   2> 	        at java.util.concurrent.ThreadPoolExecutor.getTask(ThreadPoolExecutor.java:1067)
   [junit4]   2> 	        at java.util.concurrent.ThreadPoolExecutor.runWorker(ThreadPoolExecutor.java:1127)
   [junit4]   2> 	        at java.util.concurrent.ThreadPoolExecutor$Worker.run(ThreadPoolExecutor.java:617)
   [junit4]   2> 	        at java.lang.Thread.run(Thread.java:745)
   [junit4]   2> NOTE: test params are: codec=Asserting(Lucene50): {}, docValues:{}, sim=RandomSimilarityProvider(queryNorm=true,coord=crazy): {}, locale=th_TH, timezone=America/Santarem
   [junit4]   2> NOTE: Linux 3.13.0-49-generic i386/Oracle Corporation 1.8.0_40 (32-bit)/cpus=12,threads=7,free=79169624,total=276824064
   [junit4]   2> NOTE: All tests run in this JVM: [TestDFRSimilarityFactory, SuggesterFSTTest, ClusterStateTest, TestRandomDVFaceting, TestSolr4Spatial, VMParamsZkACLAndCredentialsProvidersTest, SolrIndexConfigTest, TestRealTimeGet, HighlighterTest, DateMathParserTest, TestMacros, CSVRequestHandlerTest, TestSchemaNameResource, TriLevelCompositeIdRoutingTest, OverseerStatusTest, TestCustomSort, SolrCloudExampleTest, QueryElevationComponentTest, TestManagedSchema, PeerSyncTest, TestMissingGroups, UUIDFieldTest, RankQueryTest, TestJsonRequest, BasicDistributedZkTest, MBeansHandlerTest, TestComplexPhraseQParserPlugin, TestConfig, TestRecoveryHdfs, HdfsDirectoryTest, SimplePostToolTest, TimeZoneUtilsTest, TestStressLucene, TestClassNameShortening, TestInitQParser, TestConfigOverlay, IndexSchemaTest, FastVectorHighlighterTest, URLClassifyProcessorTest, SolrRequestParserTest, DistributedFacetPivotWhiteBoxTest, TermVectorComponentTest, TestJoin, TestIBSimilarityFactory, TestFieldTypeCollectionResource, OverseerRolesTest, DebugComponentTest, SaslZkACLProviderTest]
   [junit4]   2> NOTE: reproduce with: ant test  -Dtestcase=SaslZkACLProviderTest -Dtests.seed=C655DEB443EE614D -Dtests.multiplier=3 -Dtests.slow=true -Dtests.locale=th_TH -Dtests.timezone=America/Santarem -Dtests.asserts=true -Dtests.file.encoding=US-ASCII
   [junit4] ERROR   0.00s J0 | SaslZkACLProviderTest (suite) <<<
   [junit4]    > Throwable #1: com.carrotsearch.randomizedtesting.ThreadLeakError: 6 threads leaked from SUITE scope at org.apache.solr.cloud.SaslZkACLProviderTest: 
   [junit4]    >    1) Thread[id=1908, name=groupCache.data, state=TIMED_WAITING, group=TGRP-SaslZkACLProviderTest]
   [junit4]    >         at sun.misc.Unsafe.park(Native Method)
   [junit4]    >         at java.util.concurrent.locks.LockSupport.parkNanos(LockSupport.java:215)
   [junit4]    >         at java.util.concurrent.locks.AbstractQueuedSynchronizer$ConditionObject.awaitNanos(AbstractQueuedSynchronizer.java:2078)
   [junit4]    >         at java.util.concurrent.ScheduledThreadPoolExecutor$DelayedWorkQueue.take(ScheduledThreadPoolExecutor.java:1093)
   [junit4]    >         at java.util.concurrent.ScheduledThreadPoolExecutor$DelayedWorkQueue.take(ScheduledThreadPoolExecutor.java:809)
   [junit4]    >         at java.util.concurrent.ThreadPoolExecutor.getTask(ThreadPoolExecutor.java:1067)
   [junit4]    >         at java.util.concurrent.ThreadPoolExecutor.runWorker(ThreadPoolExecutor.java:1127)
   [junit4]    >         at java.util.concurrent.ThreadPoolExecutor$Worker.run(ThreadPoolExecutor.java:617)
   [junit4]    >         at java.lang.Thread.run(Thread.java:745)
   [junit4]    >    2) Thread[id=1912, name=NioSocketAcceptor-1, state=RUNNABLE, group=TGRP-SaslZkACLProviderTest]
   [junit4]    >         at sun.nio.ch.EPollArrayWrapper.epollWait(Native Method)
   [junit4]    >         at sun.nio.ch.EPollArrayWrapper.poll(EPollArrayWrapper.java:269)
   [junit4]    >         at sun.nio.ch.EPollSelectorImpl.doSelect(EPollSelectorImpl.java:79)
   [junit4]    >         at sun.nio.ch.SelectorImpl.lockAndDoSelect(SelectorImpl.java:86)
   [junit4]    >         at sun.nio.ch.SelectorImpl.select(SelectorImpl.java:97)
   [junit4]    >         at sun.nio.ch.SelectorImpl.select(SelectorImpl.java:101)
   [junit4]    >         at org.apache.mina.transport.socket.nio.NioSocketAcceptor.select(NioSocketAcceptor.java:234)
   [junit4]    >         at org.apache.mina.core.polling.AbstractPollingIoAcceptor$Acceptor.run(AbstractPollingIoAcceptor.java:417)
   [junit4]    >         at org.apache.mina.util.NamePreservingRunnable.run(NamePreservingRunnable.java:64)
   [junit4]    >         at java.util.concurrent.ThreadPoolExecutor.runWorker(ThreadPoolExecutor.java:1142)
   [junit4]    >         at java.util.concurrent.ThreadPoolExecutor$Worker.run(ThreadPoolExecutor.java:617)
   [junit4]    >         at java.lang.Thread.run(Thread.java:745)
   [junit4]    >    3) Thread[id=1909, name=ou=system.data, state=TIMED_WAITING, group=TGRP-SaslZkACLProviderTest]
   [junit4]    >         at sun.misc.Unsafe.park(Native Method)
   [junit4]    >         at java.util.concurrent.locks.LockSupport.parkNanos(LockSupport.java:215)
   [junit4]    >         at java.util.concurrent.locks.AbstractQueuedSynchronizer$ConditionObject.awaitNanos(AbstractQueuedSynchronizer.java:2078)
   [junit4]    >         at java.util.concurrent.ScheduledThreadPoolExecutor$DelayedWorkQueue.take(ScheduledThreadPoolExecutor.java:1093)
   [junit4]    >         at java.util.concurrent.ScheduledThreadPoolExecutor$DelayedWorkQueue.take(ScheduledThreadPoolExecutor.java:809)
   [junit4]    >         at java.util.concurrent.ThreadPoolExecutor.getTask(ThreadPoolExecutor.java:1067)
   [junit4]    >         at java.util.concurrent.ThreadPoolExecutor.runWorker(ThreadPoolExecutor.java:1127)
   [junit4]    >         at java.util.concurrent.ThreadPoolExecutor$Worker.run(ThreadPoolExecutor.java:617)
   [junit4]    >         at java.lang.Thread.run(Thread.java:745)
   [junit4]    >    4) Thread[id=1910, name=changePwdReplayCache.data, state=TIMED_WAITING, group=TGRP-SaslZkACLProviderTest]
   [junit4]    >         at sun.misc.Unsafe.park(Native Method)
   [junit4]    >         at java.util.concurrent.locks.LockSupport.parkNanos(LockSupport.java:215)
   [junit4]    >         at java.util.concurrent.locks.AbstractQueuedSynchronizer$ConditionObject.awaitNanos(AbstractQueuedSynchronizer.java:2078)
   [junit4]    >         at java.util.concurrent.ScheduledThreadPoolExecutor$DelayedWorkQueue.take(ScheduledThreadPoolExecutor.java:1093)
   [junit4]    >         at java.util.concurrent.ScheduledThreadPoolExecutor$DelayedWorkQueue.take(ScheduledThreadPoolExecutor.java:809)
   [junit4]    >         at java.util.concurrent.ThreadPoolExecutor.getTask(ThreadPoolExecutor.java:1067)
   [junit4]    >         at java.util.concurrent.ThreadPoolExecutor.runWorker(ThreadPoolExecutor.java:1127)
   [junit4]    >         at java.util.concurrent.ThreadPoolExecutor$Worker.run(ThreadPoolExecutor.java:617)
   [junit4]    >         at java.lang.Thread.run(Thread.java:745)
   [junit4]    >    5) Thread[id=1907, name=apacheds, state=WAITING, group=TGRP-SaslZkACLProviderTest]
   [junit4]    >         at java.lang.Object.wait(Native Method)
   [junit4]    >         at java.lang.Object.wait(Object.java:502)
   [junit4]    >         at java.util.TimerThread.mainLoop(Timer.java:526)
   [junit4]    >         at java.util.TimerThread.run(Timer.java:505)
   [junit4]    >    6) Thread[id=1911, name=kdcReplayCache.data, state=TIMED_WAITING, group=TGRP-SaslZkACLProviderTest]
   [junit4]    >         at sun.misc.Unsafe.park(Native Method)
   [junit4]    >         at java.util.concurrent.locks.LockSupport.parkNanos(LockSupport.java:215)
   [junit4]    >         at java.util.concurrent.locks.AbstractQueuedSynchronizer$ConditionObject.awaitNanos(AbstractQueuedSynchronizer.java:2078)
   [junit4]    >         at java.util.concurrent.ScheduledThreadPoolExecutor$DelayedWorkQueue.take(ScheduledThreadPoolExecutor.java:1093)
   [junit4]    >         at java.util.concurrent.ScheduledThreadPoolExecutor$DelayedWorkQueue.take(ScheduledThreadPoolExecutor.java:809)
   [junit4]    >         at java.util.concurrent.ThreadPoolExecutor.getTask(ThreadPoolExecutor.java:1067)
   [junit4]    >         at java.util.concurrent.ThreadPoolExecutor.runWorker(ThreadPoolExecutor.java:1127)
   [junit4]    >         at java.util.concurrent.ThreadPoolExecutor$Worker.run(ThreadPoolExecutor.java:617)
   [junit4]    >         at java.lang.Thread.run(Thread.java:745)
   [junit4]    > 	at __randomizedtesting.SeedInfo.seed([C655DEB443EE614D]:0)Throwable #2: com.carrotsearch.randomizedtesting.ThreadLeakError: There are still zombie threads that couldn't be terminated:
   [junit4]    >    1) Thread[id=1908, name=groupCache.data, state=TIMED_WAITING, group=TGRP-SaslZkACLProviderTest]
   [junit4]    >         at sun.misc.Unsafe.park(Native Method)
   [junit4]    >         at java.util.concurrent.locks.LockSupport.parkNanos(LockSupport.java:215)
   [junit4]    >         at java.util.concurrent.locks.AbstractQueuedSynchronizer$ConditionObject.awaitNanos(AbstractQueuedSynchronizer.java:2078)
   [junit4]    >         at java.util.concurrent.ScheduledThreadPoolExecutor$DelayedWorkQueue.take(ScheduledThreadPoolExecutor.java:1093)
   [junit4]    >         at java.util.concurrent.ScheduledThreadPoolExecutor$DelayedWorkQueue.take(ScheduledThreadPoolExecutor.java:809)
   [junit4]    >         at java.util.concurrent.ThreadPoolExecutor.getTask(ThreadPoolExecutor.java:1067)
   [junit4]    >         at java.util.concurrent.ThreadPoolExecutor.runWorker(ThreadPoolExecutor.java:1127)
   [junit4]    >         at java.util.concurrent.ThreadPoolExecutor$Worker.run(ThreadPoolExecutor.java:617)
   [junit4]    >         at java.lang.Thread.run(Thread.java:745)
   [junit4]    >    2) Thread[id=1912, name=NioSocketAcceptor-1, state=RUNNABLE, group=TGRP-SaslZkACLProviderTest]
   [junit4]    >         at sun.nio.ch.IOUtil.drain(Native Method)
   [junit4]    >         at sun.nio.ch.EPollSelectorImpl.doSelect(EPollSelectorImpl.java:90)
   [junit4]    >         at sun.nio.ch.SelectorImpl.lockAndDoSelect(SelectorImpl.java:86)
   [junit4]    >         at sun.nio.ch.SelectorImpl.select(SelectorImpl.java:97)
   [junit4]    >         at sun.nio.ch.SelectorImpl.select(SelectorImpl.java:101)
   [junit4]    >         at org.apache.mina.transport.socket.nio.NioSocketAcceptor.select(NioSocketAcceptor.java:234)
   [junit4]    >         at org.apache.mina.core.polling.AbstractPollingIoAcceptor$Acceptor.run(AbstractPollingIoAcceptor.java:417)
   [junit4]    >         at org.apache.mina.util.NamePreservingRunnable.run(NamePreservingRunnable.java:64)
   [junit4]    >         at java.util.concurrent.ThreadPoolExecutor.runWorker(ThreadPoolExecutor.java:1142)
   [junit4]    >         at java.util.concurrent.ThreadPoolExecutor$Worker.run(ThreadPoolExecutor.java:617)
   [junit4]    >         at java.lang.Thread.run(Thread.java:745)
   [junit4]    >    3) Thread[id=1909, name=ou=system.data, state=TIMED_WAITING, group=TGRP-SaslZkACLProviderTest]
   [junit4]    >         at sun.misc.Unsafe.park(Native Method)
   [junit4]    >         at java.util.concurrent.locks.LockSupport.parkNanos(LockSupport.java:215)
   [junit4]    >         at java.util.concurrent.locks.AbstractQueuedSynchronizer$ConditionObject.awaitNanos(AbstractQueuedSynchronizer.java:2078)
   [junit4]    >         at java.util.concurrent.ScheduledThreadPoolExecutor$DelayedWorkQueue.take(ScheduledThreadPoolExecutor.java:1093)
   [junit4]    >         at java.util.concurrent.ScheduledThreadPoolExecutor$DelayedWorkQueue.take(ScheduledThreadPoolExecutor.java:809)
   [junit4]    >         at java.util.concurrent.ThreadPoolExecutor.getTask(ThreadPoolExecutor.java:1067)
   [junit4]    >         at java.util.concurrent.ThreadPoolExecutor.runWorker(ThreadPoolExecutor.java:1127)
   [junit4]    >         at java.util.concurrent.ThreadPoolExecutor$Worker.run(ThreadPoolExecutor.java:617)
   [junit4]    >         at java.lang.Thread.run(Thread.java:745)
   [junit4]    >    4) Thread[id=1910, name=changePwdReplayCache.data, state=TIMED_WAITING, group=TGRP-SaslZkACLProviderTest]
   [junit4]    >         at sun.misc.Unsafe.park(Native Method)
   [junit4]    >         at java.util.concurrent.locks.LockSupport.parkNanos(LockSupport.java:215)
   [junit4]    >         at java.util.concurrent.locks.AbstractQueuedSynchronizer$ConditionObject.awaitNanos(AbstractQueuedSynchronizer.java:2078)
   [junit4]    >         at java.util.concurrent.ScheduledThreadPoolExecutor$DelayedWorkQueue.take(ScheduledThreadPoolExecutor.java:1093)
   [junit4]    >         at java.util.concurrent.ScheduledThreadPoolExecutor$DelayedWorkQueue.take(ScheduledThreadPoolExecutor.java:809)
   [junit4]    >         at java.util.concurrent.ThreadPoolExecutor.getTask(ThreadPoolExecutor.java:1067)
   [junit4]    >         at java.util.concurrent.ThreadPoolExecutor.runWorker(ThreadPoolExecutor.java:1127)
   [junit4]    >         at java.util.concurrent.ThreadPoolExecutor$Worker.run(ThreadPoolExecutor.java:617)
   [junit4]    >         at java.lang.Thread.run(Thread.java:745)
   [junit4]    >    5) Thread[id=1907, name=apacheds, state=WAITING, group=TGRP-SaslZkACLProviderTest]
   [junit4]    >         at java.lang.Object.wait(Native Method)
   [junit4]    >         at java.lang.Object.wait(Object.java:502)
   [junit4]    >         at java.util.TimerThread.mainLoop(Timer.java:526)
   [junit4]    >         at java.util.TimerThread.run(Timer.java:505)
   [junit4]    >    6) Thread[id=1911, name=kdcReplayCache.data, state=TIMED_WAITING, group=TGRP-SaslZkACLProviderTest]
   [junit4]    >         at sun.misc.Unsafe.park(Native Method)
   [junit4]    >         at java.util.concurrent.locks.LockSupport.parkNanos(LockSupport.java:215)
   [junit4]    >         at java.util.concurrent.locks.AbstractQueuedSynchronizer$ConditionObject.awaitNanos(AbstractQueuedSynchronizer.java:2078)
   [junit4]    >         at java.util.concurrent.ScheduledThreadPoolExecutor$DelayedWorkQueue.take(ScheduledThreadPoolExecutor.java:1093)
   [junit4]    >         at java.util.concurrent.ScheduledThreadPoolExecutor$DelayedWorkQueue.take(ScheduledThreadPoolExecutor.java:809)
   [junit4]    >         at java.util.concurrent.ThreadPoolExecutor.getTask(ThreadPoolExecutor.java:1067)
   [junit4]    >         at java.util.concurrent.ThreadPoolExecutor.runWorker(ThreadPoolExecutor.java:1127)
   [junit4]    >         at java.util.concurrent.ThreadPoolExecutor$Worker.run(ThreadPoolExecutor.java:617)
   [junit4]    >         at java.lang.Thread.run(Thread.java:745)
   [junit4]    > 	at __randomizedtesting.SeedInfo.seed([C655DEB443EE614D]:0)
   [junit4] Completed [169/483] on J0 in 80.43s, 1 test, 3 errors <<< FAILURES!

[...truncated 974 lines...]
BUILD FAILED
/home/jenkins/workspace/Lucene-Solr-trunk-Linux/build.xml:526: The following error occurred while executing this line:
/home/jenkins/workspace/Lucene-Solr-trunk-Linux/build.xml:474: The following error occurred while executing this line:
/home/jenkins/workspace/Lucene-Solr-trunk-Linux/build.xml:61: The following error occurred while executing this line:
/home/jenkins/workspace/Lucene-Solr-trunk-Linux/extra-targets.xml:39: The following error occurred while executing this line:
/home/jenkins/workspace/Lucene-Solr-trunk-Linux/solr/build.xml:229: The following error occurred while executing this line:
/home/jenkins/workspace/Lucene-Solr-trunk-Linux/solr/common-build.xml:512: The following error occurred while executing this line:
/home/jenkins/workspace/Lucene-Solr-trunk-Linux/lucene/common-build.xml:1415: The following error occurred while executing this line:
/home/jenkins/workspace/Lucene-Solr-trunk-Linux/lucene/common-build.xml:973: There were test failures: 483 suites, 1915 tests, 2 suite-level errors, 1 error, 1119 ignored (18 assumptions)

Total time: 28 minutes 12 seconds
Build step 'Invoke Ant' marked build as failure
Archiving artifacts
Recording test results
Email was triggered for: Failure - Any
Sending email for trigger: Failure - Any



Mime
View raw message