lucene-dev mailing list archives

Site index · List index
Message view « Date » · « Thread »
Top « Date » · « Thread »
From Apache Jenkins Server <jenk...@builds.apache.org>
Subject [JENKINS] Lucene-Solr-Tests-5.x-Java7 - Build # 2890 - Still Failing
Date Sat, 04 Apr 2015 18:00:38 GMT
Build: https://builds.apache.org/job/Lucene-Solr-Tests-5.x-Java7/2890/

4 tests failed.
REGRESSION:  org.apache.solr.cloud.TestCloudPivotFacet.test

Error Message:
{main(facet=true&facet.pivot=%7B%21stats%3Dst3%7Dpivot_ti%2Cpivot_tl%2Cpivot_dt&facet.limit=16&facet.offset=3&facet.pivot.mincount=3&facet.missing=true&facet.sort=index&facet.overrequest.ratio=-1.1108205),extra(rows=0&q=*%3A*&fq=id%3A%5B*+TO+665%5D&stats=true&stats.field=%7B%21key%3Dsk1+tag%3Dst1%2Cst2%7Dpivot_tdt1&stats.field=%7B%21key%3Dsk2+tag%3Dst2%2Cst3%7Dpivot_ti&stats.field=%7B%21key%3Dsk3+tag%3Dst3%2Cst4%7Dpivot_tl1&_test_min=3&_test_miss=true&_test_sort=index)} ==> pivot_ti,pivot_tl,pivot_dt: {params(rows=0),defaults({main({main(rows=0&q=*%3A*&fq=id%3A%5B*+TO+665%5D&stats=true&stats.field=%7B%21key%3Dsk1+tag%3Dst1%2Cst2%7Dpivot_tdt1&stats.field=%7B%21key%3Dsk2+tag%3Dst2%2Cst3%7Dpivot_ti&stats.field=%7B%21key%3Dsk3+tag%3Dst3%2Cst4%7Dpivot_tl1&_test_min=3&_test_miss=true&_test_sort=index),extra(fq=%7B%21term+f%3Dpivot_ti%7D35)}),extra(fq=-pivot_tl%3A%5B*+TO+*%5D)})} expected:<4> but was:<5>

Stack Trace:
java.lang.AssertionError: {main(facet=true&facet.pivot=%7B%21stats%3Dst3%7Dpivot_ti%2Cpivot_tl%2Cpivot_dt&facet.limit=16&facet.offset=3&facet.pivot.mincount=3&facet.missing=true&facet.sort=index&facet.overrequest.ratio=-1.1108205),extra(rows=0&q=*%3A*&fq=id%3A%5B*+TO+665%5D&stats=true&stats.field=%7B%21key%3Dsk1+tag%3Dst1%2Cst2%7Dpivot_tdt1&stats.field=%7B%21key%3Dsk2+tag%3Dst2%2Cst3%7Dpivot_ti&stats.field=%7B%21key%3Dsk3+tag%3Dst3%2Cst4%7Dpivot_tl1&_test_min=3&_test_miss=true&_test_sort=index)} ==> pivot_ti,pivot_tl,pivot_dt: {params(rows=0),defaults({main({main(rows=0&q=*%3A*&fq=id%3A%5B*+TO+665%5D&stats=true&stats.field=%7B%21key%3Dsk1+tag%3Dst1%2Cst2%7Dpivot_tdt1&stats.field=%7B%21key%3Dsk2+tag%3Dst2%2Cst3%7Dpivot_ti&stats.field=%7B%21key%3Dsk3+tag%3Dst3%2Cst4%7Dpivot_tl1&_test_min=3&_test_miss=true&_test_sort=index),extra(fq=%7B%21term+f%3Dpivot_ti%7D35)}),extra(fq=-pivot_tl%3A%5B*+TO+*%5D)})} expected:<4> but was:<5>
	at __randomizedtesting.SeedInfo.seed([12A3AA716553D370:9AF795ABCBAFBE88]:0)
	at org.apache.solr.cloud.TestCloudPivotFacet.assertPivotCountsAreCorrect(TestCloudPivotFacet.java:281)
	at org.apache.solr.cloud.TestCloudPivotFacet.test(TestCloudPivotFacet.java:228)
	at sun.reflect.NativeMethodAccessorImpl.invoke0(Native Method)
	at sun.reflect.NativeMethodAccessorImpl.invoke(NativeMethodAccessorImpl.java:57)
	at sun.reflect.DelegatingMethodAccessorImpl.invoke(DelegatingMethodAccessorImpl.java:43)
	at java.lang.reflect.Method.invoke(Method.java:606)
	at com.carrotsearch.randomizedtesting.RandomizedRunner.invoke(RandomizedRunner.java:1627)
	at com.carrotsearch.randomizedtesting.RandomizedRunner$6.evaluate(RandomizedRunner.java:836)
	at com.carrotsearch.randomizedtesting.RandomizedRunner$7.evaluate(RandomizedRunner.java:872)
	at com.carrotsearch.randomizedtesting.RandomizedRunner$8.evaluate(RandomizedRunner.java:886)
	at org.apache.solr.BaseDistributedSearchTestCase$ShardsRepeatRule$ShardsFixedStatement.callStatement(BaseDistributedSearchTestCase.java:960)
	at org.apache.solr.BaseDistributedSearchTestCase$ShardsRepeatRule$ShardsStatement.evaluate(BaseDistributedSearchTestCase.java:935)
	at com.carrotsearch.randomizedtesting.rules.SystemPropertiesRestoreRule$1.evaluate(SystemPropertiesRestoreRule.java:53)
	at org.apache.lucene.util.TestRuleSetupTeardownChained$1.evaluate(TestRuleSetupTeardownChained.java:50)
	at org.apache.lucene.util.AbstractBeforeAfterRule$1.evaluate(AbstractBeforeAfterRule.java:46)
	at org.apache.lucene.util.TestRuleThreadAndTestName$1.evaluate(TestRuleThreadAndTestName.java:49)
	at org.apache.lucene.util.TestRuleIgnoreAfterMaxFailures$1.evaluate(TestRuleIgnoreAfterMaxFailures.java:65)
	at org.apache.lucene.util.TestRuleMarkFailure$1.evaluate(TestRuleMarkFailure.java:48)
	at com.carrotsearch.randomizedtesting.rules.StatementAdapter.evaluate(StatementAdapter.java:36)
	at com.carrotsearch.randomizedtesting.ThreadLeakControl$StatementRunner.run(ThreadLeakControl.java:365)
	at com.carrotsearch.randomizedtesting.ThreadLeakControl.forkTimeoutingTask(ThreadLeakControl.java:798)
	at com.carrotsearch.randomizedtesting.ThreadLeakControl$3.evaluate(ThreadLeakControl.java:458)
	at com.carrotsearch.randomizedtesting.RandomizedRunner.runSingleTest(RandomizedRunner.java:845)
	at com.carrotsearch.randomizedtesting.RandomizedRunner$3.evaluate(RandomizedRunner.java:747)
	at com.carrotsearch.randomizedtesting.RandomizedRunner$4.evaluate(RandomizedRunner.java:781)
	at com.carrotsearch.randomizedtesting.RandomizedRunner$5.evaluate(RandomizedRunner.java:792)
	at com.carrotsearch.randomizedtesting.rules.StatementAdapter.evaluate(StatementAdapter.java:36)
	at com.carrotsearch.randomizedtesting.rules.SystemPropertiesRestoreRule$1.evaluate(SystemPropertiesRestoreRule.java:53)
	at org.apache.lucene.util.AbstractBeforeAfterRule$1.evaluate(AbstractBeforeAfterRule.java:46)
	at com.carrotsearch.randomizedtesting.rules.StatementAdapter.evaluate(StatementAdapter.java:36)
	at org.apache.lucene.util.TestRuleStoreClassName$1.evaluate(TestRuleStoreClassName.java:42)
	at com.carrotsearch.randomizedtesting.rules.NoShadowingOrOverridesOnMethodsRule$1.evaluate(NoShadowingOrOverridesOnMethodsRule.java:39)
	at com.carrotsearch.randomizedtesting.rules.NoShadowingOrOverridesOnMethodsRule$1.evaluate(NoShadowingOrOverridesOnMethodsRule.java:39)
	at com.carrotsearch.randomizedtesting.rules.StatementAdapter.evaluate(StatementAdapter.java:36)
	at com.carrotsearch.randomizedtesting.rules.StatementAdapter.evaluate(StatementAdapter.java:36)
	at com.carrotsearch.randomizedtesting.rules.StatementAdapter.evaluate(StatementAdapter.java:36)
	at org.apache.lucene.util.TestRuleAssertionsRequired$1.evaluate(TestRuleAssertionsRequired.java:54)
	at org.apache.lucene.util.TestRuleMarkFailure$1.evaluate(TestRuleMarkFailure.java:48)
	at org.apache.lucene.util.TestRuleIgnoreAfterMaxFailures$1.evaluate(TestRuleIgnoreAfterMaxFailures.java:65)
	at org.apache.lucene.util.TestRuleIgnoreTestSuites$1.evaluate(TestRuleIgnoreTestSuites.java:55)
	at com.carrotsearch.randomizedtesting.rules.StatementAdapter.evaluate(StatementAdapter.java:36)
	at com.carrotsearch.randomizedtesting.ThreadLeakControl$StatementRunner.run(ThreadLeakControl.java:365)
	at java.lang.Thread.run(Thread.java:745)
Caused by: java.lang.AssertionError: pivot_ti,pivot_tl,pivot_dt: {params(rows=0),defaults({main({main(rows=0&q=*%3A*&fq=id%3A%5B*+TO+665%5D&stats=true&stats.field=%7B%21key%3Dsk1+tag%3Dst1%2Cst2%7Dpivot_tdt1&stats.field=%7B%21key%3Dsk2+tag%3Dst2%2Cst3%7Dpivot_ti&stats.field=%7B%21key%3Dsk3+tag%3Dst3%2Cst4%7Dpivot_tl1&_test_min=3&_test_miss=true&_test_sort=index),extra(fq=%7B%21term+f%3Dpivot_ti%7D35)}),extra(fq=-pivot_tl%3A%5B*+TO+*%5D)})} expected:<4> but was:<5>
	at org.junit.Assert.fail(Assert.java:93)
	at org.junit.Assert.failNotEquals(Assert.java:647)
	at org.junit.Assert.assertEquals(Assert.java:128)
	at org.junit.Assert.assertEquals(Assert.java:472)
	at org.apache.solr.cloud.TestCloudPivotFacet.assertNumFound(TestCloudPivotFacet.java:677)
	at org.apache.solr.cloud.TestCloudPivotFacet.assertPivotData(TestCloudPivotFacet.java:335)
	at org.apache.solr.cloud.TestCloudPivotFacet.assertPivotCountsAreCorrect(TestCloudPivotFacet.java:302)
	at org.apache.solr.cloud.TestCloudPivotFacet.assertPivotCountsAreCorrect(TestCloudPivotFacet.java:313)
	at org.apache.solr.cloud.TestCloudPivotFacet.assertPivotCountsAreCorrect(TestCloudPivotFacet.java:271)
	... 42 more


FAILED:  org.apache.solr.cloud.LeaderInitiatedRecoveryOnCommitTest.test

Error Message:
IOException occured when talking to server at: http://127.0.0.1:13551/lv_/c8n_1x3_commits_shard1_replica2

Stack Trace:
org.apache.solr.client.solrj.SolrServerException: IOException occured when talking to server at: http://127.0.0.1:13551/lv_/c8n_1x3_commits_shard1_replica2
	at __randomizedtesting.SeedInfo.seed([12A3AA716553D370:9AF795ABCBAFBE88]:0)
	at org.apache.solr.client.solrj.impl.HttpSolrClient.executeMethod(HttpSolrClient.java:570)
	at org.apache.solr.client.solrj.impl.HttpSolrClient.request(HttpSolrClient.java:233)
	at org.apache.solr.client.solrj.impl.HttpSolrClient.request(HttpSolrClient.java:225)
	at org.apache.solr.client.solrj.SolrRequest.process(SolrRequest.java:135)
	at org.apache.solr.client.solrj.SolrClient.commit(SolrClient.java:483)
	at org.apache.solr.client.solrj.SolrClient.commit(SolrClient.java:464)
	at org.apache.solr.cloud.LeaderInitiatedRecoveryOnCommitTest.oneShardTest(LeaderInitiatedRecoveryOnCommitTest.java:132)
	at org.apache.solr.cloud.LeaderInitiatedRecoveryOnCommitTest.test(LeaderInitiatedRecoveryOnCommitTest.java:64)
	at sun.reflect.NativeMethodAccessorImpl.invoke0(Native Method)
	at sun.reflect.NativeMethodAccessorImpl.invoke(NativeMethodAccessorImpl.java:57)
	at sun.reflect.DelegatingMethodAccessorImpl.invoke(DelegatingMethodAccessorImpl.java:43)
	at java.lang.reflect.Method.invoke(Method.java:606)
	at com.carrotsearch.randomizedtesting.RandomizedRunner.invoke(RandomizedRunner.java:1627)
	at com.carrotsearch.randomizedtesting.RandomizedRunner$6.evaluate(RandomizedRunner.java:836)
	at com.carrotsearch.randomizedtesting.RandomizedRunner$7.evaluate(RandomizedRunner.java:872)
	at com.carrotsearch.randomizedtesting.RandomizedRunner$8.evaluate(RandomizedRunner.java:886)
	at org.apache.solr.BaseDistributedSearchTestCase$ShardsRepeatRule$ShardsFixedStatement.callStatement(BaseDistributedSearchTestCase.java:960)
	at org.apache.solr.BaseDistributedSearchTestCase$ShardsRepeatRule$ShardsStatement.evaluate(BaseDistributedSearchTestCase.java:935)
	at com.carrotsearch.randomizedtesting.rules.SystemPropertiesRestoreRule$1.evaluate(SystemPropertiesRestoreRule.java:53)
	at org.apache.lucene.util.TestRuleSetupTeardownChained$1.evaluate(TestRuleSetupTeardownChained.java:50)
	at org.apache.lucene.util.AbstractBeforeAfterRule$1.evaluate(AbstractBeforeAfterRule.java:46)
	at org.apache.lucene.util.TestRuleThreadAndTestName$1.evaluate(TestRuleThreadAndTestName.java:49)
	at org.apache.lucene.util.TestRuleIgnoreAfterMaxFailures$1.evaluate(TestRuleIgnoreAfterMaxFailures.java:65)
	at org.apache.lucene.util.TestRuleMarkFailure$1.evaluate(TestRuleMarkFailure.java:48)
	at com.carrotsearch.randomizedtesting.rules.StatementAdapter.evaluate(StatementAdapter.java:36)
	at com.carrotsearch.randomizedtesting.ThreadLeakControl$StatementRunner.run(ThreadLeakControl.java:365)
	at com.carrotsearch.randomizedtesting.ThreadLeakControl.forkTimeoutingTask(ThreadLeakControl.java:798)
	at com.carrotsearch.randomizedtesting.ThreadLeakControl$3.evaluate(ThreadLeakControl.java:458)
	at com.carrotsearch.randomizedtesting.RandomizedRunner.runSingleTest(RandomizedRunner.java:845)
	at com.carrotsearch.randomizedtesting.RandomizedRunner$3.evaluate(RandomizedRunner.java:747)
	at com.carrotsearch.randomizedtesting.RandomizedRunner$4.evaluate(RandomizedRunner.java:781)
	at com.carrotsearch.randomizedtesting.RandomizedRunner$5.evaluate(RandomizedRunner.java:792)
	at com.carrotsearch.randomizedtesting.rules.StatementAdapter.evaluate(StatementAdapter.java:36)
	at com.carrotsearch.randomizedtesting.rules.SystemPropertiesRestoreRule$1.evaluate(SystemPropertiesRestoreRule.java:53)
	at org.apache.lucene.util.AbstractBeforeAfterRule$1.evaluate(AbstractBeforeAfterRule.java:46)
	at com.carrotsearch.randomizedtesting.rules.StatementAdapter.evaluate(StatementAdapter.java:36)
	at org.apache.lucene.util.TestRuleStoreClassName$1.evaluate(TestRuleStoreClassName.java:42)
	at com.carrotsearch.randomizedtesting.rules.NoShadowingOrOverridesOnMethodsRule$1.evaluate(NoShadowingOrOverridesOnMethodsRule.java:39)
	at com.carrotsearch.randomizedtesting.rules.NoShadowingOrOverridesOnMethodsRule$1.evaluate(NoShadowingOrOverridesOnMethodsRule.java:39)
	at com.carrotsearch.randomizedtesting.rules.StatementAdapter.evaluate(StatementAdapter.java:36)
	at com.carrotsearch.randomizedtesting.rules.StatementAdapter.evaluate(StatementAdapter.java:36)
	at com.carrotsearch.randomizedtesting.rules.StatementAdapter.evaluate(StatementAdapter.java:36)
	at org.apache.lucene.util.TestRuleAssertionsRequired$1.evaluate(TestRuleAssertionsRequired.java:54)
	at org.apache.lucene.util.TestRuleMarkFailure$1.evaluate(TestRuleMarkFailure.java:48)
	at org.apache.lucene.util.TestRuleIgnoreAfterMaxFailures$1.evaluate(TestRuleIgnoreAfterMaxFailures.java:65)
	at org.apache.lucene.util.TestRuleIgnoreTestSuites$1.evaluate(TestRuleIgnoreTestSuites.java:55)
	at com.carrotsearch.randomizedtesting.rules.StatementAdapter.evaluate(StatementAdapter.java:36)
	at com.carrotsearch.randomizedtesting.ThreadLeakControl$StatementRunner.run(ThreadLeakControl.java:365)
	at java.lang.Thread.run(Thread.java:745)
Caused by: org.apache.http.NoHttpResponseException: 127.0.0.1:13551 failed to respond
	at org.apache.http.impl.conn.DefaultHttpResponseParser.parseHead(DefaultHttpResponseParser.java:143)
	at org.apache.http.impl.conn.DefaultHttpResponseParser.parseHead(DefaultHttpResponseParser.java:57)
	at org.apache.http.impl.io.AbstractMessageParser.parse(AbstractMessageParser.java:261)
	at org.apache.http.impl.AbstractHttpClientConnection.receiveResponseHeader(AbstractHttpClientConnection.java:283)
	at org.apache.http.impl.conn.DefaultClientConnection.receiveResponseHeader(DefaultClientConnection.java:251)
	at org.apache.http.impl.conn.ManagedClientConnectionImpl.receiveResponseHeader(ManagedClientConnectionImpl.java:197)
	at org.apache.http.protocol.HttpRequestExecutor.doReceiveResponse(HttpRequestExecutor.java:272)
	at org.apache.http.protocol.HttpRequestExecutor.execute(HttpRequestExecutor.java:124)
	at org.apache.http.impl.client.DefaultRequestDirector.tryExecute(DefaultRequestDirector.java:685)
	at org.apache.http.impl.client.DefaultRequestDirector.execute(DefaultRequestDirector.java:487)
	at org.apache.http.impl.client.AbstractHttpClient.doExecute(AbstractHttpClient.java:882)
	at org.apache.http.impl.client.CloseableHttpClient.execute(CloseableHttpClient.java:82)
	at org.apache.http.impl.client.CloseableHttpClient.execute(CloseableHttpClient.java:107)
	at org.apache.http.impl.client.CloseableHttpClient.execute(CloseableHttpClient.java:55)
	at org.apache.solr.client.solrj.impl.HttpSolrClient.executeMethod(HttpSolrClient.java:462)
	... 48 more


FAILED:  org.apache.solr.cloud.RecoveryAfterSoftCommitTest.test

Error Message:
org.apache.solr.client.solrj.SolrServerException: IOException occured when talking to server at: http://127.0.0.1:13793/collection1

Stack Trace:
org.apache.solr.client.solrj.SolrServerException: org.apache.solr.client.solrj.SolrServerException: IOException occured when talking to server at: http://127.0.0.1:13793/collection1
	at __randomizedtesting.SeedInfo.seed([12A3AA716553D370:9AF795ABCBAFBE88]:0)
	at org.apache.solr.client.solrj.impl.CloudSolrClient.directUpdate(CloudSolrClient.java:625)
	at org.apache.solr.client.solrj.impl.CloudSolrClient.sendRequest(CloudSolrClient.java:948)
	at org.apache.solr.client.solrj.impl.CloudSolrClient.requestWithRetryOnStaleState(CloudSolrClient.java:839)
	at org.apache.solr.client.solrj.impl.CloudSolrClient.request(CloudSolrClient.java:782)
	at org.apache.solr.client.solrj.SolrRequest.process(SolrRequest.java:135)
	at org.apache.solr.client.solrj.SolrClient.add(SolrClient.java:174)
	at org.apache.solr.client.solrj.SolrClient.add(SolrClient.java:139)
	at org.apache.solr.client.solrj.SolrClient.add(SolrClient.java:153)
	at org.apache.solr.cloud.RecoveryAfterSoftCommitTest.test(RecoveryAfterSoftCommitTest.java:88)
	at sun.reflect.NativeMethodAccessorImpl.invoke0(Native Method)
	at sun.reflect.NativeMethodAccessorImpl.invoke(NativeMethodAccessorImpl.java:57)
	at sun.reflect.DelegatingMethodAccessorImpl.invoke(DelegatingMethodAccessorImpl.java:43)
	at java.lang.reflect.Method.invoke(Method.java:606)
	at com.carrotsearch.randomizedtesting.RandomizedRunner.invoke(RandomizedRunner.java:1627)
	at com.carrotsearch.randomizedtesting.RandomizedRunner$6.evaluate(RandomizedRunner.java:836)
	at com.carrotsearch.randomizedtesting.RandomizedRunner$7.evaluate(RandomizedRunner.java:872)
	at com.carrotsearch.randomizedtesting.RandomizedRunner$8.evaluate(RandomizedRunner.java:886)
	at org.apache.solr.BaseDistributedSearchTestCase$ShardsRepeatRule$ShardsFixedStatement.callStatement(BaseDistributedSearchTestCase.java:960)
	at org.apache.solr.BaseDistributedSearchTestCase$ShardsRepeatRule$ShardsStatement.evaluate(BaseDistributedSearchTestCase.java:935)
	at com.carrotsearch.randomizedtesting.rules.SystemPropertiesRestoreRule$1.evaluate(SystemPropertiesRestoreRule.java:53)
	at org.apache.lucene.util.TestRuleSetupTeardownChained$1.evaluate(TestRuleSetupTeardownChained.java:50)
	at org.apache.lucene.util.AbstractBeforeAfterRule$1.evaluate(AbstractBeforeAfterRule.java:46)
	at org.apache.lucene.util.TestRuleThreadAndTestName$1.evaluate(TestRuleThreadAndTestName.java:49)
	at org.apache.lucene.util.TestRuleIgnoreAfterMaxFailures$1.evaluate(TestRuleIgnoreAfterMaxFailures.java:65)
	at org.apache.lucene.util.TestRuleMarkFailure$1.evaluate(TestRuleMarkFailure.java:48)
	at com.carrotsearch.randomizedtesting.rules.StatementAdapter.evaluate(StatementAdapter.java:36)
	at com.carrotsearch.randomizedtesting.ThreadLeakControl$StatementRunner.run(ThreadLeakControl.java:365)
	at com.carrotsearch.randomizedtesting.ThreadLeakControl.forkTimeoutingTask(ThreadLeakControl.java:798)
	at com.carrotsearch.randomizedtesting.ThreadLeakControl$3.evaluate(ThreadLeakControl.java:458)
	at com.carrotsearch.randomizedtesting.RandomizedRunner.runSingleTest(RandomizedRunner.java:845)
	at com.carrotsearch.randomizedtesting.RandomizedRunner$3.evaluate(RandomizedRunner.java:747)
	at com.carrotsearch.randomizedtesting.RandomizedRunner$4.evaluate(RandomizedRunner.java:781)
	at com.carrotsearch.randomizedtesting.RandomizedRunner$5.evaluate(RandomizedRunner.java:792)
	at com.carrotsearch.randomizedtesting.rules.StatementAdapter.evaluate(StatementAdapter.java:36)
	at com.carrotsearch.randomizedtesting.rules.SystemPropertiesRestoreRule$1.evaluate(SystemPropertiesRestoreRule.java:53)
	at org.apache.lucene.util.AbstractBeforeAfterRule$1.evaluate(AbstractBeforeAfterRule.java:46)
	at com.carrotsearch.randomizedtesting.rules.StatementAdapter.evaluate(StatementAdapter.java:36)
	at org.apache.lucene.util.TestRuleStoreClassName$1.evaluate(TestRuleStoreClassName.java:42)
	at com.carrotsearch.randomizedtesting.rules.NoShadowingOrOverridesOnMethodsRule$1.evaluate(NoShadowingOrOverridesOnMethodsRule.java:39)
	at com.carrotsearch.randomizedtesting.rules.NoShadowingOrOverridesOnMethodsRule$1.evaluate(NoShadowingOrOverridesOnMethodsRule.java:39)
	at com.carrotsearch.randomizedtesting.rules.StatementAdapter.evaluate(StatementAdapter.java:36)
	at com.carrotsearch.randomizedtesting.rules.StatementAdapter.evaluate(StatementAdapter.java:36)
	at com.carrotsearch.randomizedtesting.rules.StatementAdapter.evaluate(StatementAdapter.java:36)
	at org.apache.lucene.util.TestRuleAssertionsRequired$1.evaluate(TestRuleAssertionsRequired.java:54)
	at org.apache.lucene.util.TestRuleMarkFailure$1.evaluate(TestRuleMarkFailure.java:48)
	at org.apache.lucene.util.TestRuleIgnoreAfterMaxFailures$1.evaluate(TestRuleIgnoreAfterMaxFailures.java:65)
	at org.apache.lucene.util.TestRuleIgnoreTestSuites$1.evaluate(TestRuleIgnoreTestSuites.java:55)
	at com.carrotsearch.randomizedtesting.rules.StatementAdapter.evaluate(StatementAdapter.java:36)
	at com.carrotsearch.randomizedtesting.ThreadLeakControl$StatementRunner.run(ThreadLeakControl.java:365)
	at java.lang.Thread.run(Thread.java:745)
Caused by: org.apache.solr.client.solrj.SolrServerException: IOException occured when talking to server at: http://127.0.0.1:13793/collection1
	at org.apache.solr.client.solrj.impl.HttpSolrClient.executeMethod(HttpSolrClient.java:570)
	at org.apache.solr.client.solrj.impl.HttpSolrClient.request(HttpSolrClient.java:233)
	at org.apache.solr.client.solrj.impl.HttpSolrClient.request(HttpSolrClient.java:225)
	at org.apache.solr.client.solrj.impl.LBHttpSolrClient.doRequest(LBHttpSolrClient.java:370)
	at org.apache.solr.client.solrj.impl.LBHttpSolrClient.request(LBHttpSolrClient.java:325)
	at org.apache.solr.client.solrj.impl.CloudSolrClient.directUpdate(CloudSolrClient.java:622)
	... 49 more
Caused by: org.apache.http.NoHttpResponseException: 127.0.0.1:13793 failed to respond
	at org.apache.http.impl.conn.DefaultHttpResponseParser.parseHead(DefaultHttpResponseParser.java:143)
	at org.apache.http.impl.conn.DefaultHttpResponseParser.parseHead(DefaultHttpResponseParser.java:57)
	at org.apache.http.impl.io.AbstractMessageParser.parse(AbstractMessageParser.java:261)
	at org.apache.http.impl.AbstractHttpClientConnection.receiveResponseHeader(AbstractHttpClientConnection.java:283)
	at org.apache.http.impl.conn.DefaultClientConnection.receiveResponseHeader(DefaultClientConnection.java:251)
	at org.apache.http.impl.conn.ManagedClientConnectionImpl.receiveResponseHeader(ManagedClientConnectionImpl.java:197)
	at org.apache.http.protocol.HttpRequestExecutor.doReceiveResponse(HttpRequestExecutor.java:272)
	at org.apache.http.protocol.HttpRequestExecutor.execute(HttpRequestExecutor.java:124)
	at org.apache.http.impl.client.DefaultRequestDirector.tryExecute(DefaultRequestDirector.java:685)
	at org.apache.http.impl.client.DefaultRequestDirector.execute(DefaultRequestDirector.java:487)
	at org.apache.http.impl.client.AbstractHttpClient.doExecute(AbstractHttpClient.java:882)
	at org.apache.http.impl.client.CloseableHttpClient.execute(CloseableHttpClient.java:82)
	at org.apache.http.impl.client.CloseableHttpClient.execute(CloseableHttpClient.java:107)
	at org.apache.http.impl.client.CloseableHttpClient.execute(CloseableHttpClient.java:55)
	at org.apache.solr.client.solrj.impl.HttpSolrClient.executeMethod(HttpSolrClient.java:462)
	... 54 more


FAILED:  org.apache.solr.cloud.ReplicationFactorTest.test

Error Message:
org.apache.solr.client.solrj.SolrServerException: IOException occured when talking to server at: http://127.0.0.1:58620/repfacttest_c8n_1x3_shard1_replica3

Stack Trace:
org.apache.solr.client.solrj.SolrServerException: org.apache.solr.client.solrj.SolrServerException: IOException occured when talking to server at: http://127.0.0.1:58620/repfacttest_c8n_1x3_shard1_replica3
	at __randomizedtesting.SeedInfo.seed([12A3AA716553D370:9AF795ABCBAFBE88]:0)
	at org.apache.solr.client.solrj.impl.CloudSolrClient.directUpdate(CloudSolrClient.java:625)
	at org.apache.solr.client.solrj.impl.CloudSolrClient.sendRequest(CloudSolrClient.java:948)
	at org.apache.solr.client.solrj.impl.CloudSolrClient.requestWithRetryOnStaleState(CloudSolrClient.java:839)
	at org.apache.solr.client.solrj.impl.CloudSolrClient.request(CloudSolrClient.java:782)
	at org.apache.solr.client.solrj.SolrClient.request(SolrClient.java:1220)
	at org.apache.solr.cloud.ReplicationFactorTest.sendDoc(ReplicationFactorTest.java:308)
	at org.apache.solr.cloud.ReplicationFactorTest.testRf3(ReplicationFactorTest.java:234)
	at org.apache.solr.cloud.ReplicationFactorTest.test(ReplicationFactorTest.java:113)
	at sun.reflect.NativeMethodAccessorImpl.invoke0(Native Method)
	at sun.reflect.NativeMethodAccessorImpl.invoke(NativeMethodAccessorImpl.java:57)
	at sun.reflect.DelegatingMethodAccessorImpl.invoke(DelegatingMethodAccessorImpl.java:43)
	at java.lang.reflect.Method.invoke(Method.java:606)
	at com.carrotsearch.randomizedtesting.RandomizedRunner.invoke(RandomizedRunner.java:1627)
	at com.carrotsearch.randomizedtesting.RandomizedRunner$6.evaluate(RandomizedRunner.java:836)
	at com.carrotsearch.randomizedtesting.RandomizedRunner$7.evaluate(RandomizedRunner.java:872)
	at com.carrotsearch.randomizedtesting.RandomizedRunner$8.evaluate(RandomizedRunner.java:886)
	at org.apache.solr.BaseDistributedSearchTestCase$ShardsRepeatRule$ShardsFixedStatement.callStatement(BaseDistributedSearchTestCase.java:960)
	at org.apache.solr.BaseDistributedSearchTestCase$ShardsRepeatRule$ShardsStatement.evaluate(BaseDistributedSearchTestCase.java:935)
	at com.carrotsearch.randomizedtesting.rules.SystemPropertiesRestoreRule$1.evaluate(SystemPropertiesRestoreRule.java:53)
	at org.apache.lucene.util.TestRuleSetupTeardownChained$1.evaluate(TestRuleSetupTeardownChained.java:50)
	at org.apache.lucene.util.AbstractBeforeAfterRule$1.evaluate(AbstractBeforeAfterRule.java:46)
	at org.apache.lucene.util.TestRuleThreadAndTestName$1.evaluate(TestRuleThreadAndTestName.java:49)
	at org.apache.lucene.util.TestRuleIgnoreAfterMaxFailures$1.evaluate(TestRuleIgnoreAfterMaxFailures.java:65)
	at org.apache.lucene.util.TestRuleMarkFailure$1.evaluate(TestRuleMarkFailure.java:48)
	at com.carrotsearch.randomizedtesting.rules.StatementAdapter.evaluate(StatementAdapter.java:36)
	at com.carrotsearch.randomizedtesting.ThreadLeakControl$StatementRunner.run(ThreadLeakControl.java:365)
	at com.carrotsearch.randomizedtesting.ThreadLeakControl.forkTimeoutingTask(ThreadLeakControl.java:798)
	at com.carrotsearch.randomizedtesting.ThreadLeakControl$3.evaluate(ThreadLeakControl.java:458)
	at com.carrotsearch.randomizedtesting.RandomizedRunner.runSingleTest(RandomizedRunner.java:845)
	at com.carrotsearch.randomizedtesting.RandomizedRunner$3.evaluate(RandomizedRunner.java:747)
	at com.carrotsearch.randomizedtesting.RandomizedRunner$4.evaluate(RandomizedRunner.java:781)
	at com.carrotsearch.randomizedtesting.RandomizedRunner$5.evaluate(RandomizedRunner.java:792)
	at com.carrotsearch.randomizedtesting.rules.StatementAdapter.evaluate(StatementAdapter.java:36)
	at com.carrotsearch.randomizedtesting.rules.SystemPropertiesRestoreRule$1.evaluate(SystemPropertiesRestoreRule.java:53)
	at org.apache.lucene.util.AbstractBeforeAfterRule$1.evaluate(AbstractBeforeAfterRule.java:46)
	at com.carrotsearch.randomizedtesting.rules.StatementAdapter.evaluate(StatementAdapter.java:36)
	at org.apache.lucene.util.TestRuleStoreClassName$1.evaluate(TestRuleStoreClassName.java:42)
	at com.carrotsearch.randomizedtesting.rules.NoShadowingOrOverridesOnMethodsRule$1.evaluate(NoShadowingOrOverridesOnMethodsRule.java:39)
	at com.carrotsearch.randomizedtesting.rules.NoShadowingOrOverridesOnMethodsRule$1.evaluate(NoShadowingOrOverridesOnMethodsRule.java:39)
	at com.carrotsearch.randomizedtesting.rules.StatementAdapter.evaluate(StatementAdapter.java:36)
	at com.carrotsearch.randomizedtesting.rules.StatementAdapter.evaluate(StatementAdapter.java:36)
	at com.carrotsearch.randomizedtesting.rules.StatementAdapter.evaluate(StatementAdapter.java:36)
	at org.apache.lucene.util.TestRuleAssertionsRequired$1.evaluate(TestRuleAssertionsRequired.java:54)
	at org.apache.lucene.util.TestRuleMarkFailure$1.evaluate(TestRuleMarkFailure.java:48)
	at org.apache.lucene.util.TestRuleIgnoreAfterMaxFailures$1.evaluate(TestRuleIgnoreAfterMaxFailures.java:65)
	at org.apache.lucene.util.TestRuleIgnoreTestSuites$1.evaluate(TestRuleIgnoreTestSuites.java:55)
	at com.carrotsearch.randomizedtesting.rules.StatementAdapter.evaluate(StatementAdapter.java:36)
	at com.carrotsearch.randomizedtesting.ThreadLeakControl$StatementRunner.run(ThreadLeakControl.java:365)
	at java.lang.Thread.run(Thread.java:745)
Caused by: org.apache.solr.client.solrj.SolrServerException: IOException occured when talking to server at: http://127.0.0.1:58620/repfacttest_c8n_1x3_shard1_replica3
	at org.apache.solr.client.solrj.impl.HttpSolrClient.executeMethod(HttpSolrClient.java:570)
	at org.apache.solr.client.solrj.impl.HttpSolrClient.request(HttpSolrClient.java:233)
	at org.apache.solr.client.solrj.impl.HttpSolrClient.request(HttpSolrClient.java:225)
	at org.apache.solr.client.solrj.impl.LBHttpSolrClient.doRequest(LBHttpSolrClient.java:370)
	at org.apache.solr.client.solrj.impl.LBHttpSolrClient.request(LBHttpSolrClient.java:325)
	at org.apache.solr.client.solrj.impl.CloudSolrClient.directUpdate(CloudSolrClient.java:622)
	... 48 more
Caused by: org.apache.http.NoHttpResponseException: 127.0.0.1:58620 failed to respond
	at org.apache.http.impl.conn.DefaultHttpResponseParser.parseHead(DefaultHttpResponseParser.java:143)
	at org.apache.http.impl.conn.DefaultHttpResponseParser.parseHead(DefaultHttpResponseParser.java:57)
	at org.apache.http.impl.io.AbstractMessageParser.parse(AbstractMessageParser.java:261)
	at org.apache.http.impl.AbstractHttpClientConnection.receiveResponseHeader(AbstractHttpClientConnection.java:283)
	at org.apache.http.impl.conn.DefaultClientConnection.receiveResponseHeader(DefaultClientConnection.java:251)
	at org.apache.http.impl.conn.ManagedClientConnectionImpl.receiveResponseHeader(ManagedClientConnectionImpl.java:197)
	at org.apache.http.protocol.HttpRequestExecutor.doReceiveResponse(HttpRequestExecutor.java:272)
	at org.apache.http.protocol.HttpRequestExecutor.execute(HttpRequestExecutor.java:124)
	at org.apache.http.impl.client.DefaultRequestDirector.tryExecute(DefaultRequestDirector.java:685)
	at org.apache.http.impl.client.DefaultRequestDirector.execute(DefaultRequestDirector.java:487)
	at org.apache.http.impl.client.AbstractHttpClient.doExecute(AbstractHttpClient.java:882)
	at org.apache.http.impl.client.CloseableHttpClient.execute(CloseableHttpClient.java:82)
	at org.apache.http.impl.client.CloseableHttpClient.execute(CloseableHttpClient.java:107)
	at org.apache.http.impl.client.CloseableHttpClient.execute(CloseableHttpClient.java:55)
	at org.apache.solr.client.solrj.impl.HttpSolrClient.executeMethod(HttpSolrClient.java:462)
	... 53 more




Build Log:
[...truncated 9791 lines...]
   [junit4] Suite: org.apache.solr.cloud.ReplicationFactorTest
   [junit4]   2> Creating dataDir: /usr/home/jenkins/jenkins-slave/workspace/Lucene-Solr-Tests-5.x-Java7/solr/build/solr-core/test/J0/temp/solr.cloud.ReplicationFactorTest 12A3AA716553D370-001/init-core-data-001
   [junit4]   2> 669602 T2624 oas.BaseDistributedSearchTestCase.initHostContext Setting hostContext system property: /
   [junit4]   2> 669607 T2624 oasc.ZkTestServer.run STARTING ZK TEST SERVER
   [junit4]   1> client port:0.0.0.0/0.0.0.0:0
   [junit4]   2> 669607 T2625 oasc.ZkTestServer$ZKServerMain.runFromConfig Starting server
   [junit4]   2> 669707 T2624 oasc.ZkTestServer.run start zk server on port:58617
   [junit4]   2> 669708 T2624 oascc.SolrZkClient.createZkCredentialsToAddAutomatically Using default ZkCredentialsProvider
   [junit4]   2> 669709 T2624 oascc.ConnectionManager.waitForConnected Waiting for client to connect to ZooKeeper
   [junit4]   2> 669712 T2632 oascc.ConnectionManager.process Watcher org.apache.solr.common.cloud.ConnectionManager@7172a99e name:ZooKeeperConnection Watcher:127.0.0.1:58617 got event WatchedEvent state:SyncConnected type:None path:null path:null type:None
   [junit4]   2> 669712 T2624 oascc.ConnectionManager.waitForConnected Client is connected to ZooKeeper
   [junit4]   2> 669713 T2624 oascc.SolrZkClient.createZkACLProvider Using default ZkACLProvider
   [junit4]   2> 669713 T2624 oascc.SolrZkClient.makePath makePath: /solr
   [junit4]   2> 669715 T2624 oascc.SolrZkClient.createZkCredentialsToAddAutomatically Using default ZkCredentialsProvider
   [junit4]   2> 669716 T2624 oascc.ConnectionManager.waitForConnected Waiting for client to connect to ZooKeeper
   [junit4]   2> 669717 T2635 oascc.ConnectionManager.process Watcher org.apache.solr.common.cloud.ConnectionManager@4575d7f2 name:ZooKeeperConnection Watcher:127.0.0.1:58617/solr got event WatchedEvent state:SyncConnected type:None path:null path:null type:None
   [junit4]   2> 669717 T2624 oascc.ConnectionManager.waitForConnected Client is connected to ZooKeeper
   [junit4]   2> 669718 T2624 oascc.SolrZkClient.createZkACLProvider Using default ZkACLProvider
   [junit4]   2> 669718 T2624 oascc.SolrZkClient.makePath makePath: /collections/collection1
   [junit4]   2> 669720 T2624 oascc.SolrZkClient.makePath makePath: /collections/collection1/shards
   [junit4]   2> 669721 T2624 oascc.SolrZkClient.makePath makePath: /collections/control_collection
   [junit4]   2> 669722 T2624 oascc.SolrZkClient.makePath makePath: /collections/control_collection/shards
   [junit4]   2> 669724 T2624 oasc.AbstractZkTestCase.putConfig put /usr/home/jenkins/jenkins-slave/workspace/Lucene-Solr-Tests-5.x-Java7/solr/core/src/test-files/solr/collection1/conf/solrconfig-tlog.xml to /configs/conf1/solrconfig.xml
   [junit4]   2> 669724 T2624 oascc.SolrZkClient.makePath makePath: /configs/conf1/solrconfig.xml
   [junit4]   2> 669726 T2624 oasc.AbstractZkTestCase.putConfig put /usr/home/jenkins/jenkins-slave/workspace/Lucene-Solr-Tests-5.x-Java7/solr/core/src/test-files/solr/collection1/conf/schema.xml to /configs/conf1/schema.xml
   [junit4]   2> 669726 T2624 oascc.SolrZkClient.makePath makePath: /configs/conf1/schema.xml
   [junit4]   2> 669829 T2624 oasc.AbstractZkTestCase.putConfig put /usr/home/jenkins/jenkins-slave/workspace/Lucene-Solr-Tests-5.x-Java7/solr/core/src/test-files/solr/collection1/conf/solrconfig.snippet.randomindexconfig.xml to /configs/conf1/solrconfig.snippet.randomindexconfig.xml
   [junit4]   2> 669829 T2624 oascc.SolrZkClient.makePath makePath: /configs/conf1/solrconfig.snippet.randomindexconfig.xml
   [junit4]   2> 669831 T2624 oasc.AbstractZkTestCase.putConfig put /usr/home/jenkins/jenkins-slave/workspace/Lucene-Solr-Tests-5.x-Java7/solr/core/src/test-files/solr/collection1/conf/stopwords.txt to /configs/conf1/stopwords.txt
   [junit4]   2> 669831 T2624 oascc.SolrZkClient.makePath makePath: /configs/conf1/stopwords.txt
   [junit4]   2> 669832 T2624 oasc.AbstractZkTestCase.putConfig put /usr/home/jenkins/jenkins-slave/workspace/Lucene-Solr-Tests-5.x-Java7/solr/core/src/test-files/solr/collection1/conf/protwords.txt to /configs/conf1/protwords.txt
   [junit4]   2> 669833 T2624 oascc.SolrZkClient.makePath makePath: /configs/conf1/protwords.txt
   [junit4]   2> 669834 T2624 oasc.AbstractZkTestCase.putConfig put /usr/home/jenkins/jenkins-slave/workspace/Lucene-Solr-Tests-5.x-Java7/solr/core/src/test-files/solr/collection1/conf/currency.xml to /configs/conf1/currency.xml
   [junit4]   2> 669834 T2624 oascc.SolrZkClient.makePath makePath: /configs/conf1/currency.xml
   [junit4]   2> 669836 T2624 oasc.AbstractZkTestCase.putConfig put /usr/home/jenkins/jenkins-slave/workspace/Lucene-Solr-Tests-5.x-Java7/solr/core/src/test-files/solr/collection1/conf/enumsConfig.xml to /configs/conf1/enumsConfig.xml
   [junit4]   2> 669836 T2624 oascc.SolrZkClient.makePath makePath: /configs/conf1/enumsConfig.xml
   [junit4]   2> 669837 T2624 oasc.AbstractZkTestCase.putConfig put /usr/home/jenkins/jenkins-slave/workspace/Lucene-Solr-Tests-5.x-Java7/solr/core/src/test-files/solr/collection1/conf/open-exchange-rates.json to /configs/conf1/open-exchange-rates.json
   [junit4]   2> 669838 T2624 oascc.SolrZkClient.makePath makePath: /configs/conf1/open-exchange-rates.json
   [junit4]   2> 669839 T2624 oasc.AbstractZkTestCase.putConfig put /usr/home/jenkins/jenkins-slave/workspace/Lucene-Solr-Tests-5.x-Java7/solr/core/src/test-files/solr/collection1/conf/mapping-ISOLatin1Accent.txt to /configs/conf1/mapping-ISOLatin1Accent.txt
   [junit4]   2> 669839 T2624 oascc.SolrZkClient.makePath makePath: /configs/conf1/mapping-ISOLatin1Accent.txt
   [junit4]   2> 669841 T2624 oasc.AbstractZkTestCase.putConfig put /usr/home/jenkins/jenkins-slave/workspace/Lucene-Solr-Tests-5.x-Java7/solr/core/src/test-files/solr/collection1/conf/old_synonyms.txt to /configs/conf1/old_synonyms.txt
   [junit4]   2> 669841 T2624 oascc.SolrZkClient.makePath makePath: /configs/conf1/old_synonyms.txt
   [junit4]   2> 669842 T2624 oasc.AbstractZkTestCase.putConfig put /usr/home/jenkins/jenkins-slave/workspace/Lucene-Solr-Tests-5.x-Java7/solr/core/src/test-files/solr/collection1/conf/synonyms.txt to /configs/conf1/synonyms.txt
   [junit4]   2> 669843 T2624 oascc.SolrZkClient.makePath makePath: /configs/conf1/synonyms.txt
   [junit4]   2> 670822 T2624 oas.SolrTestCaseJ4.writeCoreProperties Writing core.properties file to /usr/home/jenkins/jenkins-slave/workspace/Lucene-Solr-Tests-5.x-Java7/solr/build/solr-core/test/J0/temp/solr.cloud.ReplicationFactorTest 12A3AA716553D370-001/control-001/cores/collection1
   [junit4]   2> 670826 T2624 oejs.Server.doStart jetty-8.1.10.v20130312
   [junit4]   2> 670828 T2624 oejs.AbstractConnector.doStart Started SocketConnector@127.0.0.1:58621
   [junit4]   2> 670829 T2624 oascse.JettySolrRunner$1.lifeCycleStarted Jetty properties: {solr.data.dir=/usr/home/jenkins/jenkins-slave/workspace/Lucene-Solr-Tests-5.x-Java7/solr/build/solr-core/test/J0/temp/solr.cloud.ReplicationFactorTest 12A3AA716553D370-001/tempDir-001/control/data, hostPort=58620, hostContext=/, coreRootDirectory=/usr/home/jenkins/jenkins-slave/workspace/Lucene-Solr-Tests-5.x-Java7/solr/build/solr-core/test/J0/temp/solr.cloud.ReplicationFactorTest 12A3AA716553D370-001/control-001/cores}
   [junit4]   2> 670829 T2624 oass.SolrDispatchFilter.init SolrDispatchFilter.init()sun.misc.Launcher$AppClassLoader@631d75b9
   [junit4]   2> 670830 T2624 oasc.SolrResourceLoader.<init> new SolrResourceLoader for directory: '/usr/home/jenkins/jenkins-slave/workspace/Lucene-Solr-Tests-5.x-Java7/solr/build/solr-core/test/J0/temp/solr.cloud.ReplicationFactorTest 12A3AA716553D370-001/control-001/'
   [junit4]   2> 670863 T2624 oasc.SolrXmlConfig.fromFile Loading container configuration from /usr/home/jenkins/jenkins-slave/workspace/Lucene-Solr-Tests-5.x-Java7/solr/build/solr-core/test/J0/temp/solr.cloud.ReplicationFactorTest 12A3AA716553D370-001/control-001/solr.xml
   [junit4]   2> 670905 T2624 oasc.CorePropertiesLocator.<init> Config-defined core root directory: /usr/home/jenkins/jenkins-slave/workspace/Lucene-Solr-Tests-5.x-Java7/solr/build/solr-core/test/J0/temp/solr.cloud.ReplicationFactorTest 12A3AA716553D370-001/control-001/cores
   [junit4]   2> 670905 T2624 oasc.CoreContainer.<init> New CoreContainer 54629337
   [junit4]   2> 670905 T2624 oasc.CoreContainer.load Loading cores into CoreContainer [instanceDir=/usr/home/jenkins/jenkins-slave/workspace/Lucene-Solr-Tests-5.x-Java7/solr/build/solr-core/test/J0/temp/solr.cloud.ReplicationFactorTest 12A3AA716553D370-001/control-001/]
   [junit4]   2> 670906 T2624 oasc.CoreContainer.load loading shared library: /usr/home/jenkins/jenkins-slave/workspace/Lucene-Solr-Tests-5.x-Java7/solr/build/solr-core/test/J0/temp/solr.cloud.ReplicationFactorTest 12A3AA716553D370-001/control-001/lib
   [junit4]   2> 670906 T2624 oasc.SolrResourceLoader.addToClassLoader WARN Can't find (or read) directory to add to classloader: lib (resolved as: /usr/home/jenkins/jenkins-slave/workspace/Lucene-Solr-Tests-5.x-Java7/solr/build/solr-core/test/J0/temp/solr.cloud.ReplicationFactorTest 12A3AA716553D370-001/control-001/lib).
   [junit4]   2> 670916 T2624 oashc.HttpShardHandlerFactory.getParameter Setting socketTimeout to: 90000
   [junit4]   2> 670917 T2624 oashc.HttpShardHandlerFactory.getParameter Setting urlScheme to: 
   [junit4]   2> 670917 T2624 oashc.HttpShardHandlerFactory.getParameter Setting connTimeout to: 15000
   [junit4]   2> 670917 T2624 oashc.HttpShardHandlerFactory.getParameter Setting maxConnectionsPerHost to: 20
   [junit4]   2> 670917 T2624 oashc.HttpShardHandlerFactory.getParameter Setting maxConnections to: 10000
   [junit4]   2> 670917 T2624 oashc.HttpShardHandlerFactory.getParameter Setting corePoolSize to: 0
   [junit4]   2> 670918 T2624 oashc.HttpShardHandlerFactory.getParameter Setting maximumPoolSize to: 2147483647
   [junit4]   2> 670918 T2624 oashc.HttpShardHandlerFactory.getParameter Setting maxThreadIdleTime to: 5
   [junit4]   2> 670918 T2624 oashc.HttpShardHandlerFactory.getParameter Setting sizeOfQueue to: -1
   [junit4]   2> 670918 T2624 oashc.HttpShardHandlerFactory.getParameter Setting fairnessPolicy to: false
   [junit4]   2> 670919 T2624 oashc.HttpShardHandlerFactory.getParameter Setting useRetries to: false
   [junit4]   2> 670924 T2624 oasu.UpdateShardHandler.<init> Creating UpdateShardHandler HTTP client with params: socketTimeout=340000&connTimeout=45000&retry=true
   [junit4]   2> 670924 T2624 oasl.LogWatcher.createWatcher SLF4J impl is org.slf4j.impl.Log4jLoggerFactory
   [junit4]   2> 670925 T2624 oasl.LogWatcher.newRegisteredLogWatcher Registering Log Listener [Log4j (org.slf4j.impl.Log4jLoggerFactory)]
   [junit4]   2> 670925 T2624 oasc.CoreContainer.load Node Name: 127.0.0.1
   [junit4]   2> 670925 T2624 oasc.ZkContainer.initZooKeeper Zookeeper client=127.0.0.1:58617/solr
   [junit4]   2> 670925 T2624 oasc.ZkController.checkChrootPath zkHost includes chroot
   [junit4]   2> 670926 T2624 oascc.SolrZkClient.createZkCredentialsToAddAutomatically Using default ZkCredentialsProvider
   [junit4]   2> 670926 T2624 oascc.ConnectionManager.waitForConnected Waiting for client to connect to ZooKeeper
   [junit4]   2> 670928 T2647 oascc.ConnectionManager.process Watcher org.apache.solr.common.cloud.ConnectionManager@4b038a52 name:ZooKeeperConnection Watcher:127.0.0.1:58617 got event WatchedEvent state:SyncConnected type:None path:null path:null type:None
   [junit4]   2> 670929 T2624 oascc.ConnectionManager.waitForConnected Client is connected to ZooKeeper
   [junit4]   2> 670929 T2624 oascc.SolrZkClient.createZkACLProvider Using default ZkACLProvider
   [junit4]   2> 670931 T2624 oascc.ConnectionManager.waitForConnected Waiting for client to connect to ZooKeeper
   [junit4]   2> 670933 T2650 oascc.ConnectionManager.process Watcher org.apache.solr.common.cloud.ConnectionManager@aa6d68c name:ZooKeeperConnection Watcher:127.0.0.1:58617/solr got event WatchedEvent state:SyncConnected type:None path:null path:null type:None
   [junit4]   2> 670933 T2624 oascc.ConnectionManager.waitForConnected Client is connected to ZooKeeper
   [junit4]   2> 670935 T2624 oascc.SolrZkClient.makePath makePath: /overseer/queue
   [junit4]   2> 670937 T2624 oascc.SolrZkClient.makePath makePath: /overseer/collection-queue-work
   [junit4]   2> 670938 T2624 oascc.SolrZkClient.makePath makePath: /overseer/collection-map-running
   [junit4]   2> 670940 T2624 oascc.SolrZkClient.makePath makePath: /overseer/collection-map-completed
   [junit4]   2> 670942 T2624 oascc.SolrZkClient.makePath makePath: /overseer/collection-map-failure
   [junit4]   2> 670943 T2624 oascc.SolrZkClient.makePath makePath: /live_nodes
   [junit4]   2> 670945 T2624 oascc.SolrZkClient.makePath makePath: /aliases.json
   [junit4]   2> 670946 T2624 oascc.SolrZkClient.makePath makePath: /clusterstate.json
   [junit4]   2> 670947 T2624 oasc.ZkController.createEphemeralLiveNode Register node as live in ZooKeeper:/live_nodes/127.0.0.1:58620_
   [junit4]   2> 670947 T2624 oascc.SolrZkClient.makePath makePath: /live_nodes/127.0.0.1:58620_
   [junit4]   2> 670948 T2624 oascc.SolrZkClient.makePath makePath: /overseer_elect
   [junit4]   2> 670950 T2624 oascc.SolrZkClient.makePath makePath: /overseer_elect/election
   [junit4]   2> 670951 T2624 oasc.Overseer.close Overseer (id=null) closing
   [junit4]   2> 670952 T2624 oasc.OverseerElectionContext.runLeaderProcess I am going to be the leader 127.0.0.1:58620_
   [junit4]   2> 670952 T2624 oascc.SolrZkClient.makePath makePath: /overseer_elect/leader
   [junit4]   2> 670953 T2624 oasc.Overseer.start Overseer (id=93596374343286787-127.0.0.1:58620_-n_0000000000) starting
   [junit4]   2> 670955 T2624 oascc.SolrZkClient.makePath makePath: /overseer/queue-work
   [junit4]   2> 670960 T2624 oasc.OverseerAutoReplicaFailoverThread.<init> Starting OverseerAutoReplicaFailoverThread autoReplicaFailoverWorkLoopDelay=10000 autoReplicaFailoverWaitAfterExpiration=30000 autoReplicaFailoverBadNodeExpiration=60000
   [junit4]   2> 670960 T2652 oasc.OverseerCollectionProcessor.run Process current queue of collection creations
   [junit4]   2> 670960 T2624 oascc.ZkStateReader.createClusterStateWatchersAndUpdate Updating cluster state from ZooKeeper... 
   [junit4]   2> 670961 T2651 oasc.Overseer$ClusterStateUpdater.run Starting to work on the main queue
   [junit4]   2> 670965 T2624 oasc.CorePropertiesLocator.discover Looking for core definitions underneath /usr/home/jenkins/jenkins-slave/workspace/Lucene-Solr-Tests-5.x-Java7/solr/build/solr-core/test/J0/temp/solr.cloud.ReplicationFactorTest 12A3AA716553D370-001/control-001/cores
   [junit4]   2> 670967 T2624 oasc.CoreDescriptor.<init> CORE DESCRIPTOR: {collection=control_collection, loadOnStartup=true, shard=, schema=schema.xml, name=collection1, absoluteInstDir=/usr/home/jenkins/jenkins-slave/workspace/Lucene-Solr-Tests-5.x-Java7/solr/build/solr-core/test/J0/temp/solr.cloud.ReplicationFactorTest 12A3AA716553D370-001/control-001/cores/collection1/, dataDir=data/, coreNodeName=, instanceDir=/usr/home/jenkins/jenkins-slave/workspace/Lucene-Solr-Tests-5.x-Java7/solr/build/solr-core/test/J0/temp/solr.cloud.ReplicationFactorTest 12A3AA716553D370-001/control-001/cores/collection1, config=solrconfig.xml, transient=false}
   [junit4]   2> 670967 T2624 oasc.CorePropertiesLocator.discoverUnder Found core collection1 in /usr/home/jenkins/jenkins-slave/workspace/Lucene-Solr-Tests-5.x-Java7/solr/build/solr-core/test/J0/temp/solr.cloud.ReplicationFactorTest 12A3AA716553D370-001/control-001/cores/collection1/
   [junit4]   2> 670967 T2624 oasc.CorePropertiesLocator.discover Found 1 core definitions
   [junit4]   2> 670968 T2654 C:control_collection c:collection1 oasc.ZkController.publish publishing core=collection1 state=down collection=control_collection
   [junit4]   2> 670968 T2654 C:control_collection c:collection1 oasc.ZkController.publish numShards not found on descriptor - reading it from system property
   [junit4]   2> 670969 T2654 C:control_collection c:collection1 oasc.ZkController.waitForCoreNodeName look for our core node name
   [junit4]   2> 670969 T2650 oasc.DistributedQueue$LatchWatcher.process NodeChildrenChanged fired on path /overseer/queue state SyncConnected
   [junit4]   2> 670970 T2651 oasc.Overseer$ClusterStateUpdater.run processMessage: queueSize: 1, message = {
   [junit4]   2> 	  "roles":null,
   [junit4]   2> 	  "state":"down",
   [junit4]   2> 	  "node_name":"127.0.0.1:58620_",
   [junit4]   2> 	  "numShards":"1",
   [junit4]   2> 	  "shard":null,
   [junit4]   2> 	  "core":"collection1",
   [junit4]   2> 	  "base_url":"http://127.0.0.1:58620",
   [junit4]   2> 	  "operation":"state",
   [junit4]   2> 	  "collection":"control_collection"} current state version: 0
   [junit4]   2> 670971 T2651 oasco.ReplicaMutator.updateState Update state numShards=1 message={
   [junit4]   2> 	  "roles":null,
   [junit4]   2> 	  "state":"down",
   [junit4]   2> 	  "node_name":"127.0.0.1:58620_",
   [junit4]   2> 	  "numShards":"1",
   [junit4]   2> 	  "shard":null,
   [junit4]   2> 	  "core":"collection1",
   [junit4]   2> 	  "base_url":"http://127.0.0.1:58620",
   [junit4]   2> 	  "operation":"state",
   [junit4]   2> 	  "collection":"control_collection"}
   [junit4]   2> 670971 T2651 oasco.ClusterStateMutator.createCollection building a new cName: control_collection
   [junit4]   2> 670971 T2651 oasco.ReplicaMutator.updateState Assigning new node to shard shard=shard1
   [junit4]   2> 670972 T2650 oascc.ZkStateReader$2.process A cluster state change: WatchedEvent state:SyncConnected type:NodeDataChanged path:/clusterstate.json, has occurred - updating... (live nodes size: 1)
   [junit4]   2> 671970 T2654 C:control_collection c:collection1 oasc.ZkController.waitForShardId waiting to find shard id in clusterstate for collection1
   [junit4]   2> 671971 T2654 C:control_collection c:collection1 oasc.ZkController.createCollectionZkNode Check for collection zkNode:control_collection
   [junit4]   2> 671971 T2654 C:control_collection c:collection1 oasc.ZkController.createCollectionZkNode Collection zkNode exists
   [junit4]   2> 671971 T2654 C:control_collection c:collection1 oascc.ZkStateReader.readConfigName Load collection config from:/collections/control_collection
   [junit4]   2> 671972 T2654 C:control_collection c:collection1 oascc.ZkStateReader.readConfigName path=/collections/control_collection configName=conf1 specified config exists in ZooKeeper
   [junit4]   2> 671972 T2654 C:control_collection c:collection1 oasc.SolrResourceLoader.<init> new SolrResourceLoader for directory: '/usr/home/jenkins/jenkins-slave/workspace/Lucene-Solr-Tests-5.x-Java7/solr/build/solr-core/test/J0/temp/solr.cloud.ReplicationFactorTest 12A3AA716553D370-001/control-001/cores/collection1/'
   [junit4]   2> 671986 T2654 C:control_collection c:collection1 oasc.ZkController.watchZKConfDir watch zkdir /configs/conf1
   [junit4]   2> 671988 T2654 C:control_collection c:collection1 oasc.Config.<init> loaded config solrconfig.xml with version 0 
   [junit4]   2> 671997 T2654 C:control_collection c:collection1 oasc.SolrConfig.refreshRequestParams current version of requestparams : -1
   [junit4]   2> 672015 T2654 C:control_collection c:collection1 oasc.SolrConfig.<init> Using Lucene MatchVersion: 5.2.0
   [junit4]   2> 672066 T2654 C:control_collection c:collection1 oasc.SolrConfig.<init> Loaded SolrConfig: solrconfig.xml
   [junit4]   2> 672167 T2654 C:control_collection c:collection1 oass.IndexSchema.readSchema Reading Solr Schema from /configs/conf1/schema.xml
   [junit4]   2> 672175 T2654 C:control_collection c:collection1 oass.IndexSchema.readSchema [collection1] Schema name=test
   [junit4]   2> 672491 T2654 C:control_collection c:collection1 oass.OpenExchangeRatesOrgProvider.init Initialized with rates=open-exchange-rates.json, refreshInterval=1440.
   [junit4]   2> 672504 T2654 C:control_collection c:collection1 oass.IndexSchema.readSchema default search field in schema is text
   [junit4]   2> 672506 T2654 C:control_collection c:collection1 oass.IndexSchema.readSchema unique key field: id
   [junit4]   2> 672514 T2654 C:control_collection c:collection1 oass.FileExchangeRateProvider.reload Reloading exchange rates from file currency.xml
   [junit4]   2> 672518 T2654 C:control_collection c:collection1 oass.FileExchangeRateProvider.reload Reloading exchange rates from file currency.xml
   [junit4]   2> 672521 T2654 C:control_collection c:collection1 oass.OpenExchangeRatesOrgProvider.reload Reloading exchange rates from open-exchange-rates.json
   [junit4]   2> 672522 T2654 C:control_collection c:collection1 oass.OpenExchangeRatesOrgProvider$OpenExchangeRates.<init> WARN Unknown key IMPORTANT NOTE
   [junit4]   2> 672522 T2654 C:control_collection c:collection1 oass.OpenExchangeRatesOrgProvider$OpenExchangeRates.<init> WARN Expected key, got STRING
   [junit4]   2> 672522 T2654 C:control_collection c:collection1 oass.OpenExchangeRatesOrgProvider.reload Reloading exchange rates from open-exchange-rates.json
   [junit4]   2> 672523 T2654 C:control_collection c:collection1 oass.OpenExchangeRatesOrgProvider$OpenExchangeRates.<init> WARN Unknown key IMPORTANT NOTE
   [junit4]   2> 672523 T2654 C:control_collection c:collection1 oass.OpenExchangeRatesOrgProvider$OpenExchangeRates.<init> WARN Expected key, got STRING
   [junit4]   2> 672523 T2654 C:control_collection c:collection1 oasc.CoreContainer.create Creating SolrCore 'collection1' using configuration from collection control_collection
   [junit4]   2> 672523 T2654 C:control_collection c:collection1 oasc.SolrCore.initDirectoryFactory org.apache.solr.core.MockDirectoryFactory
   [junit4]   2> 672523 T2654 C:control_collection c:collection1 oasc.SolrCore.<init> [collection1] Opening new SolrCore at /usr/home/jenkins/jenkins-slave/workspace/Lucene-Solr-Tests-5.x-Java7/solr/build/solr-core/test/J0/temp/solr.cloud.ReplicationFactorTest 12A3AA716553D370-001/control-001/cores/collection1/, dataDir=/usr/home/jenkins/jenkins-slave/workspace/Lucene-Solr-Tests-5.x-Java7/solr/build/solr-core/test/J0/temp/solr.cloud.ReplicationFactorTest 12A3AA716553D370-001/control-001/cores/collection1/data/
   [junit4]   2> 672524 T2654 C:control_collection c:collection1 oasc.JmxMonitoredMap.<init> JMX monitoring is enabled. Adding Solr mbeans to JMX Server: com.sun.jmx.mbeanserver.JmxMBeanServer@3e6cd229
   [junit4]   2> 672524 T2654 C:control_collection c:collection1 oasc.CachingDirectoryFactory.get return new directory for /usr/home/jenkins/jenkins-slave/workspace/Lucene-Solr-Tests-5.x-Java7/solr/build/solr-core/test/J0/temp/solr.cloud.ReplicationFactorTest 12A3AA716553D370-001/control-001/cores/collection1/data
   [junit4]   2> 672525 T2654 C:control_collection c:collection1 oasc.SolrCore.getNewIndexDir New index directory detected: old=null new=/usr/home/jenkins/jenkins-slave/workspace/Lucene-Solr-Tests-5.x-Java7/solr/build/solr-core/test/J0/temp/solr.cloud.ReplicationFactorTest 12A3AA716553D370-001/control-001/cores/collection1/data/index/
   [junit4]   2> 672525 T2654 C:control_collection c:collection1 oasc.SolrCore.initIndex WARN [collection1] Solr index directory '/usr/home/jenkins/jenkins-slave/workspace/Lucene-Solr-Tests-5.x-Java7/solr/build/solr-core/test/J0/temp/solr.cloud.ReplicationFactorTest 12A3AA716553D370-001/control-001/cores/collection1/data/index' doesn't exist. Creating new index...
   [junit4]   2> 672525 T2654 C:control_collection c:collection1 oasc.CachingDirectoryFactory.get return new directory for /usr/home/jenkins/jenkins-slave/workspace/Lucene-Solr-Tests-5.x-Java7/solr/build/solr-core/test/J0/temp/solr.cloud.ReplicationFactorTest 12A3AA716553D370-001/control-001/cores/collection1/data/index
   [junit4]   2> 672525 T2654 C:control_collection c:collection1 oasu.RandomMergePolicy.<init> RandomMergePolicy wrapping class org.apache.lucene.index.TieredMergePolicy: [TieredMergePolicy: maxMergeAtOnce=42, maxMergeAtOnceExplicit=46, maxMergedSegmentMB=63.03515625, floorSegmentMB=1.435546875, forceMergeDeletesPctAllowed=5.447954420730018, segmentsPerTier=23.0, maxCFSSegmentSizeMB=8.796093022207999E12, noCFSRatio=1.0
   [junit4]   2> 672526 T2654 C:control_collection c:collection1 oasc.SolrDeletionPolicy.onCommit SolrDeletionPolicy.onCommit: commits: num=1
   [junit4]   2> 		commit{dir=MockDirectoryWrapper(RAMDirectory@3c4b7168 lockFactory=org.apache.lucene.store.SingleInstanceLockFactory@7d0281c4),segFN=segments_1,generation=1}
   [junit4]   2> 672526 T2654 C:control_collection c:collection1 oasc.SolrDeletionPolicy.updateCommits newest commit generation = 1
   [junit4]   2> 672530 T2654 C:control_collection c:collection1 oasup.UpdateRequestProcessorChain.init creating updateRequestProcessorChain "nodistrib"
   [junit4]   2> 672530 T2654 C:control_collection c:collection1 oasup.UpdateRequestProcessorChain.init creating updateRequestProcessorChain "dedupe"
   [junit4]   2> 672531 T2654 C:control_collection c:collection1 oasup.UpdateRequestProcessorChain.init inserting DistributedUpdateProcessorFactory into updateRequestProcessorChain "dedupe"
   [junit4]   2> 672531 T2654 C:control_collection c:collection1 oasup.UpdateRequestProcessorChain.init creating updateRequestProcessorChain "stored_sig"
   [junit4]   2> 672531 T2654 C:control_collection c:collection1 oasup.UpdateRequestProcessorChain.init inserting DistributedUpdateProcessorFactory into updateRequestProcessorChain "stored_sig"
   [junit4]   2> 672531 T2654 C:control_collection c:collection1 oasup.UpdateRequestProcessorChain.init creating updateRequestProcessorChain "distrib-dup-test-chain-explicit"
   [junit4]   2> 672532 T2654 C:control_collection c:collection1 oasup.UpdateRequestProcessorChain.init creating updateRequestProcessorChain "distrib-dup-test-chain-implicit"
   [junit4]   2> 672532 T2654 C:control_collection c:collection1 oasup.UpdateRequestProcessorChain.init inserting DistributedUpdateProcessorFactory into updateRequestProcessorChain "distrib-dup-test-chain-implicit"
   [junit4]   2> 672532 T2654 C:control_collection c:collection1 oasc.SolrCore.loadUpdateProcessorChains no updateRequestProcessorChain defined as default, creating implicit default
   [junit4]   2> 672549 T2654 C:control_collection c:collection1 oashl.XMLLoader.init xsltCacheLifetimeSeconds=60
   [junit4]   2> 672552 T2654 C:control_collection c:collection1 oashl.XMLLoader.init xsltCacheLifetimeSeconds=60
   [junit4]   2> 672553 T2654 C:control_collection c:collection1 oashl.XMLLoader.init xsltCacheLifetimeSeconds=60
   [junit4]   2> 672555 T2654 C:control_collection c:collection1 oashl.XMLLoader.init xsltCacheLifetimeSeconds=60
   [junit4]   2> 672559 T2654 C:control_collection c:collection1 oasc.RequestHandlers.initHandlersFromConfig Registered paths: /admin/logging,/replication,/schema,/admin/segments,/admin/luke,/update/json/docs,/get,/admin/file,/update/json,/admin/properties,/admin/system,standard,/admin/plugins,/admin/mbeans,/admin/ping,/admin/threads,/update,/config,/update/csv
   [junit4]   2> 672561 T2654 C:control_collection c:collection1 oasc.SolrCore.initStatsCache Using default statsCache cache: org.apache.solr.search.stats.LocalStatsCache
   [junit4]   2> 672562 T2654 C:control_collection c:collection1 oasu.UpdateHandler.<init> Using UpdateLog implementation: org.apache.solr.update.UpdateLog
   [junit4]   2> 672562 T2654 C:control_collection c:collection1 oasu.UpdateLog.init Initializing UpdateLog: dataDir= defaultSyncLevel=FLUSH numRecordsToKeep=100 maxNumLogsToKeep=10
   [junit4]   2> 672564 T2654 C:control_collection c:collection1 oasu.CommitTracker.<init> Hard AutoCommit: disabled
   [junit4]   2> 672564 T2654 C:control_collection c:collection1 oasu.CommitTracker.<init> Soft AutoCommit: disabled
   [junit4]   2> 672565 T2654 C:control_collection c:collection1 oasu.RandomMergePolicy.<init> RandomMergePolicy wrapping class org.apache.lucene.index.TieredMergePolicy: [TieredMergePolicy: maxMergeAtOnce=17, maxMergeAtOnceExplicit=38, maxMergedSegmentMB=39.8115234375, floorSegmentMB=0.7158203125, forceMergeDeletesPctAllowed=2.9634851000593088, segmentsPerTier=50.0, maxCFSSegmentSizeMB=8.796093022207999E12, noCFSRatio=1.0
   [junit4]   2> 672565 T2654 C:control_collection c:collection1 oasc.SolrDeletionPolicy.onInit SolrDeletionPolicy.onInit: commits: num=1
   [junit4]   2> 		commit{dir=MockDirectoryWrapper(RAMDirectory@3c4b7168 lockFactory=org.apache.lucene.store.SingleInstanceLockFactory@7d0281c4),segFN=segments_1,generation=1}
   [junit4]   2> 672565 T2654 C:control_collection c:collection1 oasc.SolrDeletionPolicy.updateCommits newest commit generation = 1
   [junit4]   2> 672566 T2654 C:control_collection c:collection1 oass.SolrIndexSearcher.<init> Opening Searcher@77cf9b72[collection1] main
   [junit4]   2> 672566 T2654 C:control_collection c:collection1 oascc.ZkStateReader.readConfigName Load collection config from:/collections/control_collection
   [junit4]   2> 672567 T2654 C:control_collection c:collection1 oascc.ZkStateReader.readConfigName path=/collections/control_collection configName=conf1 specified config exists in ZooKeeper
   [junit4]   2> 672567 T2654 C:control_collection c:collection1 oasr.ManagedResourceStorage.newStorageIO Setting up ZooKeeper-based storage for the RestManager with znodeBase: /configs/conf1
   [junit4]   2> 672567 T2654 C:control_collection c:collection1 oasr.ManagedResourceStorage$ZooKeeperStorageIO.configure Configured ZooKeeperStorageIO with znodeBase: /configs/conf1
   [junit4]   2> 672567 T2654 C:control_collection c:collection1 oasr.RestManager.init Initializing RestManager with initArgs: {}
   [junit4]   2> 672567 T2654 C:control_collection c:collection1 oasr.ManagedResourceStorage.load Reading _rest_managed.json using ZooKeeperStorageIO:path=/configs/conf1
   [junit4]   2> 672568 T2654 C:control_collection c:collection1 oasr.ManagedResourceStorage$ZooKeeperStorageIO.openInputStream No data found for znode /configs/conf1/_rest_managed.json
   [junit4]   2> 672568 T2654 C:control_collection c:collection1 oasr.ManagedResourceStorage.load Loaded null at path _rest_managed.json using ZooKeeperStorageIO:path=/configs/conf1
   [junit4]   2> 672568 T2654 C:control_collection c:collection1 oasr.RestManager.init Initializing 0 registered ManagedResources
   [junit4]   2> 672568 T2654 C:control_collection c:collection1 oash.ReplicationHandler.inform Commits will be reserved for  10000
   [junit4]   2> 672569 T2655 C:control_collection c:collection1 oasc.SolrCore.registerSearcher [collection1] Registered new searcher Searcher@77cf9b72[collection1] main{ExitableDirectoryReader(UninvertingDirectoryReader())}
   [junit4]   2> 672570 T2654 C:control_collection c:collection1 oasc.CoreContainer.registerCore registering core: collection1
   [junit4]   2> 672570 T2658 C:control_collection S:shard1 oasc.ZkController.register Register replica - core:collection1 address:http://127.0.0.1:58620 collection:control_collection shard:shard1
   [junit4]   2> 672570 T2624 oass.SolrDispatchFilter.init user.dir=/usr/home/jenkins/jenkins-slave/workspace/Lucene-Solr-Tests-5.x-Java7/solr/build/solr-core/test/J0
   [junit4]   2> 672571 T2624 oass.SolrDispatchFilter.init SolrDispatchFilter.init() done
   [junit4]   2> 672571 T2658 C:control_collection S:shard1 oascc.SolrZkClient.makePath makePath: /collections/control_collection/leader_elect/shard1/election
   [junit4]   2> 672574 T2658 C:control_collection S:shard1 oasc.ShardLeaderElectionContext.runLeaderProcess Running the leader process for shard shard1
   [junit4]   2> 672574 T2624 oascc.SolrZkClient.createZkCredentialsToAddAutomatically Using default ZkCredentialsProvider
   [junit4]   2> 672575 T2624 oascc.ConnectionManager.waitForConnected Waiting for client to connect to ZooKeeper
   [junit4]   2> 672575 T2650 oasc.DistributedQueue$LatchWatcher.process NodeChildrenChanged fired on path /overseer/queue state SyncConnected
   [junit4]   2> 672576 T2658 C:control_collection S:shard1 oasc.ShardLeaderElectionContext.waitForReplicasToComeUp Enough replicas found to continue.
   [junit4]   2> 672576 T2662 oascc.ConnectionManager.process Watcher org.apache.solr.common.cloud.ConnectionManager@49b0d9d1 name:ZooKeeperConnection Watcher:127.0.0.1:58617/solr got event WatchedEvent state:SyncConnected type:None path:null path:null type:None
   [junit4]   2> 672576 T2651 oasc.Overseer$ClusterStateUpdater.run processMessage: queueSize: 1, message = {
   [junit4]   2> 	  "operation":"leader",
   [junit4]   2> 	  "shard":"shard1",
   [junit4]   2> 	  "collection":"control_collection"} current state version: 1
   [junit4]   2> 672576 T2658 C:control_collection S:shard1 oasc.ShardLeaderElectionContext.runLeaderProcess I may be the new leader - try and sync
   [junit4]   2> 672576 T2624 oascc.ConnectionManager.waitForConnected Client is connected to ZooKeeper
   [junit4]   2> ASYNC  NEW_CORE C361 name=collection1 org.apache.solr.core.SolrCore@801aa0a url=http://127.0.0.1:58620/collection1 node=127.0.0.1:58620_ C361_STATE=coll:control_collection core:collection1 props:{state=down, node_name=127.0.0.1:58620_, core=collection1, base_url=http://127.0.0.1:58620}
   [junit4]   2> 672577 T2658 C:control_collection S:shard1 C361 P58620 oasc.SyncStrategy.sync Sync replicas to http://127.0.0.1:58620/collection1/
   [junit4]   2> 672577 T2624 oascc.SolrZkClient.createZkACLProvider Using default ZkACLProvider
   [junit4]   2> 672577 T2658 C:control_collection S:shard1 C361 P58620 oasc.SyncStrategy.syncReplicas Sync Success - now sync replicas to me
   [junit4]   2> 672577 T2650 oascc.ZkStateReader$2.process A cluster state change: WatchedEvent state:SyncConnected type:NodeDataChanged path:/clusterstate.json, has occurred - updating... (live nodes size: 1)
   [junit4]   2> 672577 T2624 oascc.ZkStateReader.createClusterStateWatchersAndUpdate Updating cluster state from ZooKeeper... 
   [junit4]   2> 672577 T2658 C:control_collection S:shard1 C361 P58620 oasc.SyncStrategy.syncToMe http://127.0.0.1:58620/collection1/ has no replicas
   [junit4]   2> 672579 T2658 C:control_collection S:shard1 oasc.ShardLeaderElectionContext.runLeaderProcess I am the new leader: http://127.0.0.1:58620/collection1/ shard1
   [junit4]   2> 672579 T2658 C:control_collection S:shard1 oascc.SolrZkClient.makePath makePath: /collections/control_collection/leaders/shard1
   [junit4]   2> 672581 T2624 oasc.ChaosMonkey.monkeyLog monkey: init - expire sessions:false cause connection loss:false
   [junit4]   2> 672581 T2624 oasc.AbstractFullDistribZkTestBase.createJettys Creating collection1 with stateFormat=2
   [junit4]   2> 672581 T2624 oascc.SolrZkClient.createZkCredentialsToAddAutomatically Using default ZkCredentialsProvider
   [junit4]   2> 672582 T2650 oasc.DistributedQueue$LatchWatcher.process NodeChildrenChanged fired on path /overseer/queue state SyncConnected
   [junit4]   2> 672582 T2624 oascc.ConnectionManager.waitForConnected Waiting for client to connect to ZooKeeper
   [junit4]   2> 672583 T2651 oasc.Overseer$ClusterStateUpdater.run processMessage: queueSize: 1, message = {
   [junit4]   2> 	  "operation":"leader",
   [junit4]   2> 	  "shard":"shard1",
   [junit4]   2> 	  "collection":"control_collection",
   [junit4]   2> 	  "base_url":"http://127.0.0.1:58620",
   [junit4]   2> 	  "core":"collection1",
   [junit4]   2> 	  "state":"active"} current state version: 2
   [junit4]   2> 672583 T2665 oascc.ConnectionManager.process Watcher org.apache.solr.common.cloud.ConnectionManager@38586f43 name:ZooKeeperConnection Watcher:127.0.0.1:58617/solr got event WatchedEvent state:SyncConnected type:None path:null path:null type:None
   [junit4]   2> 672583 T2624 oascc.ConnectionManager.waitForConnected Client is connected to ZooKeeper
   [junit4]   2> 672584 T2624 oascc.SolrZkClient.createZkACLProvider Using default ZkACLProvider
   [junit4]   2> 672586 T2650 oasc.DistributedQueue$LatchWatcher.process NodeChildrenChanged fired on path /overseer/queue state SyncConnected
   [junit4]   2> 672587 T2651 oasc.Overseer$ClusterStateUpdater.run processMessage: queueSize: 1, message = {
   [junit4]   2> 	  "operation":"create",
   [junit4]   2> 	  "name":"collection1",
   [junit4]   2> 	  "numShards":"3",
   [junit4]   2> 	  "stateFormat":"2"} current state version: 2
   [junit4]   2> 672587 T2651 oasco.ClusterStateMutator.createCollection building a new cName: collection1
   [junit4]   2> 672588 T2650 oascc.ZkStateReader$2.process A cluster state change: WatchedEvent state:SyncConnected type:NodeDataChanged path:/clusterstate.json, has occurred - updating... (live nodes size: 1)
   [junit4]   2> 672588 T2662 oascc.ZkStateReader$2.process A cluster state change: WatchedEvent state:SyncConnected type:NodeDataChanged path:/clusterstate.json, has occurred - updating... (live nodes size: 1)
   [junit4]   2> 672633 T2658 C:control_collection S:shard1 oasc.ZkController.register We are http://127.0.0.1:58620/collection1/ and leader is http://127.0.0.1:58620/collection1/
   [junit4]   2> 672634 T2658 C:control_collection S:shard1 oasc.ZkController.register No LogReplay needed for core=collection1 baseURL=http://127.0.0.1:58620
   [junit4]   2> 672634 T2658 C:control_collection S:shard1 oasc.ZkController.checkRecovery I am the leader, no recovery necessary
   [junit4]   2> 672634 T2658 C:control_collection S:shard1 c:collection1 oasc.ZkController.publish publishing core=collection1 state=active collection=control_collection
   [junit4]   2> 672634 T2658 C:control_collection S:shard1 c:collection1 oasc.ZkController.publish numShards not found on descriptor - reading it from system property
   [junit4]   2> 672635 T2650 oasc.DistributedQueue$LatchWatcher.process NodeChildrenChanged fired on path /overseer/queue state SyncConnected
   [junit4]   2> 672636 T2651 oasc.Overseer$ClusterStateUpdater.run processMessage: queueSize: 1, message = {
   [junit4]   2> 	  "core_node_name":"core_node1",
   [junit4]   2> 	  "roles":null,
   [junit4]   2> 	  "state":"active",
   [junit4]   2> 	  "node_name":"127.0.0.1:58620_",
   [junit4]   2> 	  "numShards":"3",
   [junit4]   2> 	  "shard":"shard1",
   [junit4]   2> 	  "core":"collection1",
   [junit4]   2> 	  "base_url":"http://127.0.0.1:58620",
   [junit4]   2> 	  "operation":"state",
   [junit4]   2> 	  "collection":"control_collection"} current state version: 3
   [junit4]   2> 672637 T2651 oasco.ReplicaMutator.updateState Update state numShards=3 message={
   [junit4]   2> 	  "core_node_name":"core_node1",
   [junit4]   2> 	  "roles":null,
   [junit4]   2> 	  "state":"active",
   [junit4]   2> 	  "node_name":"127.0.0.1:58620_",
   [junit4]   2> 	  "numShards":"3",
   [junit4]   2> 	  "shard":"shard1",
   [junit4]   2> 	  "core":"collection1",
   [junit4]   2> 	  "base_url":"http://127.0.0.1:58620",
   [junit4]   2> 	  "operation":"state",
   [junit4]   2> 	  "collection":"control_collection"}
   [junit4]   2> 672637 T2651 oasco.ZkStateWriter.writePendingUpdates going to create_collection /collections/collection1/state.json
   [junit4]   2> 672638 T2650 oascc.ZkStateReader$2.process A cluster state change: WatchedEvent state:SyncConnected type:NodeDataChanged path:/clusterstate.json, has occurred - updating... (live nodes size: 1)
   [junit4]   2> 672638 T2662 oascc.ZkStateReader$2.process A cluster state change: WatchedEvent state:SyncConnected type:NodeDataChanged path:/clusterstate.json, has occurred - updating... (live nodes size: 1)
   [junit4]   2> 672742 T2662 oascc.ZkStateReader$2.process A cluster state change: WatchedEvent state:SyncConnected type:NodeDataChanged path:/clusterstate.json, has occurred - updating... (live nodes size: 1)
   [junit4]   2> 672742 T2650 oascc.ZkStateReader$2.process A cluster state change: WatchedEvent state:SyncConnected type:NodeDataChanged path:/clusterstate.json, has occurred - updating... (live nodes size: 1)
   [junit4]   2> 673545 T2624 oas.SolrTestCaseJ4.writeCoreProperties Writing core.properties file to /usr/home/jenkins/jenkins-slave/workspace/Lucene-Solr-Tests-5.x-Java7/solr/build/solr-core/test/J0/temp/solr.cloud.ReplicationFactorTest 12A3AA716553D370-001/shard-1-001/cores/collection1
   [junit4]   2> 673547 T2624 oasc.AbstractFullDistribZkTestBase.createJettys create jetty 1 in directory /usr/home/jenkins/jenkins-slave/workspace/Lucene-Solr-Tests-5.x-Java7/solr/build/solr-core/test/J0/temp/solr.cloud.ReplicationFactorTest 12A3AA716553D370-001/shard-1-001
   [junit4]   2> 673547 T2624 oejs.Server.doStart jetty-8.1.10.v20130312
   [junit4]   2> 673550 T2624 oejs.AbstractConnector.doStart Started SocketConnector@127.0.0.1:58631
   [junit4]   2> 673550 T2624 oascse.JettySolrRunner$1.lifeCycleStarted Jetty properties: {solrconfig=solrconfig.xml, hostPort=58630, coreRootDirectory=/usr/home/jenkins/jenkins-slave/workspace/Lucene-Solr-Tests-5.x-Java7/solr/build/solr-core/test/J0/temp/solr.cloud.ReplicationFactorTest 12A3AA716553D370-001/shard-1-001/cores, solr.data.dir=/usr/home/jenkins/jenkins-slave/workspace/Lucene-Solr-Tests-5.x-Java7/solr/build/solr-core/test/J0/temp/solr.cloud.ReplicationFactorTest 12A3AA716553D370-001/tempDir-001/jetty1, hostContext=/}
   [junit4]   2> 673551 T2624 oass.SolrDispatchFilter.init SolrDispatchFilter.init()sun.misc.Launcher$AppClassLoader@631d75b9
   [junit4]   2> 673551 T2624 oasc.SolrResourceLoader.<init> new SolrResourceLoader for directory: '/usr/home/jenkins/jenkins-slave/workspace/Lucene-Solr-Tests-5.x-Java7/solr/build/solr-core/test/J0/temp/solr.cloud.ReplicationFactorTest 12A3AA716553D370-001/shard-1-001/'
   [junit4]   2> 673581 T2624 oasc.SolrXmlConfig.fromFile Loading container configuration from /usr/home/jenkins/jenkins-slave/workspace/Lucene-Solr-Tests-5.x-Java7/solr/build/solr-core/test/J0/temp/solr.cloud.ReplicationFactorTest 12A3AA716553D370-001/shard-1-001/solr.xml
   [junit4]   2> 673616 T2624 oasc.CorePropertiesLocator.<init> Config-defined core root directory: /usr/home/jenkins/jenkins-slave/workspace/Lucene-Solr-Tests-5.x-Java7/solr/build/solr-core/test/J0/temp/solr.cloud.ReplicationFactorTest 12A3AA716553D370-001/shard-1-001/cores
   [junit4]   2> 673617 T2624 oasc.CoreContainer.<init> New CoreContainer 592846894
   [junit4]   2> 673617 T2624 oasc.CoreContainer.load Loading cores into CoreContainer [instanceDir=/usr/home/jenkins/jenkins-slave/workspace/Lucene-Solr-Tests-5.x-Java7/solr/build/solr-core/test/J0/temp/solr.cloud.ReplicationFactorTest 12A3AA716553D370-001/shard-1-001/]
   [junit4]   2> 673617 T2624 oasc.CoreContainer.load loading shared library: /usr/home/jenkins/jenkins-slave/workspace/Lucene-Solr-Tests-5.x-Java7/solr/build/solr-core/test/J0/temp/solr.cloud.ReplicationFactorTest 12A3AA716553D370-001/shard-1-001/lib
   [junit4]   2> 673618 T2624 oasc.SolrResourceLoader.addToClassLoader WARN Can't find (or read) directory to add to classloader: lib (resolved as: /usr/home/jenkins/jenkins-slave/workspace/Lucene-Solr-Tests-5.x-Java7/solr/build/solr-core/test/J0/temp/solr.cloud.ReplicationFactorTest 12A3AA716553D370-001/shard-1-001/lib).
   [junit4]   2> 673627 T2624 oashc.HttpShardHandlerFactory.getParameter Setting socketTimeout to: 90000
   [junit4]   2> 673627 T2624 oashc.HttpShardHandlerFactory.getParameter Setting urlScheme to: 
   [junit4]   2> 673628 T2624 oashc.HttpShardHandlerFactory.getParameter Setting connTimeout to: 15000
   [junit4]   2> 673628 T2624 oashc.HttpShardHandlerFactory.getParameter Setting maxConnectionsPerHost to: 20
   [junit4]   2> 673628 T2624 oashc.HttpShardHandlerFactory.getParameter Setting maxConnections to: 10000
   [junit4]   2> 673628 T2624 oashc.HttpShardHandlerFactory.getParameter Setting corePoolSize to: 0
   [junit4]   2> 673628 T2624 oashc.HttpShardHandlerFactory.getParameter Setting maximumPoolSize to: 2147483647
   [junit4]   2> 673629 T2624 oashc.HttpShardHandlerFactory.getParameter Setting maxThreadIdleTime to: 5
   [junit4]   2> 673629 T2624 oashc.HttpShardHandlerFactory.getParameter Setting sizeOfQueue to: -1
   [junit4]   2> 673629 T2624 oashc.HttpShardHandlerFactory.getParameter Setting fairnessPolicy to: false
   [junit4]   2> 673629 T2624 oashc.HttpShardHandlerFactory.getParameter Setting useRetries to: false
   [junit4]   2> 673634 T2624 oasu.UpdateShardHandler.<init> Creating UpdateShardHandler HTTP client with params: socketTimeout=340000&connTimeout=45000&retry=true
   [junit4]   2> 673635 T2624 oasl.LogWatcher.createWatcher SLF4J impl is org.slf4j.impl.Log4jLoggerFactory
   [junit4]   2> 673635 T2624 oasl.LogWatcher.newRegisteredLogWatcher Registering Log Listener [Log4j (org.slf4j.impl.Log4jLoggerFactory)]
   [junit4]   2> 673635 T2624 oasc.CoreContainer.load Node Name: 127.0.0.1
   [junit4]   2> 673635 T2624 oasc.ZkContainer.initZooKeeper Zookeeper client=127.0.0.1:58617/solr
   [junit4]   2> 673636 T2624 oasc.ZkController.checkChrootPath zkHost includes chroot
   [junit4]   2> 673636 T2624 oascc.SolrZkClient.createZkCredentialsToAddAutomatically Using default ZkCredentialsProvider
   [junit4]   2> 673636 T2624 oascc.ConnectionManager.waitForConnected Waiting for client to connect to ZooKeeper
   [junit4]   2> 673638 T2677 oascc.ConnectionManager.process Watcher org.apache.solr.common.cloud.ConnectionManager@62a364f name:ZooKeeperConnection Watcher:127.0.0.1:58617 got event WatchedEvent state:SyncConnected type:None path:null path:null type:None
   [junit4]   2> 673639 T2624 oascc.ConnectionManager.waitForConnected Client is connected to ZooKeeper
   [junit4]   2> 673639 T2624 oascc.SolrZkClient.createZkACLProvider Using default ZkACLProvider
   [junit4]   2> 673641 T2624 oascc.ConnectionManager.waitForConnected Waiting for client to connect to ZooKeeper
   [junit4]   2> 673643 T2680 oascc.ConnectionManager.process Watcher org.apache.solr.common.cloud.ConnectionManager@74e7039a name:ZooKeeperConnection Watcher:127.0.0.1:58617/solr got event WatchedEvent state:SyncConnected type:None path:null path:null type:None
   [junit4]   2> 673643 T2624 oascc.ConnectionManager.waitForConnected Client is connected to ZooKeeper
   [junit4]   2> 673646 T2624 oascc.ZkStateReader.createClusterStateWatchersAndUpdate Updating cluster state from ZooKeeper... 
   [junit4]   2> 674651 T2624 oasc.ZkController.createEphemeralLiveNode Register node as live in ZooKeeper:/live_nodes/127.0.0.1:58630_
   [junit4]   2> 674652 T2624 oascc.SolrZkClient.makePath makePath: /live_nodes/127.0.0.1:58630_
   [junit4]   2> 674655 T2624 oasc.Overseer.close Overseer (id=null) closing
   [junit4]   2> 674657 T2624 oasc.CorePropertiesLocator.discover Looking for core definitions underneath /usr/home/jenkins/jenkins-slave/workspace/Lucene-Solr-Tests-5.x-Java7/solr/build/solr-core/test/J0/temp/solr.cloud.ReplicationFactorTest 12A3AA716553D370-001/shard-1-001/cores
   [junit4]   2> 674659 T2624 oasc.CoreDescriptor.<init> CORE DESCRIPTOR: {shard=, instanceDir=/usr/home/jenkins/jenkins-slave/workspace/Lucene-Solr-Tests-5.x-Java7/solr/build/solr-core/test/J0/temp/solr.cloud.ReplicationFactorTest 12A3AA716553D370-001/shard-1-001/cores/collection1, transient=false, config=solrconfig.xml, schema=schema.xml, collection=collection1, absoluteInstDir=/usr/home/jenkins/jenkins-slave/workspace/Lucene-Solr-Tests-5.x-Java7/solr/build/solr-core/test/J0/temp/solr.cloud.ReplicationFactorTest 12A3AA716553D370-001/shard-1-001/cores/collection1/, loadOnStartup=true, name=collection1, coreNodeName=, dataDir=data/}
   [junit4]   2> 674660 T2624 oasc.CorePropertiesLocator.discoverUnder Found core collection1 in /usr/home/jenkins/jenkins-slave/workspace/Lucene-Solr-Tests-5.x-Java7/solr/build/solr-core/test/J0/temp/solr.cloud.ReplicationFactorTest 12A3AA716553D370-001/shard-1-001/cores/collection1/
   [junit4]   2> 674660 T2624 oasc.CorePropertiesLocator.discover Found 1 core definitions
   [junit4]   2> 674662 T2681 C:collection1 c:collection1 oasc.ZkController.publish publishing core=collection1 state=down collection=collection1
   [junit4]   2> 674662 T2681 C:collection1 c:collection1 oasc.ZkController.publish numShards not found on descriptor - reading it from system property
   [junit4]   2> 674663 T2650 oasc.DistributedQueue$LatchWatcher.process NodeChildrenChanged fired on path /overseer/queue state SyncConnected
   [junit4]   2> 674664 T2681 C:collection1 c:collection1 oasc.ZkController.preRegister Registering watch for external collection collection1
   [junit4]   2> 674664 T2681 C:collection1 c:collection1 oascc.ZkStateReader.addZkWatch addZkWatch collection1
   [junit4]   2> 674664 T2651 oasc.Overseer$ClusterStateUpdater.run processMessage: queueSize: 1, message = {
   [junit4]   2> 	  "roles":null,
   [junit4]   2> 	  "state":"down",
   [junit4]   2> 	  "node_name":"127.0.0.1:58630_",
   [junit4]   2> 	  "numShards":"3",
   [junit4]   2> 	  "shard":null,
   [junit4]   2> 	  "core":"collection1",
   [junit4]   2> 	  "base_url":"http://127.0.0.1:58630",
   [junit4]   2> 	  "operation":"state",
   [junit4]   2> 	  "collection":"collection1"} current state version: 5
   [junit4]   2> 674664 T2681 C:collection1 c:collection1 oascc.ZkStateReader.addZkWatch Updating collection state at /collections/collection1/state.json from ZooKeeper... 
   [junit4]   2> 674665 T2651 oasco.ReplicaMutator.updateState Update state numShards=3 message={
   [junit4]   2> 	  "roles":null,
   [junit4]   2> 	  "state":"down",
   [junit4]   2> 	  "node_name":"127.0.0.1:58630_",
   [junit4]   2> 	  "numShards":"3",
   [junit4]   2> 	  "shard":null,
   [junit4]   2> 	  "core":"collection1",
   [junit4]   2> 	  "base_url":"http://127.0.0.1:58630",
   [junit4]   2> 	  "operation":"state",
   [junit4]   2> 	  "collection":"collection1"}
   [junit4]   2> 674665 T2651 oasco.ReplicaMutator.updateState Collection already exists with numShards=3
   [junit4]   2> 674665 T2651 oasco.ReplicaMutator.updateState Assigning new node to shard shard=shard3
   [junit4]   2> 674665 T2681 C:collection1 c:collection1 oascc.ZkStateReader.updateWatchedCollection Updating data for collection1 to ver 0 
   [junit4]   2> 674665 T2681 C:collection1 c:collection1 oasc.ZkController.waitForCoreNodeName look for our core node name
   [junit4]   2> 674666 T2651 oasco.ZkStateWriter.writePendingUpdates going to update_collection /collections/collection1/state.json version: 0
   [junit4]   2> 674667 T2680 oascc.ZkStateReader$7.process A cluster state change: WatchedEvent state:SyncConnected type:NodeDataChanged path:/collections/collection1/state.json for collection collection1 has occurred - updating... (live nodes size: 2)
   [junit4]   2> 674667 T2680 oascc.ZkStateReader.updateWatchedCollection Updating data for collection1 to ver 1 
   [junit4]   2> 675666 T2681 C:collection1 c:collection1 oasc.ZkController.waitForShardId waiting to find shard id in clusterstate for collection1
   [junit4]   2> 675667 T2681 C:collection1 c:collection1 oasc.ZkController.createCollectionZkNode Check for collection zkNode:collection1
   [junit4]   2> 675667 T2681 C:collection1 c:collection1 oasc.ZkController.createCollectionZkNode Collection zkNode exists
   [junit4]   2> 675668 T2681 C:collection1 c:collection1 oascc.ZkStateReader.readConfigName Load collection config from:/collections/collection1
   [junit4]   2> 675668 T2681 C:collection1 c:collection1 oascc.ZkStateReader.readConfigName path=/collections/collection1 configName=conf1 specified config exists in ZooKeeper
   [junit4]   2> 675668 T2681 C:collection1 c:collection1 oasc.SolrResourceLoader.<init> new SolrResourceLoader for directory: '/usr/home/jenkins/jenkins-slave/workspace/Lucene-Solr-Tests-5.x-Java7/solr/build/solr-core/test/J0/temp/solr.cloud.ReplicationFactorTest 12A3AA716553D370-001/shard-1-001/cores/collection1/'
   [junit4]   2> 675681 T2681 C:collection1 c:collection1 oasc.ZkController.watchZKConfDir watch zkdir /configs/conf1
   [junit4]   2> 675683 T2681 C:collection1 c:collection1 oasc.Config.<init> loaded config solrconfig.xml with version 0 
   [junit4]   2> 675691 T2681 C:collection1 c:collection1 oasc.SolrConfig.refreshRequestParams current version of requestparams : -1
   [junit4]   2> 675707 T2681 C:collection1 c:collection1 oasc.SolrConfig.<init> Using Lucene MatchVersion: 5.2.0
   [junit4]   2> 675742 T2681 C:collection1 c:collection1 oasc.SolrConfig.<init> Loaded SolrConfig: solrconfig.xml
   [junit4]   2> 675843 T2681 C:collection1 c:collection1 oass.IndexSchema.readSchema Reading Solr Schema from /configs/conf1/schema.xml
   [junit4]   2> 675850 T2681 C:collection1 c:collection1 oass.IndexSchema.readSchema [collection1] Schema name=test
   [junit4]   2> 676167 T2681 C:collection1 c:collection1 oass.OpenExchangeRatesOrgProvider.init Initialized with rates=open-exchange-rates.json, refreshInterval=1440.
   [junit4]   2> 676181 T2681 C:collection1 c:collection1 oass.IndexSchema.readSchema default search field in schema is text
   [junit4]   2> 676183 T2681 C:collection1 c:collection1 oass.IndexSchema.readSchema unique key field: id
   [junit4]   2> 676191 T2681 C:collection1 c:collection1 oass.FileExchangeRateProvider.reload Reloading exchange rates from file currency.xml
   [junit4]   2> 676195 T2681 C:collection1 c:collection1 oass.FileExchangeRateProvider.reload Reloading exchange rates from file currency.xml
   [junit4]   2> 676198 T2681 C:collection1 c:collection1 oass.OpenExchangeRatesOrgProvider.reload Reloading exchange rates from open-exchange-rates.json
   [junit4]   2> 676199 T2681 C:collection1 c:collection1 oass.OpenExchangeRatesOrgProvider$OpenExchangeRates.<init> WARN Unknown key IMPORTANT NOTE
   [junit4]   2> 676199 T2681 C:collection1 c:collection1 oass.OpenExchangeRatesOrgProvider$OpenExchangeRates.<init> WARN Expected key, got STRING
   [junit4]   2> 676199 T2681 C:collection1 c:collection1 oass.OpenExchangeRatesOrgProvider.reload Reloading exchange rates from open-exchange-rates.json
   [junit4]   2> 676200 T2681 C:collection1 c:collection1 oass.OpenExchangeRatesOrgProvider$OpenExchangeRates.<init> WARN Unknown key IMPORTANT NOTE
   [junit4]   2> 676200 T2681 C:collection1 c:collection1 oass.OpenExchangeRatesOrgProvider$OpenExchangeRates.<init> WARN Expected key, got STRING
   [junit4]   2> 676200 T2681 C:collection1 c:collection1 oasc.CoreContainer.create Creating SolrCore 'collection1' using configuration from collection collection1
   [junit4]   2> 676200 T2681 C:collection1 c:collection1 oasc.SolrCore.initDirectoryFactory org.apache.solr.core.MockDirectoryFactory
   [junit4]   2> 676201 T2681 C:collection1 c:collection1 oasc.SolrCore.<init> [collection1] Opening new SolrCore at /usr/home/jenkins/jenkins-slave/workspace/Lucene-Solr-Tests-5.x-Java7/solr/build/solr-core/test/J0/temp/solr.cloud.ReplicationFactorTest 12A3AA716553D370-001/shard-1-001/cores/collection1/, dataDir=/usr/home/jenkins/jenkins-slave/workspace/Lucene-Solr-Tests-5.x-Java7/solr/build/solr-core/test/J0/temp/solr.cloud.ReplicationFactorTest 12A3AA716553D370-001/shard-1-001/cores/collection1/data/
   [junit4]   2> 676201 T2681 C:collection1 c:collection1 oasc.JmxMonitoredMap.<init> JMX monitoring is enabled. Adding Solr mbeans to JMX Server: com.sun.jmx.mbeanserver.JmxMBeanServer@3e6cd229
   [junit4]   2> 676201 T2681 C:collection1 c:collection1 oasc.CachingDirectoryFactory.get return new directory for /usr/home/jenkins/jenkins-slave/workspace/Lucene-Solr-Tests-5.x-Java7/solr/build/solr-core/test/J0/temp/solr.cloud.ReplicationFactorTest 12A3AA716553D370-001/shard-1-001/cores/collection1/data
   [junit4]   2> 676202 T2681 C:collection1 c:collection1 oasc.SolrCore.getNewIndexDir New index directory detected: old=null new=/usr/home/jenkins/jenkins-slave/workspace/Lucene-Solr-Tests-5.x-Java7/solr/build/solr-core/test/J0/temp/solr.cloud.ReplicationFactorTest 12A3AA716553D370-001/shard-1-001/cores/collection1/data/index/
   [junit4]   2> 676202 T2681 C:collection1 c:collection1 oasc.SolrCore.initIndex WARN [collection1] Solr index directory '/usr/home/jenkins/jenkins-slave/workspace/Lucene-Solr-Tests-5.x-Java7/solr/build/solr-core/test/J0/temp/solr.cloud.ReplicationFactorTest 12A3AA716553D370-001/shard-1-001/cores/collection1/data/index' doesn't exist. Creating new index...
   [junit4]   2> 676202 T2681 C:collection1 c:collection1 oasc.CachingDirectoryFactory.get return new directory for /usr/home/jenkins/jenkins-slave/workspace/Lucene-Solr-Tests-5.x-Java7/solr/build/solr-core/test/J0/temp/solr.cloud.ReplicationFactorTest 12A3AA716553D370-001/shard-1-001/cores/collection1/data/index
   [junit4]   2> 676203 T2681 C:collection1 c:collection1 oasu.RandomMergePolicy.<init> RandomMergePolicy wrapping class org.apache.lucene.index.TieredMergePolicy: [TieredMergePolicy: maxMergeAtOnce=42, maxMergeAtOnceExplicit=46, maxMergedSegmentMB=63.03515625, floorSegmentMB=1.435546875, forceMergeDeletesPctAllowed=5.447954420730018, segmentsPerTier=23.0, maxCFSSegmentSizeMB=8.796093022207999E12, noCFSRatio=1.0
   [junit4]   2> 676203 T2681 C:collection1 c:collection1 oasc.SolrDeletionPolicy.onCommit SolrDeletionPolicy.onCommit: commits: num=1
   [junit4]   2> 		commit{dir=MockDirectoryWrapper(RAMDirectory@5043cc65 lockFactory=org.apache.lucene.store.SingleInstanceLockFactory@1320240e),segFN=segments_1,generation=1}
   [junit4]   2> 676203 T2681 C:collection1 c:collection1 oasc.SolrDeletionPolicy.updateCommits newest commit generation = 1
   [junit4]   2> 676208 T2681 C:collection1 c:collection1 oasup.UpdateRequestProcessorChain.init creating updateRequestProcessorChain "nodistrib"
   [junit4]   2> 676209 T2681 C:collection1 c:collection1 oasup.UpdateRequestProcessorChain.init creating updateRequestProcessorChain "dedupe"
   [junit4]   2> 676209 T2681 C:collection1 c:collection1 oasup.UpdateRequestProcessorChain.init inserting DistributedUpdateProcessorFactory into updateRequestProcessorChain "dedupe"
   [junit4]   2> 676209 T2681 C:collection1 c:collection1 oasup.UpdateRequestProcessorChain.init creating updateRequestProcessorChain "stored_sig"
   [junit4]   2> 676209 T2681 C:collection1 c:collection1 oasup.UpdateRequestProcessorChain.init inserting DistributedUpdateProcessorFactory into updateRequestProcessorChain "stored_sig"
   [junit4]   2> 676209 T2681 C:collection1 c:collection1 oasup.UpdateRequestProcessorChain.init creating updateRequestProcessorChain "distrib-dup-test-chain-explicit"
   [junit4]   2> 676210 T2681 C:collection1 c:collection1 oasup.UpdateRequestProcessorChain.init creating updateRequestProcessorChain "distrib-dup-test-chain-implicit"
   [junit4]   2> 676210 T2681 C:collection1 c:collection1 oasup.UpdateRequestProcessorChain.init inserting DistributedUpdateProcessorFactory into updateRequestProcessorChain "distrib-dup-test-chain-implicit"
   [junit4]   2> 676210 T2681 C:collection1 c:collection1 oasc.SolrCore.loadUpdateProcessorChains no updateRequestProcessorChain defined as default, creating implicit default
   [junit4]   2> 676236 T2681 C:collection1 c:collection1 oashl.XMLLoader.init xsltCacheLifetimeSeconds=60
   [junit4]   2> 676239 T2681 C:collection1 c:collection1 oashl.XMLLoader.init xsltCacheLifetimeSeconds=60
   [junit4]   2> 676240 T2681 C:collection1 c:collection1 oashl.XMLLoader.init xsltCacheLifetimeSeconds=60
   [junit4]   2> 676242 T2681 C:collection1 c:collection1 oashl.XMLLoader.init xsltCacheLifetimeSeconds=60
   [junit4]   2> 676248 T2681 C:collection1 c:collection1 oasc.RequestHandlers.initHandlersFromConfig Registered paths: /admin/logging,/replication,/schema,/admin/segments,/admin/luke,/update/json/docs,/get,/admin/file,/update/json,/admin/properties,/admin/system,standard,/admin/plugins,/admin/mbeans,/admin/ping,/admin/threads,/update,/config,/update/csv
   [junit4]   2> 676250 T2681 C:collection1 c:collection1 oasc.SolrCore.initStatsCache Using default statsCache cache: org.apache.solr.search.stats.LocalStatsCache
   [junit4]   2> 676251 T2681 C:collection1 c:collection1 oasu.UpdateHandler.<init> Using UpdateLog implementation: org.apache.solr.update.UpdateLog
   [junit4]   2> 676251 T2681 C:collection1 c:collection1 oasu.UpdateLog.init Initializing UpdateLog: dataDir= defaultSyncLevel=FLUSH numRecordsToKeep=100 maxNumLogsToKeep=10
   [junit4]   2> 676252 T2681 C:collection1 c:collection1 oasu.CommitTracker.<init> Hard AutoCommit: disabled
   [junit4]   2> 676252 T2681 C:collection1 c:collection1 oasu.CommitTracker.<init> Soft AutoCommit: disabled
   [junit4]   2> 676253 T2681 C:collection1 c:collection1 oasu.RandomMergePolicy.<init> RandomMergePolicy wrapping class org.apache.lucene.index.TieredMergePolicy: [TieredMergePolicy: maxMergeAtOnce=17, maxMergeAt

[...truncated too long message...]

;done=false>>]
   [junit4]   2> 1643957 T5295 oasc.CachingDirectoryFactory.close Closing directory: /usr/home/jenkins/jenkins-slave/workspace/Lucene-Solr-Tests-5.x-Java7/solr/build/solr-core/test/J1/../../../../../../../../../../../usr/home/jenkins/jenkins-slave/workspace/Lucene-Solr-Tests-5.x-Java7/solr/build/solr-core/test/J1/temp/solr.cloud.TestCloudPivotFacet 12A3AA716553D370-001/shard-4-001/cores/collection1/data/index
   [junit4]   2> 1643959 T5131 C:control_collection S:shard1 c:collection1 oejsh.ContextHandler.doStop stopped o.e.j.s.ServletContextHandler{/_mlt/rs,null}
   [junit4]   2> 1644163 T5131 C:control_collection S:shard1 c:collection1 oasc.ZkTestServer.send4LetterWord connecting to 127.0.0.1:58148 58148
   [junit4]   2> 1644230 T5132 oasc.ZkTestServer.send4LetterWord connecting to 127.0.0.1:58148 58148
   [junit4]   2> 1644232 T5132 oasc.ZkTestServer$ZKServerMain.runFromConfig WARN Watch limit violations: 
   [junit4]   2> 	Maximum concurrent create/delete watches above limit:
   [junit4]   2> 	
   [junit4]   2> 		6	/solr/aliases.json
   [junit4]   2> 		6	/solr/clusterstate.json
   [junit4]   2> 		5	/solr/configs/conf1
   [junit4]   2> 		4	/solr/collections/collection1/state.json
   [junit4]   2> 	
   [junit4]   2> 	Maximum concurrent children watches above limit:
   [junit4]   2> 	
   [junit4]   2> 		6	/solr/live_nodes
   [junit4]   2> 		5	/solr/overseer/queue
   [junit4]   2> 		5	/solr/overseer/collection-queue-work
   [junit4]   2> 	
   [junit4]   2> NOTE: reproduce with: ant test  -Dtestcase=TestCloudPivotFacet -Dtests.method=test -Dtests.seed=12A3AA716553D370 -Dtests.multiplier=2 -Dtests.slow=true -Dtests.locale=vi -Dtests.timezone=Etc/GMT-11 -Dtests.asserts=true -Dtests.file.encoding=ISO-8859-1
   [junit4] FAILURE 52.3s J1 | TestCloudPivotFacet.test <<<
   [junit4]    > Throwable #1: java.lang.AssertionError: {main(facet=true&facet.pivot=%7B%21stats%3Dst3%7Dpivot_ti%2Cpivot_tl%2Cpivot_dt&facet.limit=16&facet.offset=3&facet.pivot.mincount=3&facet.missing=true&facet.sort=index&facet.overrequest.ratio=-1.1108205),extra(rows=0&q=*%3A*&fq=id%3A%5B*+TO+665%5D&stats=true&stats.field=%7B%21key%3Dsk1+tag%3Dst1%2Cst2%7Dpivot_tdt1&stats.field=%7B%21key%3Dsk2+tag%3Dst2%2Cst3%7Dpivot_ti&stats.field=%7B%21key%3Dsk3+tag%3Dst3%2Cst4%7Dpivot_tl1&_test_min=3&_test_miss=true&_test_sort=index)} ==> pivot_ti,pivot_tl,pivot_dt: {params(rows=0),defaults({main({main(rows=0&q=*%3A*&fq=id%3A%5B*+TO+665%5D&stats=true&stats.field=%7B%21key%3Dsk1+tag%3Dst1%2Cst2%7Dpivot_tdt1&stats.field=%7B%21key%3Dsk2+tag%3Dst2%2Cst3%7Dpivot_ti&stats.field=%7B%21key%3Dsk3+tag%3Dst3%2Cst4%7Dpivot_tl1&_test_min=3&_test_miss=true&_test_sort=index),extra(fq=%7B%21term+f%3Dpivot_ti%7D35)}),extra(fq=-pivot_tl%3A%5B*+TO+*%5D)})} expected:<4> but was:<5>
   [junit4]    > 	at __randomizedtesting.SeedInfo.seed([12A3AA716553D370:9AF795ABCBAFBE88]:0)
   [junit4]    > 	at org.apache.solr.cloud.TestCloudPivotFacet.assertPivotCountsAreCorrect(TestCloudPivotFacet.java:281)
   [junit4]    > 	at org.apache.solr.cloud.TestCloudPivotFacet.test(TestCloudPivotFacet.java:228)
   [junit4]    > 	at org.apache.solr.BaseDistributedSearchTestCase$ShardsRepeatRule$ShardsFixedStatement.callStatement(BaseDistributedSearchTestCase.java:960)
   [junit4]    > 	at org.apache.solr.BaseDistributedSearchTestCase$ShardsRepeatRule$ShardsStatement.evaluate(BaseDistributedSearchTestCase.java:935)
   [junit4]    > 	at java.lang.Thread.run(Thread.java:745)
   [junit4]    > Caused by: java.lang.AssertionError: pivot_ti,pivot_tl,pivot_dt: {params(rows=0),defaults({main({main(rows=0&q=*%3A*&fq=id%3A%5B*+TO+665%5D&stats=true&stats.field=%7B%21key%3Dsk1+tag%3Dst1%2Cst2%7Dpivot_tdt1&stats.field=%7B%21key%3Dsk2+tag%3Dst2%2Cst3%7Dpivot_ti&stats.field=%7B%21key%3Dsk3+tag%3Dst3%2Cst4%7Dpivot_tl1&_test_min=3&_test_miss=true&_test_sort=index),extra(fq=%7B%21term+f%3Dpivot_ti%7D35)}),extra(fq=-pivot_tl%3A%5B*+TO+*%5D)})} expected:<4> but was:<5>
   [junit4]    > 	at org.apache.solr.cloud.TestCloudPivotFacet.assertNumFound(TestCloudPivotFacet.java:677)
   [junit4]    > 	at org.apache.solr.cloud.TestCloudPivotFacet.assertPivotData(TestCloudPivotFacet.java:335)
   [junit4]    > 	at org.apache.solr.cloud.TestCloudPivotFacet.assertPivotCountsAreCorrect(TestCloudPivotFacet.java:302)
   [junit4]    > 	at org.apache.solr.cloud.TestCloudPivotFacet.assertPivotCountsAreCorrect(TestCloudPivotFacet.java:313)
   [junit4]    > 	at org.apache.solr.cloud.TestCloudPivotFacet.assertPivotCountsAreCorrect(TestCloudPivotFacet.java:271)
   [junit4]    > 	... 42 more
   [junit4]   2> 1644239 T5131 C:control_collection S:shard1 c:collection1 oas.SolrTestCaseJ4.deleteCore ###deleteCore
   [junit4]   2> NOTE: leaving temporary files on disk at: /usr/home/jenkins/jenkins-slave/workspace/Lucene-Solr-Tests-5.x-Java7/solr/build/solr-core/test/J1/temp/solr.cloud.TestCloudPivotFacet 12A3AA716553D370-001
   [junit4]   2> 52321 T5130 ccr.ThreadLeakControl.checkThreadLeaks WARNING Will linger awaiting termination of 1 leaked thread(s).
   [junit4]   2> NOTE: test params are: codec=Asserting(Lucene50): {pivot_ti=BlockTreeOrds(blocksize=128), pivot_b=FSTOrd50, pivot_z_s1=BlockTreeOrds(blocksize=128), pivot_tf1=BlockTreeOrds(blocksize=128), pivot_tdt1=PostingsFormat(name=Direct), pivot_tl1=PostingsFormat(name=Direct), pivot_z_s=FSTOrd50, pivot_f1=PostingsFormat(name=Direct), range_facet_l=PostingsFormat(name=Direct), id=Lucene50(blocksize=128), dense_pivot_y_s=BlockTreeOrds(blocksize=128), pivot_y_s1=FSTOrd50, _version_=BlockTreeOrds(blocksize=128), dense_pivot_x_s=Lucene50(blocksize=128), pivot_dt=FSTOrd50, multiDefault=PostingsFormat(name=Direct), dense_pivot_x_s1=PostingsFormat(name=Direct), pivot_x_s=Lucene50(blocksize=128), pivot_y_s=PostingsFormat(name=Direct), pivot_b1=PostingsFormat(name=Direct), pivot_ti1=Lucene50(blocksize=128), pivot_i=PostingsFormat(name=Direct), dense_pivot_ti=BlockTreeOrds(blocksize=128), dense_pivot_i1=FSTOrd50, intDefault=BlockTreeOrds(blocksize=128), dense_pivot_ti1=Lucene50(blocksize=128), pivot_tl=FSTOrd50, pivot_f=FSTOrd50, pivot_d1=BlockTreeOrds(blocksize=128), pivot_tdt=Lucene50(blocksize=128), pivot_x_s1=PostingsFormat(name=Direct), pivot_td1=PostingsFormat(name=Direct), timestamp=PostingsFormat(name=Direct), dense_pivot_y_s1=FSTOrd50, pivot_dt1=PostingsFormat(name=Direct), pivot_tf=Lucene50(blocksize=128), pivot_l1=BlockTreeOrds(blocksize=128), dense_pivot_i=PostingsFormat(name=Direct), pivot_d=Lucene50(blocksize=128), pivot_l=Lucene50(blocksize=128), pivot_td=FSTOrd50, pivot_i1=FSTOrd50}, docValues:{timestamp=DocValuesFormat(name=Lucene50)}, sim=RandomSimilarityProvider(queryNorm=true,coord=crazy): {}, locale=vi, timezone=Etc/GMT-11
   [junit4]   2> NOTE: FreeBSD 9.1-RELEASE-p3 amd64/Oracle Corporation 1.7.0_65 (64-bit)/cpus=16,threads=1,free=88106264,total=255852544
   [junit4]   2> NOTE: All tests run in this JVM: [CoreAdminCreateDiscoverTest, TestReplicationHandlerBackup, TestReload, TestCryptoKeys, HdfsChaosMonkeySafeLeaderTest, UUIDUpdateProcessorFallbackTest, StressHdfsTest, ShardSplitTest, SolrInfoMBeanTest, DistributedFacetPivotLongTailTest, TestMaxScoreQueryParser, SpatialRPTFieldTypeTest, TestCursorMarkWithoutUniqueKey, TestManagedResourceStorage, OverseerTest, SystemInfoHandlerTest, TestOmitPositions, PluginInfoTest, SolrXmlInZkTest, DOMUtilTest, BinaryUpdateRequestHandlerTest, TestExpandComponent, BadComponentTest, SolrCoreCheckLockOnStartupTest, DeleteInactiveReplicaTest, CircularListTest, TestQueryUtils, InfoHandlerTest, RemoteQueryErrorTest, TestCloudManagedSchema, TestCloudInspectUtil, ActionThrottleTest, TestElisionMultitermQuery, SuggestComponentTest, TestInitParams, RequiredFieldsTest, DistributedFacetPivotWhiteBoxTest, PingRequestHandlerTest, DocValuesMissingTest, SpellingQueryConverterTest, SuggesterTSTTest, TestRandomFaceting, LeaderFailoverAfterPartitionTest, DirectSolrSpellCheckerTest, TestIBSimilarityFactory, TestJsonFacets, BasicZkTest, TestFieldSortValues, CoreAdminHandlerTest, SampleTest, JSONWriterTest, TestImplicitCoreProperties, TestConfig, CollectionsAPIDistributedZkTest, TestBlobHandler, TestMiniSolrCloudCluster, TriLevelCompositeIdRoutingTest, AssignTest, TestClusterStateMutator, LeaderInitiatedRecoveryOnCommitTest, RecoveryAfterSoftCommitTest, TestCloudPivotFacet]
   [junit4] Completed on J1 in 52.60s, 1 test, 1 failure <<< FAILURES!

[...truncated 685 lines...]
BUILD FAILED
/usr/home/jenkins/jenkins-slave/workspace/Lucene-Solr-Tests-5.x-Java7/build.xml:529: The following error occurred while executing this line:
/usr/home/jenkins/jenkins-slave/workspace/Lucene-Solr-Tests-5.x-Java7/build.xml:477: The following error occurred while executing this line:
/usr/home/jenkins/jenkins-slave/workspace/Lucene-Solr-Tests-5.x-Java7/build.xml:61: The following error occurred while executing this line:
/usr/home/jenkins/jenkins-slave/workspace/Lucene-Solr-Tests-5.x-Java7/extra-targets.xml:39: The following error occurred while executing this line:
/usr/home/jenkins/jenkins-slave/workspace/Lucene-Solr-Tests-5.x-Java7/solr/build.xml:191: The following error occurred while executing this line:
/usr/home/jenkins/jenkins-slave/workspace/Lucene-Solr-Tests-5.x-Java7/solr/common-build.xml:509: The following error occurred while executing this line:
/usr/home/jenkins/jenkins-slave/workspace/Lucene-Solr-Tests-5.x-Java7/lucene/common-build.xml:1370: The following error occurred while executing this line:
/usr/home/jenkins/jenkins-slave/workspace/Lucene-Solr-Tests-5.x-Java7/lucene/common-build.xml:976: There were test failures: 478 suites, 1902 tests, 3 errors, 1 failure, 61 ignored (21 assumptions)

Total time: 52 minutes 16 seconds
Build step 'Invoke Ant' marked build as failure
Archiving artifacts
Sending artifact delta relative to Lucene-Solr-Tests-5.x-Java7 #2431
Archived 5 artifacts
Archive block size is 32768
Received 0 blocks and 231424647 bytes
Compression is 0.0%
Took 43 sec
Recording test results
Email was triggered for: Failure
Sending email for trigger: Failure



Mime
View raw message