lucene-dev mailing list archives

Site index · List index
Message view « Date » · « Thread »
Top « Date » · « Thread »
From Apache Jenkins Server <jenk...@builds.apache.org>
Subject [JENKINS] Lucene-Solr-Tests-5.x-Java7 - Build # 2915 - Still Failing
Date Thu, 09 Apr 2015 05:22:56 GMT
Build: https://builds.apache.org/job/Lucene-Solr-Tests-5.x-Java7/2915/

1 tests failed.
REGRESSION:  org.apache.solr.cloud.RecoveryAfterSoftCommitTest.test

Error Message:
Didn't see all replicas for shard shard1 in collection1 come up within 30000 ms! ClusterState: {   "collection1":{     "shards":{"shard1":{         "range":"80000000-7fffffff",         "state":"active",         "replicas":{           "core_node1":{             "core":"collection1",             "state":"active",             "base_url":"http://127.0.0.1:30988/h/kg",             "node_name":"127.0.0.1:30988_h%2Fkg",             "leader":"true"},           "core_node2":{             "core":"collection1",             "state":"recovering",             "base_url":"http://127.0.0.1:45044/h/kg",             "node_name":"127.0.0.1:45044_h%2Fkg"}}}},     "maxShardsPerNode":"1",     "autoAddReplicas":"false",     "replicationFactor":"1",     "autoCreated":"true",     "router":{"name":"compositeId"}},   "control_collection":{     "shards":{"shard1":{         "range":"80000000-7fffffff",         "state":"active",         "replicas":{"core_node1":{             "core":"collection1",             "state":"active",             "base_url":"http://127.0.0.1:57657/h/kg",             "node_name":"127.0.0.1:57657_h%2Fkg",             "leader":"true"}}}},     "maxShardsPerNode":"1",     "autoAddReplicas":"false",     "replicationFactor":"1",     "autoCreated":"true",     "router":{"name":"compositeId"}}}

Stack Trace:
java.lang.AssertionError: Didn't see all replicas for shard shard1 in collection1 come up within 30000 ms! ClusterState: {
  "collection1":{
    "shards":{"shard1":{
        "range":"80000000-7fffffff",
        "state":"active",
        "replicas":{
          "core_node1":{
            "core":"collection1",
            "state":"active",
            "base_url":"http://127.0.0.1:30988/h/kg",
            "node_name":"127.0.0.1:30988_h%2Fkg",
            "leader":"true"},
          "core_node2":{
            "core":"collection1",
            "state":"recovering",
            "base_url":"http://127.0.0.1:45044/h/kg",
            "node_name":"127.0.0.1:45044_h%2Fkg"}}}},
    "maxShardsPerNode":"1",
    "autoAddReplicas":"false",
    "replicationFactor":"1",
    "autoCreated":"true",
    "router":{"name":"compositeId"}},
  "control_collection":{
    "shards":{"shard1":{
        "range":"80000000-7fffffff",
        "state":"active",
        "replicas":{"core_node1":{
            "core":"collection1",
            "state":"active",
            "base_url":"http://127.0.0.1:57657/h/kg",
            "node_name":"127.0.0.1:57657_h%2Fkg",
            "leader":"true"}}}},
    "maxShardsPerNode":"1",
    "autoAddReplicas":"false",
    "replicationFactor":"1",
    "autoCreated":"true",
    "router":{"name":"compositeId"}}}
	at __randomizedtesting.SeedInfo.seed([6F561FCF85559A56:E70220152BA9F7AE]:0)
	at org.junit.Assert.fail(Assert.java:93)
	at org.apache.solr.cloud.AbstractFullDistribZkTestBase.ensureAllReplicasAreActive(AbstractFullDistribZkTestBase.java:1920)
	at org.apache.solr.cloud.RecoveryAfterSoftCommitTest.test(RecoveryAfterSoftCommitTest.java:102)
	at sun.reflect.NativeMethodAccessorImpl.invoke0(Native Method)
	at sun.reflect.NativeMethodAccessorImpl.invoke(NativeMethodAccessorImpl.java:57)
	at sun.reflect.DelegatingMethodAccessorImpl.invoke(DelegatingMethodAccessorImpl.java:43)
	at java.lang.reflect.Method.invoke(Method.java:606)
	at com.carrotsearch.randomizedtesting.RandomizedRunner.invoke(RandomizedRunner.java:1627)
	at com.carrotsearch.randomizedtesting.RandomizedRunner$6.evaluate(RandomizedRunner.java:836)
	at com.carrotsearch.randomizedtesting.RandomizedRunner$7.evaluate(RandomizedRunner.java:872)
	at com.carrotsearch.randomizedtesting.RandomizedRunner$8.evaluate(RandomizedRunner.java:886)
	at org.apache.solr.BaseDistributedSearchTestCase$ShardsRepeatRule$ShardsFixedStatement.callStatement(BaseDistributedSearchTestCase.java:960)
	at org.apache.solr.BaseDistributedSearchTestCase$ShardsRepeatRule$ShardsStatement.evaluate(BaseDistributedSearchTestCase.java:935)
	at com.carrotsearch.randomizedtesting.rules.SystemPropertiesRestoreRule$1.evaluate(SystemPropertiesRestoreRule.java:53)
	at org.apache.lucene.util.TestRuleSetupTeardownChained$1.evaluate(TestRuleSetupTeardownChained.java:50)
	at org.apache.lucene.util.AbstractBeforeAfterRule$1.evaluate(AbstractBeforeAfterRule.java:46)
	at org.apache.lucene.util.TestRuleThreadAndTestName$1.evaluate(TestRuleThreadAndTestName.java:49)
	at org.apache.lucene.util.TestRuleIgnoreAfterMaxFailures$1.evaluate(TestRuleIgnoreAfterMaxFailures.java:65)
	at org.apache.lucene.util.TestRuleMarkFailure$1.evaluate(TestRuleMarkFailure.java:48)
	at com.carrotsearch.randomizedtesting.rules.StatementAdapter.evaluate(StatementAdapter.java:36)
	at com.carrotsearch.randomizedtesting.ThreadLeakControl$StatementRunner.run(ThreadLeakControl.java:365)
	at com.carrotsearch.randomizedtesting.ThreadLeakControl.forkTimeoutingTask(ThreadLeakControl.java:798)
	at com.carrotsearch.randomizedtesting.ThreadLeakControl$3.evaluate(ThreadLeakControl.java:458)
	at com.carrotsearch.randomizedtesting.RandomizedRunner.runSingleTest(RandomizedRunner.java:845)
	at com.carrotsearch.randomizedtesting.RandomizedRunner$3.evaluate(RandomizedRunner.java:747)
	at com.carrotsearch.randomizedtesting.RandomizedRunner$4.evaluate(RandomizedRunner.java:781)
	at com.carrotsearch.randomizedtesting.RandomizedRunner$5.evaluate(RandomizedRunner.java:792)
	at com.carrotsearch.randomizedtesting.rules.StatementAdapter.evaluate(StatementAdapter.java:36)
	at com.carrotsearch.randomizedtesting.rules.SystemPropertiesRestoreRule$1.evaluate(SystemPropertiesRestoreRule.java:53)
	at org.apache.lucene.util.AbstractBeforeAfterRule$1.evaluate(AbstractBeforeAfterRule.java:46)
	at com.carrotsearch.randomizedtesting.rules.StatementAdapter.evaluate(StatementAdapter.java:36)
	at org.apache.lucene.util.TestRuleStoreClassName$1.evaluate(TestRuleStoreClassName.java:42)
	at com.carrotsearch.randomizedtesting.rules.NoShadowingOrOverridesOnMethodsRule$1.evaluate(NoShadowingOrOverridesOnMethodsRule.java:39)
	at com.carrotsearch.randomizedtesting.rules.NoShadowingOrOverridesOnMethodsRule$1.evaluate(NoShadowingOrOverridesOnMethodsRule.java:39)
	at com.carrotsearch.randomizedtesting.rules.StatementAdapter.evaluate(StatementAdapter.java:36)
	at com.carrotsearch.randomizedtesting.rules.StatementAdapter.evaluate(StatementAdapter.java:36)
	at com.carrotsearch.randomizedtesting.rules.StatementAdapter.evaluate(StatementAdapter.java:36)
	at org.apache.lucene.util.TestRuleAssertionsRequired$1.evaluate(TestRuleAssertionsRequired.java:54)
	at org.apache.lucene.util.TestRuleMarkFailure$1.evaluate(TestRuleMarkFailure.java:48)
	at org.apache.lucene.util.TestRuleIgnoreAfterMaxFailures$1.evaluate(TestRuleIgnoreAfterMaxFailures.java:65)
	at org.apache.lucene.util.TestRuleIgnoreTestSuites$1.evaluate(TestRuleIgnoreTestSuites.java:55)
	at com.carrotsearch.randomizedtesting.rules.StatementAdapter.evaluate(StatementAdapter.java:36)
	at com.carrotsearch.randomizedtesting.ThreadLeakControl$StatementRunner.run(ThreadLeakControl.java:365)
	at java.lang.Thread.run(Thread.java:745)




Build Log:
[...truncated 9383 lines...]
   [junit4] Suite: org.apache.solr.cloud.RecoveryAfterSoftCommitTest
   [junit4]   2> Creating dataDir: /usr/home/jenkins/jenkins-slave/workspace/Lucene-Solr-Tests-5.x-Java7/solr/build/solr-core/test/J3/temp/solr.cloud.RecoveryAfterSoftCommitTest 6F561FCF85559A56-001/init-core-data-001
   [junit4]   2> 208180 T322 oas.BaseDistributedSearchTestCase.initHostContext Setting hostContext system property: /h/kg
   [junit4]   2> 208192 T322 oasc.ZkTestServer.run STARTING ZK TEST SERVER
   [junit4]   1> client port:0.0.0.0/0.0.0.0:0
   [junit4]   2> 208193 T323 oasc.ZkTestServer$ZKServerMain.runFromConfig Starting server
   [junit4]   2> 208292 T322 oasc.ZkTestServer.run start zk server on port:48644
   [junit4]   2> 208293 T322 oascc.SolrZkClient.createZkCredentialsToAddAutomatically Using default ZkCredentialsProvider
   [junit4]   2> 208294 T322 oascc.ConnectionManager.waitForConnected Waiting for client to connect to ZooKeeper
   [junit4]   2> 208299 T330 oascc.ConnectionManager.process Watcher org.apache.solr.common.cloud.ConnectionManager@5529d23e name:ZooKeeperConnection Watcher:127.0.0.1:48644 got event WatchedEvent state:SyncConnected type:None path:null path:null type:None
   [junit4]   2> 208300 T322 oascc.ConnectionManager.waitForConnected Client is connected to ZooKeeper
   [junit4]   2> 208301 T322 oascc.SolrZkClient.createZkACLProvider Using default ZkACLProvider
   [junit4]   2> 208302 T322 oascc.SolrZkClient.makePath makePath: /solr
   [junit4]   2> 208306 T322 oascc.SolrZkClient.createZkCredentialsToAddAutomatically Using default ZkCredentialsProvider
   [junit4]   2> 208308 T322 oascc.ConnectionManager.waitForConnected Waiting for client to connect to ZooKeeper
   [junit4]   2> 208310 T333 oascc.ConnectionManager.process Watcher org.apache.solr.common.cloud.ConnectionManager@29f065a8 name:ZooKeeperConnection Watcher:127.0.0.1:48644/solr got event WatchedEvent state:SyncConnected type:None path:null path:null type:None
   [junit4]   2> 208310 T322 oascc.ConnectionManager.waitForConnected Client is connected to ZooKeeper
   [junit4]   2> 208311 T322 oascc.SolrZkClient.createZkACLProvider Using default ZkACLProvider
   [junit4]   2> 208312 T322 oascc.SolrZkClient.makePath makePath: /collections/collection1
   [junit4]   2> 208316 T322 oascc.SolrZkClient.makePath makePath: /collections/collection1/shards
   [junit4]   2> 208318 T322 oascc.SolrZkClient.makePath makePath: /collections/control_collection
   [junit4]   2> 208320 T322 oascc.SolrZkClient.makePath makePath: /collections/control_collection/shards
   [junit4]   2> 208325 T322 oasc.AbstractZkTestCase.putConfig put /usr/home/jenkins/jenkins-slave/workspace/Lucene-Solr-Tests-5.x-Java7/solr/core/src/test-files/solr/collection1/conf/solrconfig-tlog.xml to /configs/conf1/solrconfig.xml
   [junit4]   2> 208326 T322 oascc.SolrZkClient.makePath makePath: /configs/conf1/solrconfig.xml
   [junit4]   2> 208330 T322 oasc.AbstractZkTestCase.putConfig put /usr/home/jenkins/jenkins-slave/workspace/Lucene-Solr-Tests-5.x-Java7/solr/core/src/test-files/solr/collection1/conf/schema.xml to /configs/conf1/schema.xml
   [junit4]   2> 208331 T322 oascc.SolrZkClient.makePath makePath: /configs/conf1/schema.xml
   [junit4]   2> 208334 T322 oasc.AbstractZkTestCase.putConfig put /usr/home/jenkins/jenkins-slave/workspace/Lucene-Solr-Tests-5.x-Java7/solr/core/src/test-files/solr/collection1/conf/solrconfig.snippet.randomindexconfig.xml to /configs/conf1/solrconfig.snippet.randomindexconfig.xml
   [junit4]   2> 208336 T322 oascc.SolrZkClient.makePath makePath: /configs/conf1/solrconfig.snippet.randomindexconfig.xml
   [junit4]   2> 208339 T322 oasc.AbstractZkTestCase.putConfig put /usr/home/jenkins/jenkins-slave/workspace/Lucene-Solr-Tests-5.x-Java7/solr/core/src/test-files/solr/collection1/conf/stopwords.txt to /configs/conf1/stopwords.txt
   [junit4]   2> 208340 T322 oascc.SolrZkClient.makePath makePath: /configs/conf1/stopwords.txt
   [junit4]   2> 208343 T322 oasc.AbstractZkTestCase.putConfig put /usr/home/jenkins/jenkins-slave/workspace/Lucene-Solr-Tests-5.x-Java7/solr/core/src/test-files/solr/collection1/conf/protwords.txt to /configs/conf1/protwords.txt
   [junit4]   2> 208344 T322 oascc.SolrZkClient.makePath makePath: /configs/conf1/protwords.txt
   [junit4]   2> 208346 T322 oasc.AbstractZkTestCase.putConfig put /usr/home/jenkins/jenkins-slave/workspace/Lucene-Solr-Tests-5.x-Java7/solr/core/src/test-files/solr/collection1/conf/currency.xml to /configs/conf1/currency.xml
   [junit4]   2> 208347 T322 oascc.SolrZkClient.makePath makePath: /configs/conf1/currency.xml
   [junit4]   2> 208350 T322 oasc.AbstractZkTestCase.putConfig put /usr/home/jenkins/jenkins-slave/workspace/Lucene-Solr-Tests-5.x-Java7/solr/core/src/test-files/solr/collection1/conf/enumsConfig.xml to /configs/conf1/enumsConfig.xml
   [junit4]   2> 208351 T322 oascc.SolrZkClient.makePath makePath: /configs/conf1/enumsConfig.xml
   [junit4]   2> 208353 T322 oasc.AbstractZkTestCase.putConfig put /usr/home/jenkins/jenkins-slave/workspace/Lucene-Solr-Tests-5.x-Java7/solr/core/src/test-files/solr/collection1/conf/open-exchange-rates.json to /configs/conf1/open-exchange-rates.json
   [junit4]   2> 208354 T322 oascc.SolrZkClient.makePath makePath: /configs/conf1/open-exchange-rates.json
   [junit4]   2> 208356 T322 oasc.AbstractZkTestCase.putConfig put /usr/home/jenkins/jenkins-slave/workspace/Lucene-Solr-Tests-5.x-Java7/solr/core/src/test-files/solr/collection1/conf/mapping-ISOLatin1Accent.txt to /configs/conf1/mapping-ISOLatin1Accent.txt
   [junit4]   2> 208357 T322 oascc.SolrZkClient.makePath makePath: /configs/conf1/mapping-ISOLatin1Accent.txt
   [junit4]   2> 208360 T322 oasc.AbstractZkTestCase.putConfig put /usr/home/jenkins/jenkins-slave/workspace/Lucene-Solr-Tests-5.x-Java7/solr/core/src/test-files/solr/collection1/conf/old_synonyms.txt to /configs/conf1/old_synonyms.txt
   [junit4]   2> 208361 T322 oascc.SolrZkClient.makePath makePath: /configs/conf1/old_synonyms.txt
   [junit4]   2> 208364 T322 oasc.AbstractZkTestCase.putConfig put /usr/home/jenkins/jenkins-slave/workspace/Lucene-Solr-Tests-5.x-Java7/solr/core/src/test-files/solr/collection1/conf/synonyms.txt to /configs/conf1/synonyms.txt
   [junit4]   2> 208364 T322 oascc.SolrZkClient.makePath makePath: /configs/conf1/synonyms.txt
   [junit4]   2> 210925 T322 oas.SolrTestCaseJ4.writeCoreProperties Writing core.properties file to /usr/home/jenkins/jenkins-slave/workspace/Lucene-Solr-Tests-5.x-Java7/solr/build/solr-core/test/J3/temp/solr.cloud.RecoveryAfterSoftCommitTest 6F561FCF85559A56-001/control-001/cores/collection1
   [junit4]   2> 210931 T322 oejs.Server.doStart jetty-8.1.10.v20130312
   [junit4]   2> 210937 T322 oejs.AbstractConnector.doStart Started SocketConnector@127.0.0.1:58650
   [junit4]   2> 210937 T322 oascse.JettySolrRunner$1.lifeCycleStarted Jetty properties: {hostContext=/h/kg, coreRootDirectory=/usr/home/jenkins/jenkins-slave/workspace/Lucene-Solr-Tests-5.x-Java7/solr/build/solr-core/test/J3/temp/solr.cloud.RecoveryAfterSoftCommitTest 6F561FCF85559A56-001/control-001/cores, solr.data.dir=/usr/home/jenkins/jenkins-slave/workspace/Lucene-Solr-Tests-5.x-Java7/solr/build/solr-core/test/J3/temp/solr.cloud.RecoveryAfterSoftCommitTest 6F561FCF85559A56-001/tempDir-001/control/data, hostPort=57657}
   [junit4]   2> 210938 T322 oass.SolrDispatchFilter.init SolrDispatchFilter.init()sun.misc.Launcher$AppClassLoader@3c56b64c
   [junit4]   2> 210939 T322 oasc.SolrResourceLoader.<init> new SolrResourceLoader for directory: '/usr/home/jenkins/jenkins-slave/workspace/Lucene-Solr-Tests-5.x-Java7/solr/build/solr-core/test/J3/temp/solr.cloud.RecoveryAfterSoftCommitTest 6F561FCF85559A56-001/control-001/'
   [junit4]   2> 211003 T322 oasc.SolrXmlConfig.fromFile Loading container configuration from /usr/home/jenkins/jenkins-slave/workspace/Lucene-Solr-Tests-5.x-Java7/solr/build/solr-core/test/J3/temp/solr.cloud.RecoveryAfterSoftCommitTest 6F561FCF85559A56-001/control-001/solr.xml
   [junit4]   2> 211082 T322 oasc.CorePropertiesLocator.<init> Config-defined core root directory: /usr/home/jenkins/jenkins-slave/workspace/Lucene-Solr-Tests-5.x-Java7/solr/build/solr-core/test/J3/temp/solr.cloud.RecoveryAfterSoftCommitTest 6F561FCF85559A56-001/control-001/cores
   [junit4]   2> 211082 T322 oasc.CoreContainer.<init> New CoreContainer 847984524
   [junit4]   2> 211083 T322 oasc.CoreContainer.load Loading cores into CoreContainer [instanceDir=/usr/home/jenkins/jenkins-slave/workspace/Lucene-Solr-Tests-5.x-Java7/solr/build/solr-core/test/J3/temp/solr.cloud.RecoveryAfterSoftCommitTest 6F561FCF85559A56-001/control-001/]
   [junit4]   2> 211083 T322 oasc.CoreContainer.load loading shared library: /usr/home/jenkins/jenkins-slave/workspace/Lucene-Solr-Tests-5.x-Java7/solr/build/solr-core/test/J3/temp/solr.cloud.RecoveryAfterSoftCommitTest 6F561FCF85559A56-001/control-001/lib
   [junit4]   2> 211085 T322 oasc.SolrResourceLoader.addToClassLoader WARN Can't find (or read) directory to add to classloader: lib (resolved as: /usr/home/jenkins/jenkins-slave/workspace/Lucene-Solr-Tests-5.x-Java7/solr/build/solr-core/test/J3/temp/solr.cloud.RecoveryAfterSoftCommitTest 6F561FCF85559A56-001/control-001/lib).
   [junit4]   2> 211101 T322 oashc.HttpShardHandlerFactory.getParameter Setting socketTimeout to: 90000
   [junit4]   2> 211101 T322 oashc.HttpShardHandlerFactory.getParameter Setting urlScheme to: 
   [junit4]   2> 211102 T322 oashc.HttpShardHandlerFactory.getParameter Setting connTimeout to: 15000
   [junit4]   2> 211102 T322 oashc.HttpShardHandlerFactory.getParameter Setting maxConnectionsPerHost to: 20
   [junit4]   2> 211103 T322 oashc.HttpShardHandlerFactory.getParameter Setting maxConnections to: 10000
   [junit4]   2> 211103 T322 oashc.HttpShardHandlerFactory.getParameter Setting corePoolSize to: 0
   [junit4]   2> 211104 T322 oashc.HttpShardHandlerFactory.getParameter Setting maximumPoolSize to: 2147483647
   [junit4]   2> 211104 T322 oashc.HttpShardHandlerFactory.getParameter Setting maxThreadIdleTime to: 5
   [junit4]   2> 211104 T322 oashc.HttpShardHandlerFactory.getParameter Setting sizeOfQueue to: -1
   [junit4]   2> 211105 T322 oashc.HttpShardHandlerFactory.getParameter Setting fairnessPolicy to: false
   [junit4]   2> 211106 T322 oashc.HttpShardHandlerFactory.getParameter Setting useRetries to: false
   [junit4]   2> 211116 T322 oasu.UpdateShardHandler.<init> Creating UpdateShardHandler HTTP client with params: socketTimeout=340000&connTimeout=45000&retry=true
   [junit4]   2> 211118 T322 oasl.LogWatcher.createWatcher SLF4J impl is org.slf4j.impl.Log4jLoggerFactory
   [junit4]   2> 211119 T322 oasl.LogWatcher.newRegisteredLogWatcher Registering Log Listener [Log4j (org.slf4j.impl.Log4jLoggerFactory)]
   [junit4]   2> 211119 T322 oasc.CoreContainer.load Node Name: 127.0.0.1
   [junit4]   2> 211119 T322 oasc.ZkContainer.initZooKeeper Zookeeper client=127.0.0.1:48644/solr
   [junit4]   2> 211120 T322 oasc.ZkController.checkChrootPath zkHost includes chroot
   [junit4]   2> 211121 T322 oascc.SolrZkClient.createZkCredentialsToAddAutomatically Using default ZkCredentialsProvider
   [junit4]   2> 211122 T322 oascc.ConnectionManager.waitForConnected Waiting for client to connect to ZooKeeper
   [junit4]   2> 211124 T345 oascc.ConnectionManager.process Watcher org.apache.solr.common.cloud.ConnectionManager@7b33f19f name:ZooKeeperConnection Watcher:127.0.0.1:48644 got event WatchedEvent state:SyncConnected type:None path:null path:null type:None
   [junit4]   2> 211125 T322 oascc.ConnectionManager.waitForConnected Client is connected to ZooKeeper
   [junit4]   2> 211126 T322 oascc.SolrZkClient.createZkACLProvider Using default ZkACLProvider
   [junit4]   2> 211129 T322 oascc.ConnectionManager.waitForConnected Waiting for client to connect to ZooKeeper
   [junit4]   2> 211131 T348 oascc.ConnectionManager.process Watcher org.apache.solr.common.cloud.ConnectionManager@38433773 name:ZooKeeperConnection Watcher:127.0.0.1:48644/solr got event WatchedEvent state:SyncConnected type:None path:null path:null type:None
   [junit4]   2> 211132 T322 oascc.ConnectionManager.waitForConnected Client is connected to ZooKeeper
   [junit4]   2> 211134 T322 oascc.SolrZkClient.makePath makePath: /overseer/queue
   [junit4]   2> 211136 T322 oascc.SolrZkClient.makePath makePath: /overseer/collection-queue-work
   [junit4]   2> 211139 T322 oascc.SolrZkClient.makePath makePath: /overseer/collection-map-running
   [junit4]   2> 211141 T322 oascc.SolrZkClient.makePath makePath: /overseer/collection-map-completed
   [junit4]   2> 211143 T322 oascc.SolrZkClient.makePath makePath: /overseer/collection-map-failure
   [junit4]   2> 211145 T322 oascc.SolrZkClient.makePath makePath: /live_nodes
   [junit4]   2> 211147 T322 oascc.SolrZkClient.makePath makePath: /aliases.json
   [junit4]   2> 211149 T322 oascc.SolrZkClient.makePath makePath: /clusterstate.json
   [junit4]   2> 211150 T322 oasc.ZkController.createEphemeralLiveNode Register node as live in ZooKeeper:/live_nodes/127.0.0.1:57657_h%2Fkg
   [junit4]   2> 211151 T322 oascc.SolrZkClient.makePath makePath: /live_nodes/127.0.0.1:57657_h%2Fkg
   [junit4]   2> 211153 T322 oascc.SolrZkClient.makePath makePath: /overseer_elect
   [junit4]   2> 211155 T322 oascc.SolrZkClient.makePath makePath: /overseer_elect/election
   [junit4]   2> 211156 T322 oasc.Overseer.close Overseer (id=null) closing
   [junit4]   2> 211158 T322 oasc.OverseerElectionContext.runLeaderProcess I am going to be the leader 127.0.0.1:57657_h%2Fkg
   [junit4]   2> 211158 T322 oascc.SolrZkClient.makePath makePath: /overseer_elect/leader
   [junit4]   2> 211160 T322 oasc.Overseer.start Overseer (id=93621668344889347-127.0.0.1:57657_h%2Fkg-n_0000000000) starting
   [junit4]   2> 211163 T322 oascc.SolrZkClient.makePath makePath: /overseer/queue-work
   [junit4]   2> 211169 T322 oasc.OverseerAutoReplicaFailoverThread.<init> Starting OverseerAutoReplicaFailoverThread autoReplicaFailoverWorkLoopDelay=10000 autoReplicaFailoverWaitAfterExpiration=30000 autoReplicaFailoverBadNodeExpiration=60000
   [junit4]   2> 211170 T350 oasc.OverseerCollectionProcessor.run Process current queue of collection creations
   [junit4]   2> 211170 T349 oasc.Overseer$ClusterStateUpdater.run Starting to work on the main queue
   [junit4]   2> 211170 T322 oascc.ZkStateReader.createClusterStateWatchersAndUpdate Updating cluster state from ZooKeeper... 
   [junit4]   2> 211175 T322 oasc.CorePropertiesLocator.discover Looking for core definitions underneath /usr/home/jenkins/jenkins-slave/workspace/Lucene-Solr-Tests-5.x-Java7/solr/build/solr-core/test/J3/temp/solr.cloud.RecoveryAfterSoftCommitTest 6F561FCF85559A56-001/control-001/cores
   [junit4]   2> 211183 T322 oasc.CoreDescriptor.<init> CORE DESCRIPTOR: {schema=schema.xml, instanceDir=/usr/home/jenkins/jenkins-slave/workspace/Lucene-Solr-Tests-5.x-Java7/solr/build/solr-core/test/J3/temp/solr.cloud.RecoveryAfterSoftCommitTest 6F561FCF85559A56-001/control-001/cores/collection1, shard=, coreNodeName=, name=collection1, dataDir=data/, absoluteInstDir=/usr/home/jenkins/jenkins-slave/workspace/Lucene-Solr-Tests-5.x-Java7/solr/build/solr-core/test/J3/temp/solr.cloud.RecoveryAfterSoftCommitTest 6F561FCF85559A56-001/control-001/cores/collection1/, config=solrconfig.xml, collection=control_collection, transient=false, loadOnStartup=true}
   [junit4]   2> 211183 T322 oasc.CorePropertiesLocator.discoverUnder Found core collection1 in /usr/home/jenkins/jenkins-slave/workspace/Lucene-Solr-Tests-5.x-Java7/solr/build/solr-core/test/J3/temp/solr.cloud.RecoveryAfterSoftCommitTest 6F561FCF85559A56-001/control-001/cores/collection1/
   [junit4]   2> 211184 T322 oasc.CorePropertiesLocator.discover Found 1 core definitions
   [junit4]   2> 211185 T352 C:control_collection c:collection1 oasc.ZkController.publish publishing core=collection1 state=down collection=control_collection
   [junit4]   2> 211185 T352 C:control_collection c:collection1 oasc.ZkController.publish numShards not found on descriptor - reading it from system property
   [junit4]   2> 211187 T352 C:control_collection c:collection1 oasc.ZkController.waitForCoreNodeName look for our core node name
   [junit4]   2> 211187 T348 oasc.DistributedQueue$LatchWatcher.process NodeChildrenChanged fired on path /overseer/queue state SyncConnected
   [junit4]   2> 211188 T349 oasc.Overseer$ClusterStateUpdater.run processMessage: queueSize: 1, message = {
   [junit4]   2> 	  "core":"collection1",
   [junit4]   2> 	  "collection":"control_collection",
   [junit4]   2> 	  "shard":null,
   [junit4]   2> 	  "state":"down",
   [junit4]   2> 	  "roles":null,
   [junit4]   2> 	  "numShards":"1",
   [junit4]   2> 	  "base_url":"http://127.0.0.1:57657/h/kg",
   [junit4]   2> 	  "node_name":"127.0.0.1:57657_h%2Fkg",
   [junit4]   2> 	  "operation":"state"} current state version: 0
   [junit4]   2> 211188 T349 oasco.ReplicaMutator.updateState Update state numShards=1 message={
   [junit4]   2> 	  "core":"collection1",
   [junit4]   2> 	  "collection":"control_collection",
   [junit4]   2> 	  "shard":null,
   [junit4]   2> 	  "state":"down",
   [junit4]   2> 	  "roles":null,
   [junit4]   2> 	  "numShards":"1",
   [junit4]   2> 	  "base_url":"http://127.0.0.1:57657/h/kg",
   [junit4]   2> 	  "node_name":"127.0.0.1:57657_h%2Fkg",
   [junit4]   2> 	  "operation":"state"}
   [junit4]   2> 211189 T349 oasco.ClusterStateMutator.createCollection building a new cName: control_collection
   [junit4]   2> 211189 T349 oasco.ReplicaMutator.updateState Assigning new node to shard shard=shard1
   [junit4]   2> 211190 T348 oascc.ZkStateReader$2.process A cluster state change: WatchedEvent state:SyncConnected type:NodeDataChanged path:/clusterstate.json, has occurred - updating... (live nodes size: 1)
   [junit4]   2> 212187 T352 C:control_collection c:collection1 oasc.ZkController.waitForShardId waiting to find shard id in clusterstate for collection1
   [junit4]   2> 212188 T352 C:control_collection c:collection1 oasc.ZkController.createCollectionZkNode Check for collection zkNode:control_collection
   [junit4]   2> 212188 T352 C:control_collection c:collection1 oasc.ZkController.createCollectionZkNode Collection zkNode exists
   [junit4]   2> 212189 T352 C:control_collection c:collection1 oascc.ZkStateReader.readConfigName Load collection config from:/collections/control_collection
   [junit4]   2> 212189 T352 C:control_collection c:collection1 oascc.ZkStateReader.readConfigName path=/collections/control_collection configName=conf1 specified config exists in ZooKeeper
   [junit4]   2> 212190 T352 C:control_collection c:collection1 oasc.SolrResourceLoader.<init> new SolrResourceLoader for directory: '/usr/home/jenkins/jenkins-slave/workspace/Lucene-Solr-Tests-5.x-Java7/solr/build/solr-core/test/J3/temp/solr.cloud.RecoveryAfterSoftCommitTest 6F561FCF85559A56-001/control-001/cores/collection1/'
   [junit4]   2> 212205 T352 C:control_collection c:collection1 oasc.ZkController.watchZKConfDir watch zkdir /configs/conf1
   [junit4]   2> 212207 T352 C:control_collection c:collection1 oasc.Config.<init> loaded config solrconfig.xml with version 0 
   [junit4]   2> 212218 T352 C:control_collection c:collection1 oasc.SolrConfig.refreshRequestParams current version of requestparams : -1
   [junit4]   2> 212246 T352 C:control_collection c:collection1 oasc.SolrConfig.<init> Using Lucene MatchVersion: 5.2.0
   [junit4]   2> 212334 T352 C:control_collection c:collection1 oasc.SolrConfig.<init> Loaded SolrConfig: solrconfig.xml
   [junit4]   2> 212336 T352 C:control_collection c:collection1 oass.IndexSchema.readSchema Reading Solr Schema from /configs/conf1/schema.xml
   [junit4]   2> 212352 T352 C:control_collection c:collection1 oass.IndexSchema.readSchema [collection1] Schema name=test
   [junit4]   2> 212772 T352 C:control_collection c:collection1 oass.OpenExchangeRatesOrgProvider.init Initialized with rates=open-exchange-rates.json, refreshInterval=1440.
   [junit4]   2> 212793 T352 C:control_collection c:collection1 oass.IndexSchema.readSchema default search field in schema is text
   [junit4]   2> 212796 T352 C:control_collection c:collection1 oass.IndexSchema.readSchema unique key field: id
   [junit4]   2> 212812 T352 C:control_collection c:collection1 oass.FileExchangeRateProvider.reload Reloading exchange rates from file currency.xml
   [junit4]   2> 212816 T352 C:control_collection c:collection1 oass.FileExchangeRateProvider.reload Reloading exchange rates from file currency.xml
   [junit4]   2> 212819 T352 C:control_collection c:collection1 oass.OpenExchangeRatesOrgProvider.reload Reloading exchange rates from open-exchange-rates.json
   [junit4]   2> 212820 T352 C:control_collection c:collection1 oass.OpenExchangeRatesOrgProvider$OpenExchangeRates.<init> WARN Unknown key IMPORTANT NOTE
   [junit4]   2> 212820 T352 C:control_collection c:collection1 oass.OpenExchangeRatesOrgProvider$OpenExchangeRates.<init> WARN Expected key, got STRING
   [junit4]   2> 212820 T352 C:control_collection c:collection1 oass.OpenExchangeRatesOrgProvider.reload Reloading exchange rates from open-exchange-rates.json
   [junit4]   2> 212821 T352 C:control_collection c:collection1 oass.OpenExchangeRatesOrgProvider$OpenExchangeRates.<init> WARN Unknown key IMPORTANT NOTE
   [junit4]   2> 212821 T352 C:control_collection c:collection1 oass.OpenExchangeRatesOrgProvider$OpenExchangeRates.<init> WARN Expected key, got STRING
   [junit4]   2> 212821 T352 C:control_collection c:collection1 oasc.CoreContainer.create Creating SolrCore 'collection1' using configuration from collection control_collection
   [junit4]   2> 212822 T352 C:control_collection c:collection1 oasc.SolrCore.initDirectoryFactory org.apache.solr.core.MockDirectoryFactory
   [junit4]   2> 212822 T352 C:control_collection c:collection1 oasc.SolrCore.<init> [collection1] Opening new SolrCore at /usr/home/jenkins/jenkins-slave/workspace/Lucene-Solr-Tests-5.x-Java7/solr/build/solr-core/test/J3/temp/solr.cloud.RecoveryAfterSoftCommitTest 6F561FCF85559A56-001/control-001/cores/collection1/, dataDir=/usr/home/jenkins/jenkins-slave/workspace/Lucene-Solr-Tests-5.x-Java7/solr/build/solr-core/test/J3/temp/solr.cloud.RecoveryAfterSoftCommitTest 6F561FCF85559A56-001/control-001/cores/collection1/data/
   [junit4]   2> 212823 T352 C:control_collection c:collection1 oasc.JmxMonitoredMap.<init> JMX monitoring is enabled. Adding Solr mbeans to JMX Server: com.sun.jmx.mbeanserver.JmxMBeanServer@62f98b99
   [junit4]   2> 212823 T352 C:control_collection c:collection1 oasc.CachingDirectoryFactory.get return new directory for /usr/home/jenkins/jenkins-slave/workspace/Lucene-Solr-Tests-5.x-Java7/solr/build/solr-core/test/J3/temp/solr.cloud.RecoveryAfterSoftCommitTest 6F561FCF85559A56-001/control-001/cores/collection1/data
   [junit4]   2> 212824 T352 C:control_collection c:collection1 oasc.SolrCore.getNewIndexDir New index directory detected: old=null new=/usr/home/jenkins/jenkins-slave/workspace/Lucene-Solr-Tests-5.x-Java7/solr/build/solr-core/test/J3/temp/solr.cloud.RecoveryAfterSoftCommitTest 6F561FCF85559A56-001/control-001/cores/collection1/data/index/
   [junit4]   2> 212824 T352 C:control_collection c:collection1 oasc.SolrCore.initIndex WARN [collection1] Solr index directory '/usr/home/jenkins/jenkins-slave/workspace/Lucene-Solr-Tests-5.x-Java7/solr/build/solr-core/test/J3/temp/solr.cloud.RecoveryAfterSoftCommitTest 6F561FCF85559A56-001/control-001/cores/collection1/data/index' doesn't exist. Creating new index...
   [junit4]   2> 212824 T352 C:control_collection c:collection1 oasc.CachingDirectoryFactory.get return new directory for /usr/home/jenkins/jenkins-slave/workspace/Lucene-Solr-Tests-5.x-Java7/solr/build/solr-core/test/J3/temp/solr.cloud.RecoveryAfterSoftCommitTest 6F561FCF85559A56-001/control-001/cores/collection1/data/index
   [junit4]   2> 212825 T352 C:control_collection c:collection1 oasu.RandomMergePolicy.<init> RandomMergePolicy wrapping class org.apache.lucene.index.TieredMergePolicy: [TieredMergePolicy: maxMergeAtOnce=21, maxMergeAtOnceExplicit=42, maxMergedSegmentMB=88.0810546875, floorSegmentMB=1.7578125, forceMergeDeletesPctAllowed=4.679093429411079, segmentsPerTier=15.0, maxCFSSegmentSizeMB=8.796093022207999E12, noCFSRatio=1.0
   [junit4]   2> 212826 T352 C:control_collection c:collection1 oasc.SolrDeletionPolicy.onCommit SolrDeletionPolicy.onCommit: commits: num=1
   [junit4]   2> 		commit{dir=MockDirectoryWrapper(RAMDirectory@348d830c lockFactory=org.apache.lucene.store.SingleInstanceLockFactory@3696a3c8),segFN=segments_1,generation=1}
   [junit4]   2> 212826 T352 C:control_collection c:collection1 oasc.SolrDeletionPolicy.updateCommits newest commit generation = 1
   [junit4]   2> 212840 T352 C:control_collection c:collection1 oasup.UpdateRequestProcessorChain.init creating updateRequestProcessorChain "nodistrib"
   [junit4]   2> 212840 T352 C:control_collection c:collection1 oasup.UpdateRequestProcessorChain.init creating updateRequestProcessorChain "dedupe"
   [junit4]   2> 212841 T352 C:control_collection c:collection1 oasup.UpdateRequestProcessorChain.init inserting DistributedUpdateProcessorFactory into updateRequestProcessorChain "dedupe"
   [junit4]   2> 212841 T352 C:control_collection c:collection1 oasup.UpdateRequestProcessorChain.init creating updateRequestProcessorChain "stored_sig"
   [junit4]   2> 212841 T352 C:control_collection c:collection1 oasup.UpdateRequestProcessorChain.init inserting DistributedUpdateProcessorFactory into updateRequestProcessorChain "stored_sig"
   [junit4]   2> 212842 T352 C:control_collection c:collection1 oasup.UpdateRequestProcessorChain.init creating updateRequestProcessorChain "distrib-dup-test-chain-explicit"
   [junit4]   2> 212842 T352 C:control_collection c:collection1 oasup.UpdateRequestProcessorChain.init creating updateRequestProcessorChain "distrib-dup-test-chain-implicit"
   [junit4]   2> 212842 T352 C:control_collection c:collection1 oasup.UpdateRequestProcessorChain.init inserting DistributedUpdateProcessorFactory into updateRequestProcessorChain "distrib-dup-test-chain-implicit"
   [junit4]   2> 212843 T352 C:control_collection c:collection1 oasc.SolrCore.loadUpdateProcessorChains no updateRequestProcessorChain defined as default, creating implicit default
   [junit4]   2> 212855 T352 C:control_collection c:collection1 oashl.XMLLoader.init xsltCacheLifetimeSeconds=60
   [junit4]   2> 212857 T352 C:control_collection c:collection1 oashl.XMLLoader.init xsltCacheLifetimeSeconds=60
   [junit4]   2> 212858 T352 C:control_collection c:collection1 oashl.XMLLoader.init xsltCacheLifetimeSeconds=60
   [junit4]   2> 212860 T352 C:control_collection c:collection1 oashl.XMLLoader.init xsltCacheLifetimeSeconds=60
   [junit4]   2> 212868 T352 C:control_collection c:collection1 oasc.RequestHandlers.initHandlersFromConfig Registered paths: /admin/system,/admin/segments,/get,/update/json/docs,/update/csv,/admin/ping,/admin/file,/schema,/admin/properties,standard,/admin/luke,/config,/admin/mbeans,/update,/admin/logging,/admin/plugins,/update/json,/admin/threads,/replication
   [junit4]   2> 212874 T352 C:control_collection c:collection1 oasc.SolrCore.initStatsCache Using default statsCache cache: org.apache.solr.search.stats.LocalStatsCache
   [junit4]   2> 212876 T352 C:control_collection c:collection1 oasu.UpdateHandler.<init> Using UpdateLog implementation: org.apache.solr.update.UpdateLog
   [junit4]   2> 212876 T352 C:control_collection c:collection1 oasu.UpdateLog.init Initializing UpdateLog: dataDir= defaultSyncLevel=FLUSH numRecordsToKeep=100 maxNumLogsToKeep=10
   [junit4]   2> 212877 T352 C:control_collection c:collection1 oasu.CommitTracker.<init> Hard AutoCommit: disabled
   [junit4]   2> 212877 T352 C:control_collection c:collection1 oasu.CommitTracker.<init> Soft AutoCommit: disabled
   [junit4]   2> 212878 T352 C:control_collection c:collection1 oasu.RandomMergePolicy.<init> RandomMergePolicy wrapping class org.apache.lucene.index.TieredMergePolicy: [TieredMergePolicy: maxMergeAtOnce=39, maxMergeAtOnceExplicit=25, maxMergedSegmentMB=15.447265625, floorSegmentMB=1.6923828125, forceMergeDeletesPctAllowed=1.7328479877713976, segmentsPerTier=26.0, maxCFSSegmentSizeMB=8.796093022207999E12, noCFSRatio=0.0
   [junit4]   2> 212879 T352 C:control_collection c:collection1 oasc.SolrDeletionPolicy.onInit SolrDeletionPolicy.onInit: commits: num=1
   [junit4]   2> 		commit{dir=MockDirectoryWrapper(RAMDirectory@348d830c lockFactory=org.apache.lucene.store.SingleInstanceLockFactory@3696a3c8),segFN=segments_1,generation=1}
   [junit4]   2> 212879 T352 C:control_collection c:collection1 oasc.SolrDeletionPolicy.updateCommits newest commit generation = 1
   [junit4]   2> 212880 T352 C:control_collection c:collection1 oass.SolrIndexSearcher.<init> Opening Searcher@41dbc868[collection1] main
   [junit4]   2> 212881 T352 C:control_collection c:collection1 oascc.ZkStateReader.readConfigName Load collection config from:/collections/control_collection
   [junit4]   2> 212881 T352 C:control_collection c:collection1 oascc.ZkStateReader.readConfigName path=/collections/control_collection configName=conf1 specified config exists in ZooKeeper
   [junit4]   2> 212881 T352 C:control_collection c:collection1 oasr.ManagedResourceStorage.newStorageIO Setting up ZooKeeper-based storage for the RestManager with znodeBase: /configs/conf1
   [junit4]   2> 212882 T352 C:control_collection c:collection1 oasr.ManagedResourceStorage$ZooKeeperStorageIO.configure Configured ZooKeeperStorageIO with znodeBase: /configs/conf1
   [junit4]   2> 212882 T352 C:control_collection c:collection1 oasr.RestManager.init Initializing RestManager with initArgs: {}
   [junit4]   2> 212882 T352 C:control_collection c:collection1 oasr.ManagedResourceStorage.load Reading _rest_managed.json using ZooKeeperStorageIO:path=/configs/conf1
   [junit4]   2> 212883 T352 C:control_collection c:collection1 oasr.ManagedResourceStorage$ZooKeeperStorageIO.openInputStream No data found for znode /configs/conf1/_rest_managed.json
   [junit4]   2> 212883 T352 C:control_collection c:collection1 oasr.ManagedResourceStorage.load Loaded null at path _rest_managed.json using ZooKeeperStorageIO:path=/configs/conf1
   [junit4]   2> 212883 T352 C:control_collection c:collection1 oasr.RestManager.init Initializing 0 registered ManagedResources
   [junit4]   2> 212884 T352 C:control_collection c:collection1 oash.ReplicationHandler.inform Commits will be reserved for  10000
   [junit4]   2> 212885 T353 C:control_collection c:collection1 oasc.SolrCore.registerSearcher [collection1] Registered new searcher Searcher@41dbc868[collection1] main{ExitableDirectoryReader(UninvertingDirectoryReader())}
   [junit4]   2> 212885 T352 C:control_collection c:collection1 oasc.CoreContainer.registerCore registering core: collection1
   [junit4]   2> 212886 T356 C:control_collection S:shard1 oasc.ZkController.register Register replica - core:collection1 address:http://127.0.0.1:57657/h/kg collection:control_collection shard:shard1
   [junit4]   2> 212886 T322 oass.SolrDispatchFilter.init user.dir=/usr/home/jenkins/jenkins-slave/workspace/Lucene-Solr-Tests-5.x-Java7/solr/build/solr-core/test/J3
   [junit4]   2> 212887 T322 oass.SolrDispatchFilter.init SolrDispatchFilter.init() done
   [junit4]   2> 212887 T356 C:control_collection S:shard1 oascc.SolrZkClient.makePath makePath: /collections/control_collection/leader_elect/shard1/election
   [junit4]   2> 212889 T322 oascc.SolrZkClient.createZkCredentialsToAddAutomatically Using default ZkCredentialsProvider
   [junit4]   2> 212890 T322 oascc.ConnectionManager.waitForConnected Waiting for client to connect to ZooKeeper
   [junit4]   2> 212891 T360 oascc.ConnectionManager.process Watcher org.apache.solr.common.cloud.ConnectionManager@3b182ea8 name:ZooKeeperConnection Watcher:127.0.0.1:48644/solr got event WatchedEvent state:SyncConnected type:None path:null path:null type:None
   [junit4]   2> 212891 T356 C:control_collection S:shard1 oasc.ShardLeaderElectionContext.runLeaderProcess Running the leader process for shard shard1
   [junit4]   2> 212891 T322 oascc.ConnectionManager.waitForConnected Client is connected to ZooKeeper
   [junit4]   2> 212892 T322 oascc.SolrZkClient.createZkACLProvider Using default ZkACLProvider
   [junit4]   2> 212893 T322 oascc.ZkStateReader.createClusterStateWatchersAndUpdate Updating cluster state from ZooKeeper... 
   [junit4]   2> 212893 T348 oasc.DistributedQueue$LatchWatcher.process NodeChildrenChanged fired on path /overseer/queue state SyncConnected
   [junit4]   2> 212893 T356 C:control_collection S:shard1 oasc.ShardLeaderElectionContext.waitForReplicasToComeUp Enough replicas found to continue.
   [junit4]   2> 212894 T356 C:control_collection S:shard1 oasc.ShardLeaderElectionContext.runLeaderProcess I may be the new leader - try and sync
   [junit4]   2> 212894 T349 oasc.Overseer$ClusterStateUpdater.run processMessage: queueSize: 1, message = {
   [junit4]   2> 	  "operation":"leader",
   [junit4]   2> 	  "shard":"shard1",
   [junit4]   2> 	  "collection":"control_collection"} current state version: 1
   [junit4]   2> ASYNC  NEW_CORE C27 name=collection1 org.apache.solr.core.SolrCore@289cee0a url=http://127.0.0.1:57657/h/kg/collection1 node=127.0.0.1:57657_h%2Fkg C27_STATE=coll:control_collection core:collection1 props:{core=collection1, state=down, base_url=http://127.0.0.1:57657/h/kg, node_name=127.0.0.1:57657_h%2Fkg}
   [junit4]   2> 212894 T356 C:control_collection S:shard1 C27 P57657 oasc.SyncStrategy.sync Sync replicas to http://127.0.0.1:57657/h/kg/collection1/
   [junit4]   2> 212895 T356 C:control_collection S:shard1 C27 P57657 oasc.SyncStrategy.syncReplicas Sync Success - now sync replicas to me
   [junit4]   2> 212895 T356 C:control_collection S:shard1 C27 P57657 oasc.SyncStrategy.syncToMe http://127.0.0.1:57657/h/kg/collection1/ has no replicas
   [junit4]   2> 212895 T356 C:control_collection S:shard1 oasc.ShardLeaderElectionContext.runLeaderProcess I am the new leader: http://127.0.0.1:57657/h/kg/collection1/ shard1
   [junit4]   2> 212895 T356 C:control_collection S:shard1 oascc.SolrZkClient.makePath makePath: /collections/control_collection/leaders/shard1
   [junit4]   2> 212895 T360 oascc.ZkStateReader$2.process A cluster state change: WatchedEvent state:SyncConnected type:NodeDataChanged path:/clusterstate.json, has occurred - updating... (live nodes size: 1)
   [junit4]   2> 212895 T322 oasc.ChaosMonkey.monkeyLog monkey: init - expire sessions:false cause connection loss:false
   [junit4]   2> 212895 T348 oascc.ZkStateReader$2.process A cluster state change: WatchedEvent state:SyncConnected type:NodeDataChanged path:/clusterstate.json, has occurred - updating... (live nodes size: 1)
   [junit4]   2> 212899 T348 oasc.DistributedQueue$LatchWatcher.process NodeChildrenChanged fired on path /overseer/queue state SyncConnected
   [junit4]   2> 212900 T349 oasc.Overseer$ClusterStateUpdater.run processMessage: queueSize: 1, message = {
   [junit4]   2> 	  "operation":"leader",
   [junit4]   2> 	  "shard":"shard1",
   [junit4]   2> 	  "collection":"control_collection",
   [junit4]   2> 	  "base_url":"http://127.0.0.1:57657/h/kg",
   [junit4]   2> 	  "core":"collection1",
   [junit4]   2> 	  "state":"active"} current state version: 2
   [junit4]   2> 213003 T360 oascc.ZkStateReader$2.process A cluster state change: WatchedEvent state:SyncConnected type:NodeDataChanged path:/clusterstate.json, has occurred - updating... (live nodes size: 1)
   [junit4]   2> 213003 T348 oascc.ZkStateReader$2.process A cluster state change: WatchedEvent state:SyncConnected type:NodeDataChanged path:/clusterstate.json, has occurred - updating... (live nodes size: 1)
   [junit4]   2> 213051 T356 C:control_collection S:shard1 oasc.ZkController.register We are http://127.0.0.1:57657/h/kg/collection1/ and leader is http://127.0.0.1:57657/h/kg/collection1/
   [junit4]   2> 213052 T356 C:control_collection S:shard1 oasc.ZkController.register No LogReplay needed for core=collection1 baseURL=http://127.0.0.1:57657/h/kg
   [junit4]   2> 213052 T356 C:control_collection S:shard1 oasc.ZkController.checkRecovery I am the leader, no recovery necessary
   [junit4]   2> 213053 T356 C:control_collection S:shard1 c:collection1 oasc.ZkController.publish publishing core=collection1 state=active collection=control_collection
   [junit4]   2> 213053 T356 C:control_collection S:shard1 c:collection1 oasc.ZkController.publish numShards not found on descriptor - reading it from system property
   [junit4]   2> 213055 T348 oasc.DistributedQueue$LatchWatcher.process NodeChildrenChanged fired on path /overseer/queue state SyncConnected
   [junit4]   2> 213056 T349 oasc.Overseer$ClusterStateUpdater.run processMessage: queueSize: 1, message = {
   [junit4]   2> 	  "core":"collection1",
   [junit4]   2> 	  "collection":"control_collection",
   [junit4]   2> 	  "shard":"shard1",
   [junit4]   2> 	  "state":"active",
   [junit4]   2> 	  "roles":null,
   [junit4]   2> 	  "numShards":"1",
   [junit4]   2> 	  "base_url":"http://127.0.0.1:57657/h/kg",
   [junit4]   2> 	  "core_node_name":"core_node1",
   [junit4]   2> 	  "node_name":"127.0.0.1:57657_h%2Fkg",
   [junit4]   2> 	  "operation":"state"} current state version: 3
   [junit4]   2> 213056 T349 oasco.ReplicaMutator.updateState Update state numShards=1 message={
   [junit4]   2> 	  "core":"collection1",
   [junit4]   2> 	  "collection":"control_collection",
   [junit4]   2> 	  "shard":"shard1",
   [junit4]   2> 	  "state":"active",
   [junit4]   2> 	  "roles":null,
   [junit4]   2> 	  "numShards":"1",
   [junit4]   2> 	  "base_url":"http://127.0.0.1:57657/h/kg",
   [junit4]   2> 	  "core_node_name":"core_node1",
   [junit4]   2> 	  "node_name":"127.0.0.1:57657_h%2Fkg",
   [junit4]   2> 	  "operation":"state"}
   [junit4]   2> 213160 T348 oascc.ZkStateReader$2.process A cluster state change: WatchedEvent state:SyncConnected type:NodeDataChanged path:/clusterstate.json, has occurred - updating... (live nodes size: 1)
   [junit4]   2> 213160 T360 oascc.ZkStateReader$2.process A cluster state change: WatchedEvent state:SyncConnected type:NodeDataChanged path:/clusterstate.json, has occurred - updating... (live nodes size: 1)
   [junit4]   2> 214571 T322 oas.SolrTestCaseJ4.writeCoreProperties Writing core.properties file to /usr/home/jenkins/jenkins-slave/workspace/Lucene-Solr-Tests-5.x-Java7/solr/build/solr-core/test/J3/temp/solr.cloud.RecoveryAfterSoftCommitTest 6F561FCF85559A56-001/shard-1-001/cores/collection1
   [junit4]   2> 214574 T322 oasc.AbstractFullDistribZkTestBase.createJettys create jetty 1 in directory /usr/home/jenkins/jenkins-slave/workspace/Lucene-Solr-Tests-5.x-Java7/solr/build/solr-core/test/J3/temp/solr.cloud.RecoveryAfterSoftCommitTest 6F561FCF85559A56-001/shard-1-001
   [junit4]   2> 214574 T322 oejs.Server.doStart jetty-8.1.10.v20130312
   [junit4]   2> 214577 T322 oejs.AbstractConnector.doStart Started SocketConnector@127.0.0.1:33918
   [junit4]   2> 214577 T322 oascse.JettySolrRunner$1.lifeCycleStarted Jetty properties: {solrconfig=solrconfig.xml, hostPort=30988, solr.data.dir=/usr/home/jenkins/jenkins-slave/workspace/Lucene-Solr-Tests-5.x-Java7/solr/build/solr-core/test/J3/temp/solr.cloud.RecoveryAfterSoftCommitTest 6F561FCF85559A56-001/tempDir-001/jetty1, hostContext=/h/kg, coreRootDirectory=/usr/home/jenkins/jenkins-slave/workspace/Lucene-Solr-Tests-5.x-Java7/solr/build/solr-core/test/J3/temp/solr.cloud.RecoveryAfterSoftCommitTest 6F561FCF85559A56-001/shard-1-001/cores}
   [junit4]   2> 214578 T322 oass.SolrDispatchFilter.init SolrDispatchFilter.init()sun.misc.Launcher$AppClassLoader@3c56b64c
   [junit4]   2> 214578 T322 oasc.SolrResourceLoader.<init> new SolrResourceLoader for directory: '/usr/home/jenkins/jenkins-slave/workspace/Lucene-Solr-Tests-5.x-Java7/solr/build/solr-core/test/J3/temp/solr.cloud.RecoveryAfterSoftCommitTest 6F561FCF85559A56-001/shard-1-001/'
   [junit4]   2> 214650 T322 oasc.SolrXmlConfig.fromFile Loading container configuration from /usr/home/jenkins/jenkins-slave/workspace/Lucene-Solr-Tests-5.x-Java7/solr/build/solr-core/test/J3/temp/solr.cloud.RecoveryAfterSoftCommitTest 6F561FCF85559A56-001/shard-1-001/solr.xml
   [junit4]   2> 214715 T322 oasc.CorePropertiesLocator.<init> Config-defined core root directory: /usr/home/jenkins/jenkins-slave/workspace/Lucene-Solr-Tests-5.x-Java7/solr/build/solr-core/test/J3/temp/solr.cloud.RecoveryAfterSoftCommitTest 6F561FCF85559A56-001/shard-1-001/cores
   [junit4]   2> 214715 T322 oasc.CoreContainer.<init> New CoreContainer 1852987774
   [junit4]   2> 214715 T322 oasc.CoreContainer.load Loading cores into CoreContainer [instanceDir=/usr/home/jenkins/jenkins-slave/workspace/Lucene-Solr-Tests-5.x-Java7/solr/build/solr-core/test/J3/temp/solr.cloud.RecoveryAfterSoftCommitTest 6F561FCF85559A56-001/shard-1-001/]
   [junit4]   2> 214716 T322 oasc.CoreContainer.load loading shared library: /usr/home/jenkins/jenkins-slave/workspace/Lucene-Solr-Tests-5.x-Java7/solr/build/solr-core/test/J3/temp/solr.cloud.RecoveryAfterSoftCommitTest 6F561FCF85559A56-001/shard-1-001/lib
   [junit4]   2> 214719 T322 oasc.SolrResourceLoader.addToClassLoader WARN Can't find (or read) directory to add to classloader: lib (resolved as: /usr/home/jenkins/jenkins-slave/workspace/Lucene-Solr-Tests-5.x-Java7/solr/build/solr-core/test/J3/temp/solr.cloud.RecoveryAfterSoftCommitTest 6F561FCF85559A56-001/shard-1-001/lib).
   [junit4]   2> 214733 T322 oashc.HttpShardHandlerFactory.getParameter Setting socketTimeout to: 90000
   [junit4]   2> 214733 T322 oashc.HttpShardHandlerFactory.getParameter Setting urlScheme to: 
   [junit4]   2> 214734 T322 oashc.HttpShardHandlerFactory.getParameter Setting connTimeout to: 15000
   [junit4]   2> 214734 T322 oashc.HttpShardHandlerFactory.getParameter Setting maxConnectionsPerHost to: 20
   [junit4]   2> 214734 T322 oashc.HttpShardHandlerFactory.getParameter Setting maxConnections to: 10000
   [junit4]   2> 214735 T322 oashc.HttpShardHandlerFactory.getParameter Setting corePoolSize to: 0
   [junit4]   2> 214735 T322 oashc.HttpShardHandlerFactory.getParameter Setting maximumPoolSize to: 2147483647
   [junit4]   2> 214735 T322 oashc.HttpShardHandlerFactory.getParameter Setting maxThreadIdleTime to: 5
   [junit4]   2> 214736 T322 oashc.HttpShardHandlerFactory.getParameter Setting sizeOfQueue to: -1
   [junit4]   2> 214736 T322 oashc.HttpShardHandlerFactory.getParameter Setting fairnessPolicy to: false
   [junit4]   2> 214736 T322 oashc.HttpShardHandlerFactory.getParameter Setting useRetries to: false
   [junit4]   2> 214741 T322 oasu.UpdateShardHandler.<init> Creating UpdateShardHandler HTTP client with params: socketTimeout=340000&connTimeout=45000&retry=true
   [junit4]   2> 214748 T322 oasl.LogWatcher.createWatcher SLF4J impl is org.slf4j.impl.Log4jLoggerFactory
   [junit4]   2> 214748 T322 oasl.LogWatcher.newRegisteredLogWatcher Registering Log Listener [Log4j (org.slf4j.impl.Log4jLoggerFactory)]
   [junit4]   2> 214749 T322 oasc.CoreContainer.load Node Name: 127.0.0.1
   [junit4]   2> 214749 T322 oasc.ZkContainer.initZooKeeper Zookeeper client=127.0.0.1:48644/solr
   [junit4]   2> 214749 T322 oasc.ZkController.checkChrootPath zkHost includes chroot
   [junit4]   2> 214750 T322 oascc.SolrZkClient.createZkCredentialsToAddAutomatically Using default ZkCredentialsProvider
   [junit4]   2> 214750 T322 oascc.ConnectionManager.waitForConnected Waiting for client to connect to ZooKeeper
   [junit4]   2> 214752 T372 oascc.ConnectionManager.process Watcher org.apache.solr.common.cloud.ConnectionManager@670e068d name:ZooKeeperConnection Watcher:127.0.0.1:48644 got event WatchedEvent state:SyncConnected type:None path:null path:null type:None
   [junit4]   2> 214753 T322 oascc.ConnectionManager.waitForConnected Client is connected to ZooKeeper
   [junit4]   2> 214755 T322 oascc.SolrZkClient.createZkACLProvider Using default ZkACLProvider
   [junit4]   2> 214758 T322 oascc.ConnectionManager.waitForConnected Waiting for client to connect to ZooKeeper
   [junit4]   2> 214760 T375 oascc.ConnectionManager.process Watcher org.apache.solr.common.cloud.ConnectionManager@549692e9 name:ZooKeeperConnection Watcher:127.0.0.1:48644/solr got event WatchedEvent state:SyncConnected type:None path:null path:null type:None
   [junit4]   2> 214760 T322 oascc.ConnectionManager.waitForConnected Client is connected to ZooKeeper
   [junit4]   2> 214766 T322 oascc.ZkStateReader.createClusterStateWatchersAndUpdate Updating cluster state from ZooKeeper... 
   [junit4]   2> 215771 T322 oasc.ZkController.createEphemeralLiveNode Register node as live in ZooKeeper:/live_nodes/127.0.0.1:30988_h%2Fkg
   [junit4]   2> 215772 T322 oascc.SolrZkClient.makePath makePath: /live_nodes/127.0.0.1:30988_h%2Fkg
   [junit4]   2> 215775 T322 oasc.Overseer.close Overseer (id=null) closing
   [junit4]   2> 215778 T322 oasc.CorePropertiesLocator.discover Looking for core definitions underneath /usr/home/jenkins/jenkins-slave/workspace/Lucene-Solr-Tests-5.x-Java7/solr/build/solr-core/test/J3/temp/solr.cloud.RecoveryAfterSoftCommitTest 6F561FCF85559A56-001/shard-1-001/cores
   [junit4]   2> 215781 T322 oasc.CoreDescriptor.<init> CORE DESCRIPTOR: {config=solrconfig.xml, schema=schema.xml, absoluteInstDir=/usr/home/jenkins/jenkins-slave/workspace/Lucene-Solr-Tests-5.x-Java7/solr/build/solr-core/test/J3/temp/solr.cloud.RecoveryAfterSoftCommitTest 6F561FCF85559A56-001/shard-1-001/cores/collection1/, loadOnStartup=true, transient=false, name=collection1, shard=, collection=collection1, instanceDir=/usr/home/jenkins/jenkins-slave/workspace/Lucene-Solr-Tests-5.x-Java7/solr/build/solr-core/test/J3/temp/solr.cloud.RecoveryAfterSoftCommitTest 6F561FCF85559A56-001/shard-1-001/cores/collection1, coreNodeName=, dataDir=data/}
   [junit4]   2> 215781 T322 oasc.CorePropertiesLocator.discoverUnder Found core collection1 in /usr/home/jenkins/jenkins-slave/workspace/Lucene-Solr-Tests-5.x-Java7/solr/build/solr-core/test/J3/temp/solr.cloud.RecoveryAfterSoftCommitTest 6F561FCF85559A56-001/shard-1-001/cores/collection1/
   [junit4]   2> 215782 T322 oasc.CorePropertiesLocator.discover Found 1 core definitions
   [junit4]   2> 215783 T376 C:collection1 c:collection1 oasc.ZkController.publish publishing core=collection1 state=down collection=collection1
   [junit4]   2> 215784 T376 C:collection1 c:collection1 oasc.ZkController.publish numShards not found on descriptor - reading it from system property
   [junit4]   2> 215785 T376 C:collection1 c:collection1 oasc.ZkController.waitForCoreNodeName look for our core node name
   [junit4]   2> 215785 T348 oasc.DistributedQueue$LatchWatcher.process NodeChildrenChanged fired on path /overseer/queue state SyncConnected
   [junit4]   2> 215787 T349 oasc.Overseer$ClusterStateUpdater.run processMessage: queueSize: 1, message = {
   [junit4]   2> 	  "core":"collection1",
   [junit4]   2> 	  "collection":"collection1",
   [junit4]   2> 	  "shard":null,
   [junit4]   2> 	  "state":"down",
   [junit4]   2> 	  "roles":null,
   [junit4]   2> 	  "numShards":"1",
   [junit4]   2> 	  "base_url":"http://127.0.0.1:30988/h/kg",
   [junit4]   2> 	  "node_name":"127.0.0.1:30988_h%2Fkg",
   [junit4]   2> 	  "operation":"state"} current state version: 4
   [junit4]   2> 215787 T349 oasco.ReplicaMutator.updateState Update state numShards=1 message={
   [junit4]   2> 	  "core":"collection1",
   [junit4]   2> 	  "collection":"collection1",
   [junit4]   2> 	  "shard":null,
   [junit4]   2> 	  "state":"down",
   [junit4]   2> 	  "roles":null,
   [junit4]   2> 	  "numShards":"1",
   [junit4]   2> 	  "base_url":"http://127.0.0.1:30988/h/kg",
   [junit4]   2> 	  "node_name":"127.0.0.1:30988_h%2Fkg",
   [junit4]   2> 	  "operation":"state"}
   [junit4]   2> 215788 T349 oasco.ClusterStateMutator.createCollection building a new cName: collection1
   [junit4]   2> 215788 T349 oasco.ReplicaMutator.updateState Assigning new node to shard shard=shard1
   [junit4]   2> 215790 T360 oascc.ZkStateReader$2.process A cluster state change: WatchedEvent state:SyncConnected type:NodeDataChanged path:/clusterstate.json, has occurred - updating... (live nodes size: 2)
   [junit4]   2> 215790 T348 oascc.ZkStateReader$2.process A cluster state change: WatchedEvent state:SyncConnected type:NodeDataChanged path:/clusterstate.json, has occurred - updating... (live nodes size: 2)
   [junit4]   2> 215790 T375 oascc.ZkStateReader$2.process A cluster state change: WatchedEvent state:SyncConnected type:NodeDataChanged path:/clusterstate.json, has occurred - updating... (live nodes size: 2)
   [junit4]   2> 216786 T376 C:collection1 c:collection1 oasc.ZkController.waitForShardId waiting to find shard id in clusterstate for collection1
   [junit4]   2> 216787 T376 C:collection1 c:collection1 oasc.ZkController.createCollectionZkNode Check for collection zkNode:collection1
   [junit4]   2> 216788 T376 C:collection1 c:collection1 oasc.ZkController.createCollectionZkNode Collection zkNode exists
   [junit4]   2> 216788 T376 C:collection1 c:collection1 oascc.ZkStateReader.readConfigName Load collection config from:/collections/collection1
   [junit4]   2> 216789 T376 C:collection1 c:collection1 oascc.ZkStateReader.readConfigName path=/collections/collection1 configName=conf1 specified config exists in ZooKeeper
   [junit4]   2> 216789 T376 C:collection1 c:collection1 oasc.SolrResourceLoader.<init> new SolrResourceLoader for directory: '/usr/home/jenkins/jenkins-slave/workspace/Lucene-Solr-Tests-5.x-Java7/solr/build/solr-core/test/J3/temp/solr.cloud.RecoveryAfterSoftCommitTest 6F561FCF85559A56-001/shard-1-001/cores/collection1/'
   [junit4]   2> 216808 T376 C:collection1 c:collection1 oasc.ZkController.watchZKConfDir watch zkdir /configs/conf1
   [junit4]   2> 216810 T376 C:collection1 c:collection1 oasc.Config.<init> loaded config solrconfig.xml with version 0 
   [junit4]   2> 216831 T376 C:collection1 c:collection1 oasc.SolrConfig.refreshRequestParams current version of requestparams : -1
   [junit4]   2> 216851 T376 C:collection1 c:collection1 oasc.SolrConfig.<init> Using Lucene MatchVersion: 5.2.0
   [junit4]   2> 216892 T376 C:collection1 c:collection1 oasc.SolrConfig.<init> Loaded SolrConfig: solrconfig.xml
   [junit4]   2> 216893 T376 C:collection1 c:collection1 oass.IndexSchema.readSchema Reading Solr Schema from /configs/conf1/schema.xml
   [junit4]   2> 216910 T376 C:collection1 c:collection1 oass.IndexSchema.readSchema [collection1] Schema name=test
   [junit4]   2> 217450 T376 C:collection1 c:collection1 oass.OpenExchangeRatesOrgProvider.init Initialized with rates=open-exchange-rates.json, refreshInterval=1440.
   [junit4]   2> 217471 T376 C:collection1 c:collection1 oass.IndexSchema.readSchema default search field in schema is text
   [junit4]   2> 217475 T376 C:collection1 c:collection1 oass.IndexSchema.readSchema unique key field: id
   [junit4]   2> 217498 T376 C:collection1 c:collection1 oass.FileExchangeRateProvider.reload Reloading exchange rates from file currency.xml
   [junit4]   2> 217503 T376 C:collection1 c:collection1 oass.FileExchangeRateProvider.reload Reloading exchange rates from file currency.xml
   [junit4]   2> 217508 T376 C:collection1 c:collection1 oass.OpenExchangeRatesOrgProvider.reload Reloading exchange rates from open-exchange-rates.json
   [junit4]   2> 217509 T376 C:collection1 c:collection1 oass.OpenExchangeRatesOrgProvider$OpenExchangeRates.<init> WARN Unknown key IMPORTANT NOTE
   [junit4]   2> 217510 T376 C:collection1 c:collection1 oass.OpenExchangeRatesOrgProvider$OpenExchangeRates.<init> WARN Expected key, got STRING
   [junit4]   2> 217510 T376 C:collection1 c:collection1 oass.OpenExchangeRatesOrgProvider.reload Reloading exchange rates from open-exchange-rates.json
   [junit4]   2> 217511 T376 C:collection1 c:collection1 oass.OpenExchangeRatesOrgProvider$OpenExchangeRates.<init> WARN Unknown key IMPORTANT NOTE
   [junit4]   2> 217511 T376 C:collection1 c:collection1 oass.OpenExchangeRatesOrgProvider$OpenExchangeRates.<init> WARN Expected key, got STRING
   [junit4]   2> 217512 T376 C:collection1 c:collection1 oasc.CoreContainer.create Creating SolrCore 'collection1' using configuration from collection collection1
   [junit4]   2> 217512 T376 C:collection1 c:collection1 oasc.SolrCore.initDirectoryFactory org.apache.solr.core.MockDirectoryFactory
   [junit4]   2> 217513 T376 C:collection1 c:collection1 oasc.SolrCore.<init> [collection1] Opening new SolrCore at /usr/home/jenkins/jenkins-slave/workspace/Lucene-Solr-Tests-5.x-Java7/solr/build/solr-core/test/J3/temp/solr.cloud.RecoveryAfterSoftCommitTest 6F561FCF85559A56-001/shard-1-001/cores/collection1/, dataDir=/usr/home/jenkins/jenkins-slave/workspace/Lucene-Solr-Tests-5.x-Java7/solr/build/solr-core/test/J3/temp/solr.cloud.RecoveryAfterSoftCommitTest 6F561FCF85559A56-001/shard-1-001/cores/collection1/data/
   [junit4]   2> 217513 T376 C:collection1 c:collection1 oasc.JmxMonitoredMap.<init> JMX monitoring is enabled. Adding Solr mbeans to JMX Server: com.sun.jmx.mbeanserver.JmxMBeanServer@62f98b99
   [junit4]   2> 217514 T376 C:collection1 c:collection1 oasc.CachingDirectoryFactory.get return new directory for /usr/home/jenkins/jenkins-slave/workspace/Lucene-Solr-Tests-5.x-Java7/solr/build/solr-core/test/J3/temp/solr.cloud.RecoveryAfterSoftCommitTest 6F561FCF85559A56-001/shard-1-001/cores/collection1/data
   [junit4]   2> 217515 T376 C:collection1 c:collection1 oasc.SolrCore.getNewIndexDir New index directory detected: old=null new=/usr/home/jenkins/jenkins-slave/workspace/Lucene-Solr-Tests-5.x-Java7/solr/build/solr-core/test/J3/temp/solr.cloud.RecoveryAfterSoftCommitTest 6F561FCF85559A56-001/shard-1-001/cores/collection1/data/index/
   [junit4]   2> 217515 T376 C:collection1 c:collection1 oasc.SolrCore.initIndex WARN [collection1] Solr index directory '/usr/home/jenkins/jenkins-slave/workspace/Lucene-Solr-Tests-5.x-Java7/solr/build/solr-core/test/J3/temp/solr.cloud.RecoveryAfterSoftCommitTest 6F561FCF85559A56-001/shard-1-001/cores/collection1/data/index' doesn't exist. Creating new index...
   [junit4]   2> 217516 T376 C:collection1 c:collection1 oasc.CachingDirectoryFactory.get return new directory for /usr/home/jenkins/jenkins-slave/workspace/Lucene-Solr-Tests-5.x-Java7/solr/build/solr-core/test/J3/temp/solr.cloud.RecoveryAfterSoftCommitTest 6F561FCF85559A56-001/shard-1-001/cores/collection1/data/index
   [junit4]   2> 217516 T376 C:collection1 c:collection1 oasu.RandomMergePolicy.<init> RandomMergePolicy wrapping class org.apache.lucene.index.TieredMergePolicy: [TieredMergePolicy: maxMergeAtOnce=21, maxMergeAtOnceExplicit=42, maxMergedSegmentMB=88.0810546875, floorSegmentMB=1.7578125, forceMergeDeletesPctAllowed=4.679093429411079, segmentsPerTier=15.0, maxCFSSegmentSizeMB=8.796093022207999E12, noCFSRatio=1.0
   [junit4]   2> 217517 T376 C:collection1 c:collection1 oasc.SolrDeletionPolicy.onCommit SolrDeletionPolicy.onCommit: commits: num=1
   [junit4]   2> 		commit{dir=MockDirectoryWrapper(RAMDirectory@749ce18a lockFactory=org.apache.lucene.store.SingleInstanceLockFactory@679b66d5),segFN=segments_1,generation=1}
   [junit4]   2> 217518 T376 C:collection1 c:collection1 oasc.SolrDeletionPolicy.updateCommits newest commit generation = 1
   [junit4]   2> 217529 T376 C:collection1 c:collection1 oasup.UpdateRequestProcessorChain.init creating updateRequestProcessorChain "nodistrib"
   [junit4]   2> 217529 T376 C:collection1 c:collection1 oasup.UpdateRequestProcessorChain.init creating updateRequestProcessorChain "dedupe"
   [junit4]   2> 217530 T376 C:collection1 c:collection1 oasup.UpdateRequestProcessorChain.init inserting DistributedUpdateProcessorFactory into updateRequestProcessorChain "dedupe"
   [junit4]   2> 217530 T376 C:collection1 c:collection1 oasup.UpdateRequestProcessorChain.init creating updateRequestProcessorChain "stored_sig"
   [junit4]   2> 217531 T376 C:collection1 c:collection1 oasup.UpdateRequestProcessorChain.init inserting DistributedUpdateProcessorFactory into updateRequestProcessorChain "stored_sig"
   [junit4]   2> 217531 T376 C:collection1 c:collection1 oasup.UpdateRequestProcessorChain.init creating updateRequestProcessorChain "distrib-dup-test-chain-explicit"
   [junit4]   2> 217532 T376 C:collection1 c:collection1 oasup.UpdateRequestProcessorChain.init creating updateRequestProcessorChain "distrib-dup-test-chain-implicit"
   [junit4]   2> 217532 T376 C:collection1 c:collection1 oasup.UpdateRequestProcessorChain.init inserting DistributedUpdateProcessorFactory into updateRequestProcessorChain "distrib-dup-test-chain-implicit"
   [junit4]   2> 217533 T376 C:collection1 c:collection1 oasc.SolrCore.loadUpdateProcessorChains no updateRequestProcessorChain defined as default, creating implicit default
   [junit4]   2> 217575 T376 C:collection1 c:collection1 oashl.XMLLoader.init xsltCacheLifetimeSeconds=60
   [junit4]   2> 217579 T376 C:collection1 c:collection1 oashl.XMLLoader.init xsltCacheLifetimeSeconds=60
   [junit4]   2> 217582 T376 C:collection1 c:collection1 oashl.XMLLoader.init xsltCacheLifetimeSeconds=60
   [junit4]   2> 217584 T376 C:collection1 c:collection1 oashl.XMLLoader.init xsltCacheLifetimeSeconds=60
   [junit4]   2> 217595 T376 C:collection1 c:collection1 oasc.RequestHandlers.initHandlersFromConfig Registered paths: /admin/system,/admin/segments,/get,/update/json/docs,/update/csv,/admin/ping,/admin/file,/schema,/admin/properties,standard,/admin/luke,/config,/admin/mbeans,/update,/admin/logging,/admin/plugins,/update/json,/admin/threads,/replication
   [junit4]   2> 217598 T376 C:collection1 c:collection1 oasc.SolrCore.initStatsCache Using default statsCache cache: org.apache.solr.search.stats.LocalStatsCache
   [junit4]   2> 217600 T376 C:collection1 c:collection1 oasu.UpdateHandler.<init> Using UpdateLog implementation: org.apache.solr.update.UpdateLog
   [junit4]   2> 217600 T376 C:collection1 c:collection1 oasu.UpdateLog.init Initializing UpdateLog: dataDir= defaultSyncLevel=FLUSH numRecordsToKeep=100 maxNumLogsToKeep=10
   [junit4]   2> 217602 T376 C:collection1 c:collection1 oasu.CommitTracker.<init> Hard AutoCommit: disabled
   [junit4]   2> 217602 T376 C:collection1 c:collection1 oasu.CommitTracker.<init> Soft AutoCommit: disabled
   [junit4]   2> 217603 T376 C:collection1 c:collection1 oasu.RandomMergePolicy.<init> RandomMergePolicy wrapping class org.apache.lucene.index.TieredMergePolicy: [TieredMergePolicy: maxMergeAtOnce=39, maxMergeAtOnceExplicit=25, maxMergedSegmentMB=15.447265625, floorSegmentMB=1.6923828125, forceMergeDeletesPctAllowed=1.7328479877713976, segmentsPerTier=26.0, maxCFSSegmentSizeMB=8.796093022207999E12, noCFSRatio=0.0
   [junit4]   2> 217604 T376 C:collection1 c:collection1 oasc.SolrDeletionPolicy.onInit SolrDeletionPolicy.onInit: commits: num=1
   [junit4]   2> 		commit{dir=MockDirectoryWrapper(RAMDirectory@749ce18a lockFactory=org.apache.lucene.store.SingleInstanceLockFactory@679b66d5),segFN=segments_1,generation=1}
   [junit4]   2> 217605 T376 C:collection1 c:collection1 oasc.SolrDeletionPolicy.updateCommits newest commit generation = 1
   [junit4]   2> 217605 T376 C:collection1 c:collection1 oass.SolrIndexSearcher.<init> Opening Searcher@56c72790[collection1] main
   [junit4]   2> 217606 T376 C:collection1 c:collection1 oascc.ZkStateReader.readConfigName Load collection config from:/collections/collection1
   [junit4]   2> 217607 T376 C:collection1 c:collection1 oascc.ZkStateReader.readConfigName path=/collections/collection1 configName=conf1 specified config exists in ZooKeeper
   [junit4]   2> 217607 T376 C:collection1 c:collection1 oasr.ManagedResourceStorage.newStorageIO Setting up ZooKeeper-based storage for the RestManager with znodeBase: /configs/conf1
   [junit4]   2> 217608 T376 C:collection1 c:collection1 oasr.ManagedResourceStorage$ZooKeeperStorageIO.configure Configured ZooKeeperStorageIO with znodeBase: /configs/conf1
   [junit4]   2> 217608 T376 C:collection1 c:collection1 oasr.RestManager.init Initializing RestManager with initArgs: {}
   [junit4]   2> 217609 T376 C:collection1 c:collection1 oasr.ManagedResourceStorage.load Reading _rest_managed.json using ZooKeeperStorageIO:path=/configs/conf1
   [junit4]   2> 217610 T376 C:collection1 c:collection1 oasr.ManagedResourceStorage$ZooKeeperStorageIO.openInputStream No data found for znode /configs/conf1/_rest_managed.json
   [junit4]   2> 217610 T376 C:collection1 c:collection1 oasr.ManagedResourceStorage.load Loaded null at path _rest_managed.json using ZooKeeperStorageIO:path=/configs/conf1
   [junit4]   2> 217610 T376 C:collection1 c:collection1 oasr.RestManager.init Initializing 0 registered ManagedResources
   [junit4]   2> 217611 T376 C:collection1 c:collection1 oash.ReplicationHandler.inform Commits will be reserved for  10000
   [junit4]   2> 217612 T377 C:collection1 c:collection1 oasc.SolrCore.registerSearcher [collection1] Registered new searcher Searcher@56c72790[collection1] main{ExitableDirectoryReader(UninvertingDirectoryReader())}
   [junit4]   2> 217613 T376 C:collection1 c:collection1 oasc.CoreContainer.registerCore registering core: collection1
   [junit4]   2> 217614 T380 C:collection1 S:shard1 oasc.ZkController.register Register replica - core:collection1 address:http://127.0.0.1:30988/h/kg collection:collection1 shard:shard1
   [junit4]   2> 217614 T322 oass.SolrDispatchFilter.init user.dir=/usr/home/jenkins/jenkins-slave/workspace/Lucene-Solr-Tests-5.x-Java7/solr/build/solr-core/test/J3
   [junit4]   2> 217615 T322 oass.SolrDispatchFilter.init SolrDispatchFilter.init() done
   [junit4]   2> 217615 T380 C:collection1 S:shard1 oascc.SolrZkClient.makePath makePath: /collections/collection1/leader_elect/shard1/election
   [junit4]   2> 217620 T380 C:collection1 S:shard1 oasc.ShardLeaderElectionContext.runLeaderProcess Running the leader process for shard shard1
   [junit4]   2> 217622 T348 oasc.DistributedQueue$LatchWatcher.process NodeChildrenChanged fired on path /overseer/queue state SyncConnected
   [junit4]   2> 217622 T380 C:collection1 S:shard1 oasc.ShardLeaderElectionContext.waitForReplicasToComeUp Enough replicas found to continue.
   [junit4]   2> 217623 T380 C:collection1 S:shard1 oasc.ShardLeaderElectionContext.runLeaderProcess I may be the new leader - try and sync
   [junit4]   2> 217623 T349 oasc.Overseer$ClusterStateUpdater.run processMessage: queueSize: 1, message = {
   [junit4]   2> 	  "operation":"leader",
   [junit4]   2> 	  "shard":"shard1",
   [junit4]   2> 	  "collection":"collection1"} current state version: 5
   [junit4]   2> ASYNC  NEW_CORE C28 name=collection1 org.apache.solr.core.SolrCore@6f2ccccc url=http://127.0.0.1:30988/h/kg/collection1 node=127.0.0.1:30988_h%2Fkg C28_STATE=coll:collection1 core:collection1 props:{core=collection1, state=down, base_url=http://127.0.0.1:30988/h/kg, node_name=127.0.0.1:30988_h%2Fkg}
   [junit4]   2> 217623 T380 C:collection1 S:shard1 C28 P30988 oasc.SyncStrategy.sync Sync replicas to http://127.0.0.1:30988/h/kg/collection1/
   [junit4]   2> 217624 T380 C:collection1 S:shard1 C28 P30988 oasc.SyncStrategy.syncReplicas Sync Success - now sync replicas to me
   [junit4]   2> 217624 T380 C:collection1 S:shard1 C28 P30988 oasc.SyncStrategy.syncToMe http://127.0.0.1:30988/h/kg/collection1/ has no replicas
   [junit4]   2> 217624 T380 C:collection1 S:shard1 oasc.ShardLeaderElectionContext.runLeaderProcess I am the new leader: http://127.0.0.1:30988/h/kg/collection1/ shard1
   [junit4]   2> 217624 T380 C:collection1 S:shard1 oascc.SolrZkClient.makePath makePath: /collections/collection1/leaders/shard1
   [junit4]   2> 217625 T360 oascc.ZkStateReader$2.process A cluster state change: WatchedEvent state:SyncConnected type:NodeDataChanged path:/clusterstate.json, has occurred - updating... (live nodes size: 2)
   [junit4]   2> 217625 T375 oascc.ZkStateReader$2.process A cluster state change: WatchedEvent state:SyncConnected type:NodeDataChanged path:/clusterstate.json, has occurred - updating... (live nodes size: 2)
   [junit4]   2> 217625 T348 oascc.ZkStateReader$2.process A cluster state change: WatchedEvent state:SyncConnected type:NodeDataChanged path:/clusterstate.json, has occurred - updating... (live nodes size: 2)
   [junit4]   2> 217628 T348 oasc.DistributedQueue$LatchWatcher.process NodeChildrenChanged fired on path /overseer/queue state SyncConnected
   [junit4]   2> 217629 T349 oasc.Overseer$ClusterStateUpdater.run processMessage: queueSize: 1, message = {
   [junit4]   2> 	  "operation":"leader",
   [junit4]   2> 	  "shard":"shard1",
   [junit4]   2> 	  "collection":"collection1",
   [junit4]   2> 	  "base_url":"http://127.0.0.1:30988/h/kg",
   [junit4]   2> 	  "core":"collection1",
   [junit4]   2> 	  "state":"active"} current state version: 6
   [junit4]   2> 217733 T360 oascc.ZkStateReader$2.process A cluster state change: WatchedEvent state:SyncConnected type:NodeDataChanged path:/clusterstate.json, has occurred - updating... (live nodes size: 2)
   [junit4]   2> 217733 T375 oascc.ZkStateReader$2.process A cluster state change: WatchedEvent state:SyncConnected type:NodeDataChanged path:/clusterstate.json, has occurred - updating... (live nodes size: 2)
   [junit4]   2> 217733 T348 oascc.ZkStateReader$2.process A cluster state change: WatchedEvent state:SyncConnected type:NodeDataChanged path:/clusterstate.json, has occurred - updating... (live nodes size: 2)
   [junit4]   2> 217781 T380 C:collection1 S:shard1 oasc.ZkController.register We are http://127.0.0.1:30988/h/kg/collection1/ and leader is http://127.0.0.1:30988/h/kg/collection1/
   [junit4]   2> 217782 T380 C:collection1 S:shard1 oasc.ZkController.register No LogReplay needed for core=collection1 baseURL=http://127.0.0.1:30988/h/kg
   [junit4]   2> 217782 T380 C:collection1 S:shard1 oasc.ZkController.checkRecovery I am the leader, no recovery necessary
   [junit4]   2> 217783 T380 C:collection1 S:shard1 c:collection1 oasc.ZkController.publish publishing core=collection1 state=active collection=collection1
   [junit4]   2> 217783 T380 C:collection1 S:shard1 c:collection1 oasc.ZkController.publish numShards not found on descriptor - reading it from system property
   [junit4]   2> 217785 T348 oasc.DistributedQueue$LatchWatcher.process NodeChildrenChanged fired on path /overseer/queue state SyncConnected
   [junit4]   2> 217786 T349 oasc.Overseer$ClusterStateUpdater.run processMessage: queueSize: 1, message = {
   [junit4]   2> 	  "core":"collection1",
   [junit4]   2> 	  "collection":"collection1",
   [junit4]   2> 	  "shard":"shard1",
   [junit4]   2> 	  "state":"active",
   [junit4]   2> 	  "roles":null,
   [junit4]   2> 	  "numShards":"1",
   [junit4]   2> 	  "base_url":"http://127.0.0.1:30988/h/kg",
   [junit4]   2> 	  "core_node_name":"core_node1",
   [junit4]   2> 	  "node_name":"127.0.0.1:30988_h%2Fkg",
   [junit4]   2> 	  "operation":"state"} current state version: 7
   [junit4]   2> 217787 T349 oasco.ReplicaMutator.updateState Update state numShards=1 message={
   [junit4]   2> 	  "core":"collection1",
   [junit4]   2> 	  "collection":"collection1",
   [junit4]   2> 	  "shard":"shard1",
   [junit4]   2> 	  "state":"active",
   [junit4]   2> 	  "roles":null,
   [junit4]   2> 	  "numShards":"1",
   [junit4]   2> 	  "base_url":"http://127.0.0.1:30988/h/kg",
   [junit4]   2> 	  "core_node_name":"core_node1",
   [junit4]   2> 	  "node_name":"127.0.0.1:30988_h%2Fkg",
   [junit4]   2> 	  "operation":"state"}
   [junit4]   2> 217891 T360 oascc.ZkStateReader$2.process A cluster state change: WatchedEvent state:SyncConnected type:NodeDataChanged path:/clusterstate.json, has occurred - updating... (live nodes size: 2)
   [junit4]   2> 217892 T348 oascc.ZkStateReader$2.process A cluster state change: WatchedEvent state:SyncConnected type:NodeDataChanged path:/clusterstate.json, has occurred - updating... (live nodes size: 2)
   [junit4]   2> 217891 T375 oascc.ZkStateReader$2.process A cluster state change: WatchedEvent state:SyncConnected type:NodeDataChanged path:/clusterstate.json, has occurred - updating... (live nodes size: 2)
   [junit4]   2> 219542 T322 oas.SolrTestCaseJ4.writeCoreProperties Writing core.properties file to /usr/home/jenkins/jenkins-slave/workspace/Lucene-Solr-Tests-5.x-Java7/solr/build/solr-core/test/J3/temp/solr.cloud.RecoveryAfterSoftCommitTest 6F561FCF85559A56-001/shard-2-001/cores/collection1
   [junit4]   2> 219544 T322 oasc.AbstractFullDistribZkTestBase.createJettys create jetty 2 in directory /usr/home/jenkins/jenkins-slave/workspace/Lucene-Solr-Tests-5.x-Java7/solr/build/solr-core/test/J3/temp/solr.cloud.RecoveryAfterSoftCommitTest 6F561FCF85559A56-001/shard-2-001
   [junit4]   2> 219545 T322 oejs.Server.doStart jetty-8.1.10.v20130312
   [junit4]   2> 219548 T322 oejs.AbstractConnector.doStart Started SocketConnector@127.0.0.1:39770
   [junit4]   2> 219548 T322 oascse.JettySolrRunner$1.lifeCycleStarted Jetty properties: {coreRootDirectory=/usr/home/jenkins/jenkins-slave/workspace/Lucene-Solr-Tests-5.x-Java7/solr/build/solr-core/test/J3/temp/solr.cloud.RecoveryAfterSoftCommitTest 6F561FCF85559A56-001/shard-2-001/cores, hostContext=/h/kg, hostPort=45044, solr.data.dir=/usr/home/jenkins/jenkins-slave/workspace/Lucene-Solr-Tests-5.x-Java7/solr/build/solr-core/test/J3/temp/solr.cloud.RecoveryAfterSoftCommitTest 6F561FCF85559A56-001/tempDir-001/jetty2, solrconfig=solrconfig.xml}
   [junit4]   2> 219549 T322 oass.SolrDispatchFilter.init SolrDispatchFilter.init()sun.misc.Launcher$AppClassLoader@3c56b64c
   [junit4]   2> 219549 T322 oasc.SolrResourceLoader.<init> new SolrResourceLoader for directory: '/usr/home/jenkins/jenkins-slave/workspace/Lucene-Solr-Tests-5.x-Java7/solr/build/solr-core/test/J3/temp/solr.cloud.RecoveryAfterSoftCommitTest 6F561FCF85559A56-001/shard-2-001/'
   [junit4]   2> 219589 T322 oasc.SolrXmlConfig.fromFile Loading container configuration from /usr/home/jenkins/jenkins-slave/workspace/Lucene-Solr-Tests-5.x-Java7/solr/build/solr-core/test/J3/temp/solr.cloud.RecoveryAfterSoftCommitTest 6F561FCF85559A56-001/shard-2-001/solr.xml
   [junit4]   2> 219631 T322 oasc.CorePropertiesLocator.<init> Config-defined core root directory: /usr/home/jenkins/jenkins-slave/workspace/Lucene-Solr-Tests-5.x-Java7/solr/build/solr-core/test/J3/temp/solr.cloud.RecoveryAfterSoftCommitTest 6F561FCF85559A56-001/shard-2-001/cores
   [junit4]   2> 219632 T322 oasc.CoreContainer.<init> New CoreContainer 591304576
   [junit4]   2> 219632 T322 oasc.CoreContainer.load Loading cores into CoreContainer [instanceDir=/usr/home/jenkins/jenkins-slave/workspace/Lucene-Solr-Tests-5.x-Java7/solr/build/solr-core/test/J3/temp/solr.cloud.RecoveryAfterSoftCommitTest 6F561FCF85559A56-001/shard-2-001/]
   [junit4]   2> 219632 T322 oasc.CoreContainer.load loading shared library: /usr/home/jenkins/jenkins-slave/workspace/Lucene-Solr-Tests-5.x-Java7/solr/build/solr-core/test/J3/temp/solr.cloud.RecoveryAfterSoftCommitTest 6F561FCF85559A56-001/shard-2-001/lib
   [junit4]   2> 219633 T322 oasc.SolrResourceLoader.addToClassLoader WARN Can't find (or read) directory to add to classloader: lib (resolved as: /usr/home/jenkins/jenkins-slave/workspace/Lucene-Solr-Tests-5.x-Java7/solr/build/solr-core/test/J3/temp/solr.cloud.RecoveryAfterSoftCommitTest 6F561FCF85559A56-001/shard-2-001/lib).
   [junit4]   2> 219658 T322 oashc.HttpShardHandlerFactory.getParameter Setting socketTimeout to: 90000
   [junit4]   2> 219659 T322 oashc.HttpShardHandlerFactory.getParameter Setting urlScheme to: 
   [junit4]   2> 219660 T322 oashc.HttpShardHandlerFactory.getParameter Setting connTimeout to: 15000
   [junit4]   2> 219660 T322 oashc.HttpShardHandlerFactory.getParameter Setting maxConnectionsPerHost to: 20
   [junit4]   2> 219660 T322 oashc.HttpShardHandlerFactory.getParameter Setting maxConnections to: 10000
   [junit4]   2> 219661 T322 oashc.HttpShardHandlerFactory.getParameter Setting corePoolSize to: 0
   [junit4]   2> 219661 T322 oashc.HttpShardHandlerFactory.getParameter Setting maximumPoolSize to: 2147483647
   [junit4]   2> 219662 T322 oashc.HttpShardHandlerFactory.getParameter Setting maxThreadIdleTime to: 5
   [junit4]   2> 219662 T322 oashc.HttpShardHandlerFactory.getParameter Setting sizeOfQueue to: -1
   [junit4]   2> 219663 T322 oashc.HttpShardHandlerFactory.getParameter Setting fairnessPolicy to: false
   [junit4]   2> 219663 T322 oashc.HttpShardHandlerFactory.getParameter Setting useRetries to: false
   [junit4]   2> 219690 T322 oasu.UpdateShardHandler.<init> Creating UpdateShardHandler HTTP client with params: socketTimeout=340000&connTimeout=45000&retry=true
   [junit4]   2> 219692 T322 oasl.LogWatcher.createWatcher SLF4J impl is org.slf4j.impl.Log4jLoggerFactory
   [junit4]   2> 219692 T322 oasl.LogWatcher.newRegisteredLogWatcher Registering Log Listener [Log4j (org.slf4j.impl.Log4jLoggerFactory)]
   [junit4]   2> 219693 T322 oasc.CoreContainer.load Node Name: 127.0.0.1
   [junit4]   2> 219693 T322 oasc.ZkContainer.initZooKeeper Zookeeper client=127.0.0.1:48644/solr
   [junit4]   2> 219694 T322 oasc.ZkController.checkChrootPath zkHost includes chroot
   [junit4]   2> 219694 T322 oascc.SolrZkClient.createZkCredentialsToAddAutomatically Using default ZkCredentialsProvider
   [junit4]   2> 219695 T322 oascc.ConnectionManager.waitForConnected Waiting for client to connect to ZooKeeper
   [junit4]   2> 219697 T393 oascc.ConnectionManager.process Watcher org.apache.solr.common.cloud.ConnectionManager@5fb8b872 name:ZooKeeperConnection Watcher:127.0.0.1:48644 got event WatchedEvent state:SyncConnected type:None path:null path:null type:None
   [junit4]   2> 219698 T322 oascc.ConnectionManager.waitForConnected Client is connected to ZooKeeper
   [junit4]   2> 219699 T322 oascc.SolrZkClient.createZkACLProvider Using default ZkACLProvider
   [junit4]   2> 219701 T322 oascc.ConnectionManager.waitForConnected Waiting for client to connect to ZooKeeper
   [junit4]   2> 219703 T396 oascc.ConnectionManager.process Watcher org.apache.solr.common.cloud.ConnectionManager@3155d7fc name:ZooKeeperConnection Watcher:127.0.0.1:48644/solr got event WatchedEvent state:SyncConnected type:None path:null path:null type:None
   [junit4]   2> 219703 T322 oascc.ConnectionManager.waitForConnected Client is connected to ZooKeeper
   [junit4]   2> 219709 T322 oascc.ZkStateReader.createClusterStateWatchersAndUpdate Updating cluster state from ZooKeeper... 
   [junit4]   2> 220714 T322 oasc.ZkController.createEphemeralLiveNode Register node as live in ZooKeeper:/live_nodes/127.0.0.1:45044_h%2Fkg
   [junit4]   2> 220715 T322 oascc.SolrZkClient.makePath makePath: /live_nodes/127.0.0.1:45044_h%2Fkg
   [junit4]   2> 220718 T322 oasc.Overseer.close Overseer (id=null) closing
   [junit4]   2> 220721 T322 oasc.CorePropertiesLocator.discover Looking for core definitions underneath /usr/home/jenkins/jenkins-slave/workspace/Lucene-Solr-Tests-5.x-Java7/solr/build/solr-core/test/J3/temp/solr.cloud.RecoveryAfterSoftCommitTest 6F561FCF85559A56-001/shard-2-001/cores
   [junit4]   2> 220724 T322 oasc.CoreDescriptor.<init> CORE DESCRIPTOR: {schema=schema.xml, loadOnStartup=true, transient=false, dataDir=data/, collection=collection1, instanceDir=/usr/home/jenkins/jenkins-slave/workspace/Lucene-Solr-Tests-5.x-Java7/solr/build/solr-core/test/J3/temp/solr.cloud.RecoveryAfterSoftCommitTest 6F561FCF85559A56-001/shard-2-001/cores/collection1, coreNodeName=, shard=, config=solrconfig.xml, name=collection1, absoluteInstDir=/usr/home/jenkins/jenkins-slave/workspace/Lucene-Solr-Tests-5.x-Java7/solr/build/solr-core/test/J3/temp/solr.cloud.RecoveryAfterSoftCommitTest 6F561FCF85559A56-001/shard-2-001/cores/collection1/}
   [junit4]   2> 220725 T322 oasc.CorePropertiesLocator.discoverUnder Found core collection1 in /usr/home/jenkins/jenkins-slave/workspace/Lucene-Solr-Tests-5.x-Java7/solr/build/solr-core/test/J3/temp/solr.cloud.RecoveryAfterSoftCommitTest 6F561FCF85559A56-001/shard-2-001/cores/collection1/
   [junit4]   2> 220726 T322 oasc.CorePropertiesLocator.discover Found 1 core definitions
   [junit4]   2> 220727 T397 C:collection1 c:collection1 oasc.ZkController.publish publishing core=collection1 state=down collection=collection1
   [junit4]   2> 220728 T397 C:collection1 c:collection1 oasc.ZkController.publish numShards not found on descriptor - reading it from system property
   [junit4]   2> 220729 T348 oasc.DistributedQueue$LatchWatcher.process NodeChildrenChanged fired on path /overseer/queue state SyncConnected
   [junit4]   2> 220729 T397 C:collection1 c:collection1 oasc.ZkController.waitForCoreNodeName look for our core node name
   [junit4]   2> 220730 T349 oasc.Overseer$ClusterStateUpdater.run processMessage: queueSize: 1, message = {
   [junit4]   2> 	  "core":"collection1",
   [junit4]   2> 	  "collection":"collection1",
   [junit4]   2> 	  "shard":null,
   [junit4]   2> 	  "state":"down",
   [junit4]   2> 	  "roles":null,
   [junit4]   2> 	  "numShards":"1",
   [junit4]   2> 	  "base_url":"http://127.0.0.1:45044/h/kg",
   [junit4]   2> 	  "node_name":"127.0.0.1:45044_h%2Fkg",
   [junit4]   2> 	  "operation":"state"} current state version: 8
   [junit4]   2> 220730 T349 oasco.ReplicaMutator.updateState Update state numShards=1 message={
   [junit4]   2> 	  "core":"collection1",
   [junit4]   2> 	  "collection":"collection1",
   [junit4]   2> 	  "shard":null,
   [junit4]   2> 	  "state":"down",
   [junit4]   2> 	  "roles":null,
   [junit4]   2> 	  "numShards":"1",
   [junit4]   2> 	  "base_url":"http://127.0.0.1:45044/h/kg",
   [junit4]   2> 	  "node_name":"127.0.0.1:45044_h%2Fkg",
   [junit4]   2> 	  "operation":"state"}
   [junit4]   2> 220731 T349 oasco.ReplicaMutator.updateState Collection already exists with numShards=1
   [junit4]   2> 220731 T349 oasco.ReplicaMutator.updateState Assigning new node to shard shard=shard1
   [junit4]   2> 220732 T396 oascc.ZkStateReader$2.process A cluster state change: WatchedEvent state:SyncConnected type:NodeDataChanged path:/clusterstate.json, has occurred - updating... (live nodes size: 3)
   [junit4]   2> 220732 T348 oascc.ZkStateReader$2.process A cluster state change: WatchedEvent state:SyncConnected type:NodeDataChanged path:/clusterstate.json, has occurred - updating... (live nodes size: 3)
   [junit4]   2> 220732 T375 oascc.ZkStateReader$2.process A cluster state change: WatchedEvent state:SyncConnected type:NodeDataChanged path:/clusterstate.json, has occurred - updating... (live nodes size: 3)
   [junit4]   2> 220732 T360 oascc.ZkStateReader$2.process A cluster state change: WatchedEvent state:SyncConnected type:NodeDataChanged path:/clusterstate.json, has occurred - updating... (live nodes size: 3)
   [junit4]   2> 221730 T397 C:collection1 c:collection1 oasc.ZkController.waitForShardId waiting to find shard id in clusterstate for collection1
   [junit4]   2> 221731 T397 C:collection1 c:collection1 oasc.ZkController.createCollectionZkNode Check for collection zkNode:collection1
   [junit4]   2> 221732 T397 C:collection1 c:collection1 oasc.ZkController.createCollectionZkNode Collection zkNode exists
   [junit4]   2> 221732 T397 C:collection1 c:collection1 oascc.ZkStateReader.readConfigName Load collection config from:/collections/collection1
   [junit4]   2> 221732 T397 C:collection1 c:collection1 oascc.ZkStateReader.readConfigName path=/collections/collection1 configName=conf1 specified config exists in ZooKeeper
   [junit4]   2> 221733 T397 C:collection1 c:collection1 oasc.SolrResourceLoader.<init> new SolrResourceLoader for directory: '/usr/home/jenkins/jenkins-slave/workspace/Lucene-Solr-Tests-5.x-Java7/solr/build/solr-core/test/J3/temp/solr.cloud.RecoveryAfterSoftCommitTest 6F561FCF85559A56-001/shard-2-001/cores/collection1/'
   [junit4]   2> 221747 T397 C:collection1 c:collection1 oasc.ZkController.watchZKConfDir watch zkdir /configs/conf1
   [junit4]   2> 221749 T397 C:collection1 c:collection1 oasc.Config.<init> loaded config solrconfig.xml with version 0 
   [junit4]   2> 221760 T397 C:collection1 c:collection1 oasc.SolrConfig.refreshRequestParams current version of requestparams : -1
   [junit4]   2> 221780 T397 C:collection1 c:collection1 oasc.SolrConfig.<init> Using Lucene MatchVersion: 5.2.0
   [junit4]   2> 221848 T397 C:collection1 c:collection1 oasc.SolrConfig.<init> Loaded SolrConfig: solrconfig.xml
   [junit4]   2> 221849 T397 C:collection1 c:collection1 oass.IndexSchema.readSchema Reading Solr Schema from /configs/conf1/schema.xml
   [junit4]   2> 221869 T397 C:collection1 c:collection1 oass.IndexSchema.readSchema [collection1] Schema name=test
   [junit4]   2> 222316 T397 C:collection1 c:collection1 oass.OpenExchangeRatesOrgProvider.init Initialized with rates=open-exchange-rates.json, refreshInterval=1440.
   [junit4]   2> 222332 T397 C:collection1 c:collection1 oass.IndexSchema.readSchema default search field in schema is text
   [junit4]   2> 222334 T397 C:collection1 c:collection1 oass.IndexSchema.readSchema unique key field: id
   [junit4]   2> 222351 T397 C:collection1 c:collection1 oass.FileExchangeRateProvider.reload Reloading exchange rates from file currency.xml
   [junit4]   2> 222355 T397 C:collection1 c:collection1 oass.FileExchangeRateProvider.reload Reloading exchange rates from file currency.xml
   [junit4]   2> 222360 T397 C:collection1 c:collection1 oass.OpenExchangeRatesOrgProvider.reload Reloading exchange rates from open-exchange-rates.json
   [junit4]   2> 222361 T397 C:collection1 c:collection1 oass.OpenExchangeRatesOrgProvider$OpenExchangeRates.<init> WARN Unknown key IMPORTANT NOTE
   [junit4]   2> 222361 T397 C:collection1 c:collection1 oass.OpenExchangeRatesOrgProvider$OpenExchangeRates.<init> WARN Expected key, got STRING
   [junit4]   2> 222362 T397 C:collection1 c:collection1 oass.OpenExchangeRatesOrgProvider.reload Reloading exchange rates from open-exchange-rates.json
   [junit4]   2> 222362 T397 C:collection1 c:collection1 oass.OpenExchangeRatesOrgProvider$OpenExchangeRates.<init> WARN Unknown key IMPORTANT NOTE
   [junit4]   2> 222363 T397 C:collection1 c:collection1 oass.OpenExchangeRatesOrgProvider$OpenExchangeRates.<init> WARN Expected key, got STRING
   [junit4]   2> 222363 T397 C:collection1 c:collection1 oasc.CoreContainer.create Creating SolrCore 'collection1' using configuration from collection collection1
   [junit4]   2> 222363 T397 C:collection1 c:collection1 oasc.SolrCore.initDirectoryFactory org.apache.solr.core.MockDirectoryFactory
   [junit4]   2> 222364 T397 C:collection1 c:collection1 oasc.SolrCore.<init> [collection1] Opening new SolrCore at /usr/home/jenkins/jenkins-slave/workspace/Lucene-Solr-Tests-5.x-Java7/solr/build/solr-core/test/J3/temp/solr.cloud.RecoveryAfterSoftCommitTest 6F561FCF85559A56-001/sh

[...truncated too long message...]

tate.closeIndexWriter SolrCoreState ref count has reached 0 - closing IndexWriter
   [junit4]   2> 348207 T441 oasu.DefaultSolrCoreState.closeIndexWriter closing IndexWriter with IndexWriterCloser
   [junit4]   2> 348211 T441 oasc.SolrCore.closeSearcher [collection1] Closing main searcher on request.
   [junit4]   2> 348240 T441 oasc.CachingDirectoryFactory.close Closing MockDirectoryFactory - 2 directories currently being tracked
   [junit4]   2> 348240 T441 oasc.CachingDirectoryFactory.closeCacheValue looking to close /usr/home/jenkins/jenkins-slave/workspace/Lucene-Solr-Tests-5.x-Java7/solr/build/solr-core/test/J3/temp/solr.cloud.RecoveryAfterSoftCommitTest 6F561FCF85559A56-001/shard-2-001/cores/collection1/data/index.20150409122150355 [CachedDir<<refCount=0;path=/usr/home/jenkins/jenkins-slave/workspace/Lucene-Solr-Tests-5.x-Java7/solr/build/solr-core/test/J3/temp/solr.cloud.RecoveryAfterSoftCommitTest 6F561FCF85559A56-001/shard-2-001/cores/collection1/data/index.20150409122150355;done=false>>]
   [junit4]   2> 348241 T441 oasc.CachingDirectoryFactory.close Closing directory: /usr/home/jenkins/jenkins-slave/workspace/Lucene-Solr-Tests-5.x-Java7/solr/build/solr-core/test/J3/temp/solr.cloud.RecoveryAfterSoftCommitTest 6F561FCF85559A56-001/shard-2-001/cores/collection1/data/index.20150409122150355
   [junit4]   2> 348241 T441 oasc.CachingDirectoryFactory.closeCacheValue looking to close /usr/home/jenkins/jenkins-slave/workspace/Lucene-Solr-Tests-5.x-Java7/solr/build/solr-core/test/J3/temp/solr.cloud.RecoveryAfterSoftCommitTest 6F561FCF85559A56-001/shard-2-001/cores/collection1/data [CachedDir<<refCount=0;path=/usr/home/jenkins/jenkins-slave/workspace/Lucene-Solr-Tests-5.x-Java7/solr/build/solr-core/test/J3/temp/solr.cloud.RecoveryAfterSoftCommitTest 6F561FCF85559A56-001/shard-2-001/cores/collection1/data;done=false>>]
   [junit4]   2> 348242 T441 oasc.CachingDirectoryFactory.close Closing directory: /usr/home/jenkins/jenkins-slave/workspace/Lucene-Solr-Tests-5.x-Java7/solr/build/solr-core/test/J3/temp/solr.cloud.RecoveryAfterSoftCommitTest 6F561FCF85559A56-001/shard-2-001/cores/collection1/data
   [junit4]   2> 348905 T442 oascc.ZkStateReader$3.process WARN ZooKeeper watch triggered, but Solr cannot talk to ZK
   [junit4]   2> 348908 T322 C:control_collection S:shard1 c:collection1 oejsh.ContextHandler.doStop stopped o.e.j.s.ServletContextHandler{/h/kg,null}
   [junit4]   2> 349022 T322 C:control_collection S:shard1 c:collection1 oasc.ZkTestServer.send4LetterWord connecting to 127.0.0.1:48644 48644
   [junit4]   2> 349180 T323 oasc.ZkTestServer.send4LetterWord connecting to 127.0.0.1:48644 48644
   [junit4]   2> 349181 T323 oasc.ZkTestServer$ZKServerMain.runFromConfig WARN Watch limit violations: 
   [junit4]   2> 	Maximum concurrent create/delete watches above limit:
   [junit4]   2> 	
   [junit4]   2> 		4	/solr/aliases.json
   [junit4]   2> 		4	/solr/clusterstate.json
   [junit4]   2> 		3	/solr/configs/conf1
   [junit4]   2> 	
   [junit4]   2> 	Maximum concurrent children watches above limit:
   [junit4]   2> 	
   [junit4]   2> 		4	/solr/live_nodes
   [junit4]   2> 		3	/solr/overseer/queue
   [junit4]   2> 		3	/solr/overseer/collection-queue-work
   [junit4]   2> 	
   [junit4]   2> 349182 T322 C:control_collection S:shard1 c:collection1 oasc.SocketProxy.close WARN Closing 6 connections to: http://127.0.0.1:30988/h/kg, target: http://127.0.0.1:33918/h/kg
   [junit4]   2> 349182 T322 C:control_collection S:shard1 c:collection1 oasc.SocketProxy.close WARN Closing 0 connections to: http://127.0.0.1:57657/h/kg, target: http://127.0.0.1:58650/h/kg
   [junit4]   2> 349182 T322 C:control_collection S:shard1 c:collection1 oasc.SocketProxy.close WARN Closing 1 connections to: http://127.0.0.1:45044/h/kg, target: http://127.0.0.1:39770/h/kg
   [junit4]   2> NOTE: reproduce with: ant test  -Dtestcase=RecoveryAfterSoftCommitTest -Dtests.method=test -Dtests.seed=6F561FCF85559A56 -Dtests.multiplier=2 -Dtests.slow=true -Dtests.locale=pt_PT -Dtests.timezone=Asia/Ulaanbaatar -Dtests.asserts=true -Dtests.file.encoding=UTF-8
   [junit4] FAILURE  141s J3 | RecoveryAfterSoftCommitTest.test <<<
   [junit4]    > Throwable #1: java.lang.AssertionError: Didn't see all replicas for shard shard1 in collection1 come up within 30000 ms! ClusterState: {
   [junit4]    >   "collection1":{
   [junit4]    >     "shards":{"shard1":{
   [junit4]    >         "range":"80000000-7fffffff",
   [junit4]    >         "state":"active",
   [junit4]    >         "replicas":{
   [junit4]    >           "core_node1":{
   [junit4]    >             "core":"collection1",
   [junit4]    >             "state":"active",
   [junit4]    >             "base_url":"http://127.0.0.1:30988/h/kg",
   [junit4]    >             "node_name":"127.0.0.1:30988_h%2Fkg",
   [junit4]    >             "leader":"true"},
   [junit4]    >           "core_node2":{
   [junit4]    >             "core":"collection1",
   [junit4]    >             "state":"recovering",
   [junit4]    >             "base_url":"http://127.0.0.1:45044/h/kg",
   [junit4]    >             "node_name":"127.0.0.1:45044_h%2Fkg"}}}},
   [junit4]    >     "maxShardsPerNode":"1",
   [junit4]    >     "autoAddReplicas":"false",
   [junit4]    >     "replicationFactor":"1",
   [junit4]    >     "autoCreated":"true",
   [junit4]    >     "router":{"name":"compositeId"}},
   [junit4]    >   "control_collection":{
   [junit4]    >     "shards":{"shard1":{
   [junit4]    >         "range":"80000000-7fffffff",
   [junit4]    >         "state":"active",
   [junit4]    >         "replicas":{"core_node1":{
   [junit4]    >             "core":"collection1",
   [junit4]    >             "state":"active",
   [junit4]    >             "base_url":"http://127.0.0.1:57657/h/kg",
   [junit4]    >             "node_name":"127.0.0.1:57657_h%2Fkg",
   [junit4]    >             "leader":"true"}}}},
   [junit4]    >     "maxShardsPerNode":"1",
   [junit4]    >     "autoAddReplicas":"false",
   [junit4]    >     "replicationFactor":"1",
   [junit4]    >     "autoCreated":"true",
   [junit4]    >     "router":{"name":"compositeId"}}}
   [junit4]    > 	at __randomizedtesting.SeedInfo.seed([6F561FCF85559A56:E70220152BA9F7AE]:0)
   [junit4]    > 	at org.apache.solr.cloud.AbstractFullDistribZkTestBase.ensureAllReplicasAreActive(AbstractFullDistribZkTestBase.java:1920)
   [junit4]    > 	at org.apache.solr.cloud.RecoveryAfterSoftCommitTest.test(RecoveryAfterSoftCommitTest.java:102)
   [junit4]    > 	at org.apache.solr.BaseDistributedSearchTestCase$ShardsRepeatRule$ShardsFixedStatement.callStatement(BaseDistributedSearchTestCase.java:960)
   [junit4]    > 	at org.apache.solr.BaseDistributedSearchTestCase$ShardsRepeatRule$ShardsStatement.evaluate(BaseDistributedSearchTestCase.java:935)
   [junit4]    > 	at java.lang.Thread.run(Thread.java:745)
   [junit4]   2> 349231 T322 C:control_collection S:shard1 c:collection1 oas.SolrTestCaseJ4.deleteCore ###deleteCore
   [junit4]   2> NOTE: leaving temporary files on disk at: /usr/home/jenkins/jenkins-slave/workspace/Lucene-Solr-Tests-5.x-Java7/solr/build/solr-core/test/J3/temp/solr.cloud.RecoveryAfterSoftCommitTest 6F561FCF85559A56-001
   [junit4]   2> 141056 T321 ccr.ThreadLeakControl.checkThreadLeaks WARNING Will linger awaiting termination of 1 leaked thread(s).
   [junit4]   2> NOTE: test params are: codec=Asserting(Lucene50): {timestamp=PostingsFormat(name=Asserting), range_facet_l=PostingsFormat(name=Asserting), a_t=PostingsFormat(name=Asserting), text=Lucene50(blocksize=128), id=PostingsFormat(name=Direct), multiDefault=PostingsFormat(name=Asserting), intDefault=TestBloomFilteredLucenePostings(BloomFilteringPostingsFormat(Lucene50(blocksize=128))), _version_=TestBloomFilteredLucenePostings(BloomFilteringPostingsFormat(Lucene50(blocksize=128)))}, docValues:{timestamp=DocValuesFormat(name=Asserting)}, sim=RandomSimilarityProvider(queryNorm=false,coord=no): {}, locale=pt_PT, timezone=Asia/Ulaanbaatar
   [junit4]   2> NOTE: FreeBSD 9.1-RELEASE-p3 amd64/Oracle Corporation 1.7.0_65 (64-bit)/cpus=16,threads=1,free=103305600,total=232783872
   [junit4]   2> NOTE: All tests run in this JVM: [TestAnalyzeInfixSuggestions, TestElisionMultitermQuery, TestCustomSort, LeaderInitiatedRecoveryOnCommitTest, RecoveryAfterSoftCommitTest]
   [junit4] Completed on J3 in 141.37s, 1 test, 1 failure <<< FAILURES!

[...truncated 1372 lines...]
BUILD FAILED
/usr/home/jenkins/jenkins-slave/workspace/Lucene-Solr-Tests-5.x-Java7/build.xml:529: The following error occurred while executing this line:
/usr/home/jenkins/jenkins-slave/workspace/Lucene-Solr-Tests-5.x-Java7/build.xml:477: The following error occurred while executing this line:
/usr/home/jenkins/jenkins-slave/workspace/Lucene-Solr-Tests-5.x-Java7/build.xml:61: The following error occurred while executing this line:
/usr/home/jenkins/jenkins-slave/workspace/Lucene-Solr-Tests-5.x-Java7/extra-targets.xml:39: The following error occurred while executing this line:
/usr/home/jenkins/jenkins-slave/workspace/Lucene-Solr-Tests-5.x-Java7/solr/build.xml:191: The following error occurred while executing this line:
/usr/home/jenkins/jenkins-slave/workspace/Lucene-Solr-Tests-5.x-Java7/solr/common-build.xml:509: The following error occurred while executing this line:
/usr/home/jenkins/jenkins-slave/workspace/Lucene-Solr-Tests-5.x-Java7/lucene/common-build.xml:1370: The following error occurred while executing this line:
/usr/home/jenkins/jenkins-slave/workspace/Lucene-Solr-Tests-5.x-Java7/lucene/common-build.xml:976: There were test failures: 480 suites, 1910 tests, 1 failure, 62 ignored (22 assumptions)

Total time: 58 minutes 50 seconds
Build step 'Invoke Ant' marked build as failure
Archiving artifacts
Sending artifact delta relative to Lucene-Solr-Tests-5.x-Java7 #2431
Archived 5 artifacts
Archive block size is 32768
Received 0 blocks and 211615867 bytes
Compression is 0.0%
Took 44 sec
Recording test results
Email was triggered for: Failure
Sending email for trigger: Failure



Mime
View raw message